##TITLE=$$ Begin of the data block
##JCAMP-DX=5.00 $$ ACD/SpecManager v 10.08
##SPECTROMETER/DATA SYSTEM=Varian
##DATE=14 Jan 2013 10:50:24
##DATA TYPE=INFRARED SPECTRUM
##DATA CLASS=XYDATA
##ORIGIN=
##OWNER=
##NPOINTS=3735
##FIRSTX=399.26403809
##LASTX=4000.35498047
##MAXX=4000.35498047
##MINX=399.26403809
##MAXY=67.34896088
##MINY=18.53345871
##XFACTOR=1.0000000000
##YFACTOR=0.000000100000000
##FIRSTY=42.18894577
##DELTAX=0.96440572
##XUNITS=1/CM
##YUNITS=TRANSMITTANCE
##XYDATA=(X++(Y..Y))
399.3D21889458R086914j8678627j5329018J302338O433410q6212m726524J22871j6784
$$ 421889458 430976372 412297745 396968727 398271065 404704475 404618263 399891739 400014610 399997826
407.9C99997826m037896l646240N057030M529343n949707k806054L199883K439995
$$ 399997826 395959930 392313690 397370720 401900063 395950356 393144302 396344185 398784180
415.7C98784180J523475Q02460N26695L822708J809655l899155r201202n304642J546554
$$ 398784180 400307655 401110115 401636810 405459518 407269173 403370018 394168816 388864174 390410728
424.3C90410728k936630N716438R491692l539734q899307j313057M675636J340828
$$ 390410728 387474098 393190536 402682228 399142494 390243187 388930130 393605766 394946594
432.1C94946594o6757J725731l96805k301407k882690k854271j876564J327171J063538
$$ 394946594 394879837 396605568 396208763 393907356 391024666 388170395 386293831 387621002 388684540
440.7C88684540M40330J451454q24508J30348o22253J143035J646195k104836J286622
$$ 388684540 389124870 390576324 389751816 389882164 389259911 390402946 392049141 389944305 391230927
449.4C91230927p7134j332130j704979k140007N623512Q95920m000893k764434m072609
$$ 391230927 391153793 389821663 388116684 385976677 391600189 392496109 388495216 385730782 381658173
458.1C81658173K736053R21059J325454J882210m47464j195946l696022k156295k261162
$$ 381658173 384394226 385315285 386640739 388522949 388075485 386879539 383183517 381027222 378766060
466.8C78766060J582451M467010m15191J892738K612572J705665m0054k747421l344460
$$ 378766060 380348511 384815521 384400330 386293068 388905640 390611305 390571251 387823830 384479370
475.5C84479370l647919n09719n85823j496544J39045j76887k650414j539535L602752
$$ 384479370 380831451 380321732 379735909 378239365 378378410 378201523 375551109 374011574 377614326
484.1C77614326J925736o9656k7276j566848m45977q67576k154694k083244N73349
$$ 377614326 379540062 379470406 379443130 377876282 377430305 376562729 374408035 372324791 372898140
492.8C72898140R39178k831153n42145K179069k73742O72721K947617O84509m667396
$$ 372898140 373837318 371006165 370464020 372643089 372369347 373042068 375989685 376674194 372006798
501.5C72006798l373375K440300J287689k02217k356491M36668K678337j278991j355477
$$ 372006798 368633423 371073723 372361412 372159195 369802704 370239372 372917709 371638718 370283241
510.2C70283241j487007l81622K1858k384338j350594j823463j127930J489830Q78105
$$ 370283241 368796234 368414612 368436470 366052132 364701538 362878075 361750145 363239975 364118080
518.9C64118080m42352o45294k76070j578598j568604r83047J282616K992286j289558
$$ 364118080 363675728 363030434 362754364 361175766 359607162 358624115 359906731 362899017 361609459
527.5C61609459k818222j392555M51431Q41560k66952l6202Q12798R68475m46205k486687
$$ 361609459 358791237 357398682 357850113 358691673 358424721 358388519 359201317 360169792 359723587 357236900
537.2C57236900j709022K93197m12674j165618N21125L50075o96068O78635P99141
$$ 357236900 355527878 355821075 355408401 354242783 354763908 355113983 354417915 355096550 355895691
545.9C55895691m61502j814461k727699q01850n13954q05092J065064K25334J85242
$$ 355895691 355434189 353619728 350892029 350090179 349576225 348771133 349836197 350061531 350246773
554.5C50246773J376495j199036k638130j328964j514358k24190J035309j184731q06541
$$ 350246773 351623268 350424232 347786102 346457138 344942780 344718590 345753899 344569168 343762627
563.2C43762627J359977K284775J116867r42344m45176R3308r3994l14980j362724
$$ 343762627 345122604 347407379 348524246 347581902 347136726 347230034 347136040 346821060 345458336
571.9C45458336m76570J384468O97975K12708k30675j890793r38988R98421N83801
$$ 345458336 344981766 346366234 347064209 347276917 347046242 345155449 344216461 345214882 345798683
580.6C45798683j305923l48053J431846J249314M73098r39941j4915J032562L41568
$$ 345798683 344492760 344144707 345576553 346825867 347298965 346359024 346344109 347376671 347718239
589.3C47718239j329498k012711M65736J006928J766586J134033j89476M63143j299095
$$ 347718239 346388741 344376030 344841766 345848694 347615280 348749313 348559837 349022980 347723885
597.9C47723885J25389O92291j166878Q9035K48566k23312n65415m02183p60346j669159
$$ 347723885 347849274 348541565 347374687 347463722 347712288 347488976 346923561 346521378 345761032 344091873
607.6C44091873j619263r13887N79110O85234J63955m75158P8125O43120r05152j188774
$$ 344091873 342472610 341558723 342137833 342823067 342987022 342511864 342589989 343233109 342327957 341139183
617.2C41139183r75342l82156P99484Q74329Q6593M24843K015724J583558O93321R17892
$$ 341139183 340163841 339781685 340581169 341455498 341542091 341966934 343982658 345566216 346259537 347177429
626.9C47177429M34990J102600J092644L49884K230301K195854M56696J176300J588669
$$ 347177429 347612419 348715019 349807663 350157547 352387848 354583702 355040398 356216698 357805367
635.5C57805367J07460k2049J412506J619682J501236J451073J120720J044197J407356
$$ 357805367 357912827 357890778 359303284 360922966 362424202 363875275 364995995 366040192 367447548
644.2C67447548J320152N59731J210212J111756N569J20430P09458J70250J72081J590271
$$ 367447548 368767700 369327431 370537643 371649399 371654968 371775398 372484856 372655106 372827187 374417458
653.9C74417458J198616P06291j93558j628189j171455M1694J178932Q69980j57127
$$ 374417458 375616074 376322365 376128807 374500618 373329163 373370857 374549789 375419769 375262642
662.5C75262642o45447k47574J97335N59387J813774k00768j086120J18217L34587
$$ 375262642 374617195 374369621 374566956 375126343 376940117 376739349 375653229 375771446 376106033
671.2C76106033J320191L58124Q21876J520577N49812J033745J221199J071739P84302
$$ 376106033 377426224 377784348 378606224 380126801 380676613 381710358 382931557 384003296 384787598
679.9C84787598N65796J385612J788940J605912J092033P89452K98538L51601J160354
$$ 384787598 385353394 386739006 388527946 390133858 391225891 392015343 392313881 392665482 393825836
688.6C93825836K33498M43268R96551K35558O54335O33735P09534Q67615P70531P21511
$$ 393825836 394059334 394502602 395499153 395734711 396389046 397022781 397732315 398599930 399370461 400091972
698.2D00091972O42586M17633r19914J53007J806107J488266O24657N17997J866265
$$ 400091972 400734558 401152191 400232277 400385284 402191391 403679657 404304314 404822311 406688576
706.9D06688576R88083k57340l0975Q33320J380196O42662N17120L21541J67313K33803
$$ 406688576 407676659 407419319 407388344 408221664 409601860 410244522 410761642 411083183 411250496 411484299
716.6D11484299J221389J443444N33333M25491o0959O75964N65300P8202O12945R22852
$$ 411484299 412705688 414149132 414682465 415107956 415046997 415722961 416288261 416366463 416979408 417902260
726.2D17902260J014252O14471J186562R75151J257286J537666M98924L166J38398
$$ 417902260 418916512 419530983 420717545 421692696 422949982 424487648 424986572 424989738 425128136
734.9D25128136P90558m3145P62711J568184P68051R9411r92470M90608J550026Q89817
$$ 425128136 425918694 425875549 426638260 428206444 428974495 429073906 428081436 428572044 430122070 431011887
744.5D31011887K86293O82258J164055J007576O63185q8348J497497O42434o00090
$$ 431011887 431298180 431980438 433144493 434152069 434815254 434726906 436224403 436866837 436266747
753.2D36266747P31163L22074M06914P20940J647072J630859Q61359J096992R14879
$$ 436266747 436997910 437319984 437726898 438447838 440094910 441725769 442587128 443684120 444598999
761.9D44598999J043968M01306J93634J258736J657219M12636P4920O21987N58815
$$ 444598999 445642967 446044273 446237907 447496643 449153862 449566498 449641418 450263405 450822220
770.6D50822220j21689j050873Q126K62527P08961Q70209j96762k94647m91486L43285
$$ 450822220 450700531 449649658 449657784 449920311 450629272 451499481 451302719 451008072 450516586 450859871
780.2D50859871K21481N79834O31142L07693J004143K14272O74629L68538K96516M45175
$$ 450859871 451081352 451661186 452292328 452600021 453604164 453818436 454493065 454861603 455158119 455603294
789.9D55603294l53927n12619l54195P04956m83131n38063K23770K03171N24330p61338
$$ 455603294 455249367 454736748 454382553 455087509 454604378 454066315 454290085 454493256 455017586 454256248
799.5D54256248j114807r05227n41344j273079j370277j022797j977196r62982m70352
$$ 454256248 453141441 452236214 451694870 450421791 449051514 448028717 446051521 445088539 444618187
808.2D44618187j419220k347870k033424j317253j403237j511268j251259J57013K12211
$$ 444618187 443198967 440851097 438817673 437500420 436097183 434585915 433334656 433491669 433703880
816.9D33703880k77290K8610o4125l22952k15302O38275R32580J688118K896080L261146
$$ 433703880 433426590 433455200 433391075 433068123 432852821 433491096 434423676 436111794 439007874 442269020
826.5D42269020K420998J852836K780686K863846K284202K408333L172111K122727
$$ 442269020 444690018 446542854 449323540 452187386 454471588 456879921 460052032 462174759
834.2D62174759K031135K764740K172509L013153K450981J445389P18383R85375J109123
$$ 462174759 464205894 466970634 469143143 472156296 474607277 476052666 476771049 477756424 478865547
842.9D78865547J217499K316780J719933K247200O67228N32608J533661J16539Q98819
$$ 478865547 480083046 482399826 484119759 486366959 487034187 487566795 489100456 489216995 490115814
851.6D90115814R38759O34422K66610J686477K254372J813278K244988J116943J823921
$$ 490115814 491054573 491688995 491955605 493642082 495896454 497709732 499954720 501071663 502895584
860.3E02895584N66559L03612Q41903n188L20053l26728j45073L1204L05595j384391
$$ 502895584 503462143 503765755 504607658 504602470 504922523 504595795 504450722 504481926 504787521 503403130
869.9E03403130k069092j456833j477471p15751j876068j160393q70171o60591l72085
$$ 503403130 501334038 499877205 498399734 497683983 495807915 494647522 493777351 493116760 492744675
878.6D92744675q81462K69813q17795j711769j273536J73950k77214j539460q06160
$$ 492744675 491863213 492133026 491315231 489603462 488329926 488503876 488226662 486687202 485881042
887.3D85881042j098747q24165n67780K19727n8098m06227M18854M07028M73137l71628
$$ 485881042 484782295 483958130 483390350 483610077 483551979 483145752 483564606 483971634 484444771 484073143
896.9D84073143J17455N42106J15051m09545k92054m38804q83293J428833J830139
$$ 484073143 484190598 484732704 484847755 484438210 484146156 483707352 482824059 484252892 486083031
905.6D86083031K372780K610511J709214K160224J275712P95669l48663k09732k57988
$$ 486083031 488455811 491066322 492775536 494935760 496211472 497007141 496658478 496448746 496190758
914.3D96190758q62351q83827j439400j148948k372437k424469k637329k795868k373848
$$ 496190758 495328407 494444580 493005180 491856232 489483795 487059326 484421997 481626129 479252281
922.9D79252281k544746j984787k937355l139992k956810k548599k678185k888183
$$ 479252281 476707535 474722748 471785393 468645401 465688591 463139992 460461807 457573624
930.7D57573624k159882k150536j255531j638794j554413j150093j270675r03511j653557
$$ 457573624 455413742 453263206 452007675 450368881 448814468 447664375 446393700 445490189 443836632
939.3D43836632r79958j005363r96743n39131j750717j795616j033287o87676q45413
$$ 443836632 442856674 441851311 440854568 440315437 438564720 436769104 435735817 435048141 434202728
948D34202728o20613n09758o21834N1957L04527j171990j858024o96526j473198k072601
$$ 434202728 433582115 433072357 432450523 432502480 432807007 431635017 429776993 429080467 427607269 425534668
957.7D25534668k369156k911339j929245j323356j386452k375031k095069j366120
$$ 425534668 423165512 420254173 418324928 417001572 415615120 413240089 411145020 409778900
965.4D09778900j963043j364288j572342k651024j901474j476708k608871k877236
$$ 409778900 407815857 406451569 404879227 402228203 400326729 398850021 396241150 393363914
973.1C93363914k721405k822723k849235l657876m076232l522454l576965m423790
$$ 393363914 390642509 387819786 384970551 381312675 377236443 373713989 370137024 365713234
980.8C65713234m600563m449577m830780m941369m296455m116135l980903l567963
$$ 365713234 361112671 356663094 351832314 346890945 342594490 338478355 334497452 330929489
988.5C30929489l628235l916244l835106k942143k928161l077450l220959k779579
$$ 330929489 327301254 323385010 319549904 316607761 313679600 310602150 307381191 304601612
996.2C04601612k010479k792683k860107k604313k243385k664185l078937k523346
$$ 304601612 302591133 299798450 296938343 294334030 292090645 289426460 286347523 283824177
1004B83824177k568951k222652k019730j857986k171402j287079q83713j919289k242775
$$ 283824177 281255226 279032574 277012844 275154858 272983456 271696377 270812664 268893375 266650600
1012.6B66650600k150859o35739j725712k873344k014503j212616j569825l078975
$$ 266650600 264499741 263864002 262138290 259264946 257250443 256037827 254468002 251389027
1020.3B51389027j670857j397991j646118j791115k149906j699734j736641r42325
$$ 251389027 249718170 248320179 246674061 244882946 242733040 241033306 239296665 238354340
1028.1B38354340j522198j193257j237449q69999m60205p20501P06005m32148K44560
$$ 238354340 236832142 235638885 234401436 233531437 233071232 232350731 233056736 232624588 232869148
1036.7B32869148J222668J010761J415348J953259J922760K91405J041316O05679J85909
$$ 232869148 234091816 235102577 236517925 238471184 240393944 240685349 241726665 242332344 242518253
1045.4B42518253K60926m70543m38271r07173r49307j751995q11557m57859l62740
$$ 242518253 242779179 242308636 241870365 240963192 240013885 238261890 237450333 236992474 236629734
1054.1B36629734k15130j172199o35128j325684j34525P41520P76768R67312J475162
$$ 236629734 236414604 235242405 234607277 233281593 233147068 233888588 234665356 235632668 237107830
1062.8B37107830J986866R56326K074298J181488Q73318J207676Q93841P40318k12135
$$ 237107830 239094696 240051022 242125320 243306808 244180126 245387802 246281643 247021961 246809826
1071.5B46809826J190033Q58059O14242J46866l89194J64928N19047J026688l91407
$$ 246809826 247999859 248857918 249472160 249619026 249229832 249394760 249913807 250940495 250549088
1080.1B50549088L17058Q51917J302758J177368O65722J396732N11894J215248J097527
$$ 250549088 250866146 251718063 253020821 254198189 254863911 256260643 256772537 257987785 259085312
1088.8B59085312J629238J949062J914807J878471M11511J431522J518173J788731
$$ 259085312 260714550 262663612 264578419 266456890 266868401 268299923 269818096 271606827
1096.5B71606827O59237J16024J557865R05514J241760J279049J779804J666527J563968
$$ 271606827 272266064 272382088 273939953 274845467 276087227 277366276 279146080 280812607 282376575
1105.2B82376575J256962L96958R19895M81930N66196L07846R16310J389770J198025
$$ 282376575 283633537 284030495 284950390 285432320 285998516 286306362 287222672 288612442 289810467
1113.9B89810467J385269N78594O74362O43521Q00476m84772o86359O2561m1275J087551
$$ 289810467 291195736 291774330 292448692 293092213 293892689 293407917 292721558 292784119 292742844 293830395
1123.5B93830395O8111M14581Q64907P93113J029301L81241J628056J768951J955166
$$ 293830395 293898506 294313087 295177994 295971107 297000408 297381649 299009705 300778656 302733822
1132.2C02733822K195701K309685J847134J277962K414894K082348J681385J272354
$$ 302733822 304929523 307239208 309086342 310364304 312779198 314861546 316542931 317815285
1139.9C17815285J372623J569424P20482J029739J379089P97883j30005Q7890P15828
$$ 317815285 319187908 320757332 321477814 322507553 323886642 324684525 324554520 324642410 325358238
1148.6C25358238P81708J73912k80228O62308P71370K68822l41988q93631o39152o42281
$$ 325358238 326139946 326313858 326033630 326695938 327467308 327736130 327394142 326500511 325861359 325219078
1158.3C25219078p82356l75824k86827TJ054268R36431K91481J113205J396027J764832
$$ 325219078 324436722 324060898 323774071 323487244 324541512 325477943 325769424 326882629 328278656 330043488
1167.9C30043488K450027K714958K338410K909088L195457K722550K561187K763558
$$ 330043488 332493515 335208473 337546883 340455971 343651428 346373978 348935165 351698723
1175.6C51698723L369064K829018K046432K112999K666741K330398K124977K218819
$$ 351698723 355067787 357896805 359943237 362056236 364722977 367053375 369178352 371397171
1183.3C71397171J850815J760940J592026J403923P41463J053276Q75473K47536O60515
$$ 371397171 373247986 375008926 376600952 378004875 378746338 379799614 380675087 380922623 381583138
1192C81583138J13639n92727n77660l86200j103401j153030p65343j126328q89740
$$ 381583138 381696777 381104050 380526390 380140190 379036789 377883759 377118416 375992088 375102348
1200.7C75102348r86633q94966p90939j205063j195450j172753j407012j182709l72009
$$ 375102348 374115715 373220749 372429810 371224747 370029297 368856544 367449532 366266823 365894814
1209.4C65894814l90282k52533j79329p36504k30903k91939q89511p80144m12483n41916
$$ 365894814 365504532 365251999 365072670 364336166 364105263 363813324 362923813 362143669 361731186 361189270
1219C61189270n30777k18658n28565j92795m80194p82585n13649j057129q21571o84509
$$ 361189270 360658493 360439835 359911270 359718475 359238281 358455696 357942047 356884918 356063347 355378838
1228.6C55378838p55043r47991q62198k08015n03235m46434m12941n53017o37474l13339
$$ 355378838 354623795 353675804 352813606 352605591 352102356 351655922 351242981 350689964 350052490 349739151
1238.3C49739151L09677j79329l57704k79427L0594K77481k4375k67945m63257m72526
$$ 349739151 350048828 349869499 349511795 349232368 349262962 349540443 349516068 349248123 348784866 348312340
1247.9C48312340o98548m48646l44734k36779K99569J27410o5231l56788n50690j79100
$$ 348312340 347613792 347165146 346820412 346583633 346883202 347010612 346945381 346588593 346037903 345858803
1257.6C45858803L10821J98784q278J20621K19917K49062J88141N82161M92744O81572
$$ 345858803 346169624 346368408 346360130 346480751 346700668 346949730 347137871 347720032 348212776 348894348
1267.2C48894348P41539M27704Q77495R16977J149521R97810R57336J167107J068230
$$ 348894348 349635887 350063591 350941086 351858063 353007584 354005394 354962730 356129837 357198067
1275.9C57198067Q98704Q87261J415863Q28476O56929J243019J473083J413536J278496
$$ 357198067 358096771 358984032 360399895 361228371 361885300 363128319 364601402 366014938 367293434
1284.6C67293434J470146J257248J463776J265449R62601J058998J008988J202888
$$ 367293434 368763580 370020828 371484604 372750053 373712654 374771652 375780640 376983528
1292.3C76983528J245957R74693N82313O14815M55132P57713R86595L60375J80816
$$ 376983528 378229485 379204178 379786491 380401306 380856438 381614151 382600746 382961121 383141937
1301C83141937M01573N51682L53928L6773l40347p7972j84784n42107o3248L5591k57606
$$ 383141937 383543510 384095192 384449120 384485893 384145546 384067574 383882790 383340683 383277435 383313026 383055420
1311.6C83055420j022568j059151m99687j65939J65253K32238K83928o294N51415J065826
$$ 383055420 382032852 380973701 380474014 380308075 380473328 380705566 380989494 380983200 381534615 382600441
1321.2C82600441Q76923P62901P70149R60426L77923J76658L1243o1074j22375n46990
$$ 382600441 383477364 384240265 385010414 385970840 386348763 386525421 386556664 386495590 386373215 385826225
1330.9C85826225m00924l06817k33192l43704l19596n00068k77023O08520L38440j29471
$$ 385826225 385425301 385118484 384885292 384541588 384221992 383721924 383444901 384053421 384391861 384262390
1340.5C84262390J869O69327Q75511Q25653Q32558L44505M81835K91557N1422M2877
$$ 384262390 384264259 384933586 385809097 386634750 387467308 387811813 388293648 388585205 388636627 388679504
1350.2C88679504K98157j38664n62744j06392n98183m06494J72615K0447p05414k51007
$$ 388679504 388977661 388838997 388276253 388169861 387571678 387165184 387337799 387358246 386652832 386401825
1359.8C86401825k27928r37462J76201r82743m66537J6174n85708L4561o41556q75473
$$ 386401825 386173897 385236435 385412636 384429893 383963356 383979530 383393822 383428383 382786827 381911354
1369.4C81911354n94063k27318N2414p9574M58j55793K14806J29204J07383m98886
$$ 381911354 381317291 381089973 381142387 381062813 381063271 380907478 381122284 381251488 381358871 380859985
1379.1C80859985m02794n11665j035042j093826j728172p71370p7019m63791j944198
$$ 380859985 380457191 379945526 378910484 377816658 376088486 375317116 375240097 374776306 372832108
1387.8C72832108j333619o66122j943970j737213j491012p22962j656952l586769j388588
$$ 372832108 371498489 370832367 368888397 367151184 365660172 364937210 363280258 359693489 358304901
1396.4C58304901j021347j301041l694381k905884j379395j808242j288033j593742
$$ 358304901 357283554 355982513 352288132 349382248 348002853 346194611 344906578 343312836
1404.2C43312836k623787k471237j355172j287384j572914j282234j582146j692352
$$ 343312836 340689049 338217812 336862640 335575256 334002342 332720108 331137962 329445610
1411.9C29445610j727486r35134n57595o14586j76239k37083R46045k438889j645355
$$ 329445610 327718124 326782990 326225395 325610809 325434570 325197487 326143532 323704643 322059288
1420.6C22059288Q56247J21231O31638j030045L72810J200180M23852J385040Q07609
$$ 322059288 322915535 323036766 323668404 322638359 323011169 324211349 324635201 326020241 326827850
1429.2C26827850O52695O79550J352616R14878J211968K542229J960373J041450L73421
$$ 326827850 327480545 328160095 329512711 330427589 331639557 334181786 336142159 337183609 337557030
1437.9C37557030K543678K067223J551361J404876Q03261J983185J240883J716652
$$ 337557030 340100708 342167931 343719292 345124168 345927429 347910614 349151497 350868149
1445.6C50868149J705818J411743J231232J342544J968270Q08258J252403J060638
$$ 350868149 352573967 353985710 355216942 356559486 358527756 359336014 360588417 361649055
1453.3C61649055J790276J771126J750946J777534j534462L523522J889114K577095
$$ 361649055 363439331 365210457 366961403 368738937 367204475 370727997 372617111 375194206
1461.1C75194206K088356J724854L048668O17485J566200K086029K755890K362289
$$ 375194206 377282562 379007416 382056084 382673569 384239769 386325798 389081688 391443977
1468.8C91443977K284737L875160L569031L065338R75685K874947L322258K563400
$$ 391443977 393728714 397603874 401172905 404238243 405213928 408088875 411411133 413974533
1476.5D13974533K619324K783203K453690J846961K028962J780967J771241J191253
$$ 413974533 416593857 419377060 421830750 423677711 425706673 427487640 429258881 430450134
1484.2D30450134P66602J493912R48562P55844J849404K82097j449509j18561J11923
$$ 430450134 431216736 432710648 433659210 434415054 436264458 436546555 435097046 434978485 435090408
1492.9D35090408o87179k84004r4872m696350M55666n53666l853035l48816r31739
$$ 435090408 434403229 434119225 434024353 429328003 429783669 429230003 425376968 425028152 424096413
1501.6D24096413j361657r10759O06614J093216p64809n580750j384391J279258q44230
$$ 424096413 422734756 421823997 422430611 423523827 422759018 417178268 415793877 417073135 416228905
1510.2D16228905O70700q36029j956558K81639l02239N8785k025109k729721K019272
$$ 416228905 416899605 416063576 414107018 414388657 414086418 414145203 412120094 409390373 411409645
1518.9D11409645K666588j20316j978416j292610L04298K351914j072579o42776J013908
$$ 411409645 414076233 413955917 411977501 410684891 410989189 413341103 412268524 411625748 412639656
1527.6D12639656L8567M33769O14204Q03337P55539L88794k776108P83120J124496
$$ 412639656 412678223 413111992 413726196 414529533 415285072 415673866 412897758 413680878 414805374
1536.3D14805374Q88138K918968P86743m488334O50634J724778r98345K75650J8616
$$ 414805374 415693512 418612480 419399223 414910889 415561523 417286301 416287956 416563606 416582222
1545D16582222k104225J433639L80326Q49266J53885j219712J133995N57938J068344
$$ 416582222 414477997 415911636 416291962 417141228 417295113 416075401 417209396 417767334 418835678
1553.6D18835678k535057J2016K788620L255425k40212j0656395m67949M37127P53402
$$ 418835678 416300621 416312637 419101257 422356682 422116470 411460075 410992126 411429253 412182655
1562.3D12182655j216812j118736k806549l011284j105537j473084j1139q052673k083359
$$ 412182655 410965843 409847107 407040558 404029274 402923737 401450653 401439514 393386841 391303482
1571C91303482j397819l232766k244644k411384j358185j2165261j422119k909469
$$ 391303482 389905663 386672897 384428253 382016869 380658684 368493423 367071304 364161835
1578.7C64161835m322014l550568m669151l092766n855408l464889m745712m402657
$$ 364161835 359839821 356289253 351620102 348527336 342671928 339207039 334461327 330058670
1586.4C30058670l950844m797668k995072n457477k699814m539604l149987l796844
$$ 330058670 326107826 321310158 318315086 312857609 310157795 305618191 302468204 298671360
1594.1B98671360m838047k819443m582920j687965m324551k262573k862072k949810
$$ 298671360 293833313 291013870 286430950 284742985 280418434 278155861 275293789 272343979
1601.9B72343979j950607l819504j017361l400535r46961k591076j424923j010952
$$ 272343979 270393372 266573868 265556507 262155972 261209011 258617935 257193012 256182060
1609.6B56182060k526397K01721k587605k5215j799450N53646K98558o260415J931572
$$ 256182060 253655663 253857384 251269779 251244564 249445114 249998760 250297318 244036903 245968475
1618.2B45968475o07013J284561j226807J064987K2068k066707J309299n01461K280407
$$ 245968475 245361462 246646023 245419216 246484203 246506271 244439564 245748863 245247402 247527809
1626.9B47527809j292095Q54664N17845O65665J426258j12973K660618J039162J441269
$$ 247527809 246235714 247090378 247608223 248273888 249700146 249587173 252247791 253286953 254728222
1635.6B54728222j780338J914844M29878M80309K511558M57936K587585M04282K133579
$$ 254728222 252947884 254862728 255292606 255772915 258284473 258742409 261329994 261734276 263867855
1644.3B63867855K586327R24148J896801k110939K813587Q54817L190384L137016J418018
$$ 263867855 266454182 267378330 269275131 267164192 269977779 270832596 274022980 277159996 278578014
1653B78578014o82468j672268L344250J120624K355748J059513J758747K097873J433239
$$ 278578014 277895546 276223278 279567528 280688152 283043900 284103413 285862160 287960033 289393272
1661.6B89393272K672654L62243L609200J794605K345810K744217K686024L048153
$$ 289393272 292065926 292428169 296037369 297831974 300177784 302922001 305608025 308656178
1669.4C08656178L86123M618950J451321L466873M311180L068886K020836K755851
$$ 308656178 309042301 313661251 315112572 318579445 322890625 325959511 327980347 330736198
1677.1C30736198M635888L076820L978271K747498M729767O044235L317223M306411
$$ 330736198 335372086 338448906 342427177 345174675 349904442 355948677 359265900 363572311
1684.8C63572311O18935N610962M454613L913994M261665L753319M759178L934440
$$ 363572311 364191246 369802208 374256821 378170815 382432480 386185799 390944977 394879417
1692.5C94879417N070992N816421O303978R06105M370003O552010O315384O001091
$$ 394879417 399950409 405766830 412070808 412976913 417346916 423898926 430214310 436215401
1700.2D36215401l491707O386223N670509M936447L889275L023453K181205K391701
$$ 436215401 432723694 439109917 444780426 449716873 453606148 456629601 458810806 461202507
1707.9D61202507M170685L034096K187652K487869K889901L617897J391182Q83636
$$ 461202507 465373192 468407288 470594940 473082809 475972710 479590607 480981789 481865425
1715.6D81865425M179611L590546n044098J770821L613243K313080K175521J323929
$$ 481865425 486045036 489635582 484591484 486362305 489975548 492288628 494464149 495788078
1723.4D95788078O84777J356506J578827J329651J745643K589302J00556K2240L934135
$$ 495788078 496472855 497829361 499408188 500737839 502483482 505072784 505173340 505195580 509129715
1732E09129715M606895j22909n310059L793068M013672K171021L219375R07173j284217
$$ 509129715 513736610 513613701 508303642 512096710 516110382 518281403 521500778 522407951 521123734
1740.7E21123734M533615M315681J393166J363449L711777L612709K643127L131104
$$ 521123734 525657349 529973030 531366196 532729645 536441422 540054131 542697258 545828362
1748.4E45828362K662811N297317J975060J12533N364266L787346L719864M276657
$$ 545828362 548491173 553788490 555763550 555876083 561240349 565027695 568747559 573024216
1756.2E73024216L01399J442375L283386K988739M078827L99094k35710L518333K506027
$$ 573024216 573325615 574767990 578051376 581040115 585118942 585518036 585282326 588800659 591306686
1764.8E91306686K100563K442284K218933j527290J941414M966087J944733j585579
$$ 591306686 593407249 595849533 598068466 596541176 598482590 603448677 605393410 603807831
1772.5F03807831j911965M566040K925492j192055J715508J475448K272568R33914
$$ 603807831 601895866 606461906 609387398 608195343 609910851 611386299 613658867 614592781
1780.3F14592781q63571J269150J894798K123451K11945M0359J718865J306762M09012
$$ 614592781 613729210 614998360 616893158 619016609 619228554 619268913 620987778 622294540 622703552
1788.9F22703552J741638J616669J325417j279259j087265L911362J581230m36936
$$ 622703552 624445190 626061859 627387276 626108017 625020752 628932114 630513344 630076408
1796.7F30076408J068535J836663O10656r46007K160302O1683N32723J800918M51088
$$ 630076408 631144943 632981606 633592262 632646255 634806557 634868240 635400963 637201881 637652969
1805.3F37652969J053238R10645L30849P06901J765976o37360K27890J243287K49252
$$ 637652969 638706207 639616852 639947701 640654602 642420578 641783218 642011108 643254395 643503647
1814F43503647J245575M85687J182404J25503J65024J001434K88773J096344q4763
$$ 643503647 644749222 645234909 646417313 646542816 646707840 647709274 647998047 649094391 649009628
1822.7F49009628J342621J509781k091751j58920K191162K441177L84979l461227n1117
$$ 649009628 650352249 651862030 649770279 649611359 651802521 654243698 654628677 651167450 651116333
1831.4F51116333K491074O52008L75137N24750P50656P39822p69119R65652L98331
$$ 651116333 653607407 654259415 654634552 655159302 655909958 656649780 655880661 656846313 657244644
1840.1F57244644L88031N70526K114258J992340o017914J159592K160111K75497l6774
$$ 657244644 657632675 658203201 660317459 662309799 656291885 657451477 659611588 659887085 659850311
1848.7F59850311K7695R20486P5913O49948O8512M05731M98810K54974N36805l21274
$$ 659850311 659878006 660798492 660874405 661524353 661592865 661998596 662497406 662752380 663289185 662967911
1858.4F62967911M17709J66779N61905K09198M80270J77612m10690J112671K69928
$$ 662967911 663385620 663552399 664114304 664323502 664803772 664981384 664570694 665683365 665953293
1867.1F65953293J024475r72061j835556R63287J037064Q26950m29383K15760r4605
$$ 665953293 666977768 666005707 664170151 665133438 666170502 666997452 666568069 666783829 666689224
1875.7F66689224J52283M94537J18561L42941l62854M21143J38626M78897O6757l60717
$$ 666689224 666841507 667336044 667454605 667797546 667434692 667855835 667994461 668473358 668540115 668179398
1885.4F68179398L02200j43280J468811O22787j844635j22375J119308K98844K89001
$$ 668179398 668481598 668338318 669807129 670429916 668585281 668462906 669582214 669881058 670170059
1894.1F70170059J5869j017227Q08029L23563J45645J43356l68118L57742m730J36643
$$ 670170059 670185928 669168701 669976730 670300293 670445938 670589294 670221176 670578918 670574188 670710831
1903.7F70710831k64054L33634M36401J65329L86887m9744j43051k93884O63910l46909
$$ 670710831 670446777 670780411 671216812 671382141 671769028 671719284 671576233 671282349 671946259 671599350
1913.3F71599350p3700K10800Q8501J664658j782227j596298J159973J035690P66678
$$ 671599350 671525650 671736450 671824951 673489609 671707382 670111084 671271057 672306747 673073425
1922F73073425r90524j136169M39300P83005r0256o0730k07519J18866J67465j55030
$$ 673073425 672082901 670946732 671386032 672169037 672078781 672018051 671810532 671929398 672096863 671941833
1931.7F71941833O9352o32553L83834J80130J62430J92642m36859K75269j96991R74960
$$ 671941833 672011185 671378632 671762466 671942596 672105026 672297668 671860809 672136078 671939087 672914047
1941.3F72914047k68402k304458M09927Q32901j3199k89535K67944M3640J98975j29624
$$ 672914047 672645645 670341187 670751114 671584015 671570816 671281281 671549225 671592865 671791840 671662216
1951F71662216m27246k51923k52532J84326l91236N5695k95639p8583M33960k68097
$$ 671662216 671234970 670983047 670730515 670914841 670523605 670579300 670283661 670205078 670639038 670370941
1960.6F70370941J22833m10003l31269l18832K78473P28226k89917k02713J45340K64053
$$ 670370941 670493774 670083771 669752502 669433670 669712143 670440369 670150452 669947739 670093079 670357132
1970.2F70357132l62930o5918l35694k21634J45417o48041j4572K15912N71594J7853
$$ 670357132 669994202 669928284 669592590 669370956 669516373 668868332 668853760 669069672 669641266 669659119
1979.9F69659119r0027m3946o43081q0490n07736J27563L51181L01514l04795o54983
$$ 669659119 669569092 669525146 668882065 668801575 668293839 668421402 668772583 669074097 668769302 668114319
1989.5F68114319R39483K137j422577r48258L91541K71835j01013K16141k13013J01624
$$ 668114319 669053802 669055939 667633362 666685104 667076645 667348480 667247467 667463608 667250595 667352219
1999.2F67352219l26462K78473L81o02569k0981l20816r7885m22058j09940k19116
$$ 667352219 667025757 667304230 667304611 666702042 666681061 666360245 666262360 665840302 665730362 665511246
2008.8F65511246j0910K05154m40140J25656k18353l22037j37023j0834m50134k08817
$$ 665511246 665500336 665705490 665265350 665391006 665172653 664850616 664713593 664702759 664252625 664043808
2018.5F64043808K51999l80478R1095m44107n34744m53034k61154K32010j48850L7079
$$ 664043808 664295807 663915329 664006424 663562317 663027573 662574539 662313385 662545395 662396545 662433624
2028.1F62433624l35998j11161k12707Q5297Q3007n38330l91159p72552J05819J02616
$$ 662433624 662097626 661986465 661773758 661859055 661942062 661403732 661012573 660240021 660345840 660448456
2037.7F60448456J45798J21536k04926p4615o45142p6752m85000k59552j62964n0049
$$ 660448456 660594254 660715790 660510864 660436249 659791107 659714355 659229355 658969803 658806839 658756790
2047.4F58756790K85568n69458j60751k25754L35007j92413l69645K13013m93011J1596
$$ 658756790 659042358 658472900 658312149 658086395 658421402 658228989 657859344 658072357 657579346 657590942
2057F57590942j79977J86844k56424k56729K91290j67999L11508l36075j40228k4719
$$ 657590942 657410965 657597809 657341385 657084656 657375946 657207947 657519455 657183380 657043152 657018433
2066.7F57018433J68228j20926p62634m7379k19192K12249k54364k99988o0806l24325
$$ 657018433 657186661 657065735 656303101 656255722 656036530 656248779 655994415 655694427 655633621 655309296
2076.3F55309296j25656m04435L18604J13373J26495l5248k12021L43628j40075m05655
$$ 655309296 655183640 654779205 655097809 655211182 655337677 655302429 655090408 655434036 655293961 654888306
2086F54888306q09708m49829j16806J64184r7198k39105M17251m7302p5149n04990
$$ 654888306 654078598 653628769 653511963 653676147 653578949 653339844 653757095 653709793 653634644 653129654
2095.6F53129654k05917k747l41415j56861k75955J80969k04925k91291n22766k16980
$$ 653129654 652923737 652920990 652579575 652422714 652146759 652327728 652122803 651831512 651308746 651091766
2105.2F51091766K13547k83661k4719j90735J65405k02942k99072q0566m7074J48163
$$ 651091766 651305313 651021652 650996933 650806198 650971603 650768661 650469589 650389023 650341949 650490112
2114.9F50490112n03158L7460k77786j49155j89209m79050L32566k3270K3499l70255
$$ 650490112 649986954 650024414 649746628 649597473 649408264 648929214 649261780 649238510 649262009 648891754
2124.5F48891754j81808k19040j07041M22898k03476O86l22036Q3389K9068l96423
$$ 648891754 648709946 648490906 648383865 648806763 648603287 648603973 648281937 648365326 648394394 647997971
2134.2F47997971k76795l64914K76413K1286J30768Q6746L11890J87530m5929K83127
$$ 647997971 647721176 647356262 647632675 647653961 647784729 647871475 648183365 648370895 648324966 648608093
2143.8F48608093o28051l93296q5525J30768j67466L5935N15976j92032J62353m17633
$$ 648608093 647980042 647586746 647501221 647631989 647464523 647500458 648016434 647824402 647986755 647569122
2153.5F47569122j36337J06888k79007R5978j53K40936j82571M730k746K43301K94647
$$ 647569122 647432785 647539673 647260666 647356644 647356491 647597427 647414856 647419586 647416840 647660141 647954788
2164.1F47954788l63540K7542j40763q1558k03094L10211M28390J57395K46353k15836
$$ 647954788 647591248 647618790 647478027 647396469 647193375 647503586 647931976 648089371 648335724 648119888
2173.7F48119888J02845n38254k06833L03039K61918J32217l01895L64075j18180m5318
$$ 648119888 648222733 647684479 647477646 647780685 648042603 648174820 647872925 648237000 648118820 648073502
2183.4F48073502r3918K3727Q1635l39356K43759l79257P9270L10974L91617L61480
$$ 648073502 647979584 648003311 648084946 647745590 647989349 647610092 647689362 648000336 648391953 648753433
2193F48753433k08282J52054l19596O4926j44424j27945J79825K27203M44641j95999
$$ 648753433 648545151 648697205 648377609 648442535 648298111 648170166 648349991 648577194 649021835 648825836
2202.6F48825836L20511k64969l97186R9640J27182K60696k73971J09710J0605J72272
$$ 648825836 649146347 648881378 648484192 648583832 648711014 648971710 648697739 648807449 648818054 648990326
2212.3F48990326o790j22986K10037j6937l1738l82920J12000j46408R5520K01874
$$ 648990326 648983536 648860550 649070587 649053650 649021912 648638992 648750992 648604584 648700104 648901978
2221.9F48901978l93296J89667J15204K89154k06909j10550R0790l42179o4316J5336
$$ 648901978 648508682 648698349 648813553 649102707 648895798 648785248 648876038 648533859 648469543 648484879
2231.6F48484879J26037l65982L14636L82691m3412r4833m45022K23541k32315k19803
$$ 648484879 648610916 648244934 648559570 648942261 648898849 648804016 648358994 648582535 648350220 648130417
2241.2F48130417L9444K39334L40729L7689R4147n48935j87683K7084L26004P7438
$$ 648130417 648169861 648409195 648749924 648787613 648881760 648332825 648145142 648172226 648498230 648575668
2250.9F48575668l97110j52130l53775M03519J12915L9673k3194j93557J66778j18637
$$ 648575668 648178558 648026428 647672653 648076172 648189087 648228760 648205566 648012009 648178787 648060150
2260.5F48060150J82037n12313l13874J32828K5101J47934K6474L28750n0048j19935
$$ 648060150 648242187 647729874 647416000 647548828 647573929 647721863 647748337 648077087 648027039 647907104
2270.2F47907104m99420K4872K17514m21066M3869N5313K85111l32642k07291j01700
$$ 647907104 647407684 647432556 647650070 647229004 647272873 647328186 647613297 647280655 647073364 646971664
2279.8F46971664k19497J52588m40522K0371k4262J89286O8054r384J72043n22690
$$ 646971664 646752167 646904755 646464233 646484604 646460342 646649628 646717682 646708298 646880341 646357651
2289.4F46357651K13165k7389j87836k04849J03607L22952l51334Q9035m38003K5635
$$ 646357651 646570816 646543427 646355591 646150742 646254349 646577301 646225967 646315002 645876999 645902634
2299.1F45902634k4109l82462J21079o2790L59878n8059J50680j67007J13601P47986
$$ 645902634 645878525 645496063 645617142 645554352 645914230 645856171 646006851 645839844 645953445 646701431
2308.7F46701431j80664R1400l06930j04752P6905p5455P4463k42844O65741R16824
$$ 646701431 646520767 646612167 646305237 646200485 646277390 646201935 646276398 646033554 646699295 647616119
2318.4F47616119P2785m76914K0066p8965m06646p07016j97907J249314L45230O0043
$$ 647616119 647688904 647211990 647232056 647153091 646746445 646039429 645841522 647090836 647436066 647496109
2328F47496109k17743K31018Q70819o18896q13980m23890O1875M19617N02548r46045
$$ 647496109 647278366 647509384 648380203 647761307 646947327 646523437 646585312 647004929 647507477 646561432
2337.7F46561432o49567P79267K56500N00183j41144q61282o79703j65863j140442
$$ 646561432 645911865 646691132 646947632 647447815 647306671 646445389 645765686 645599823 644459381
2346.3F44459381j930618n44586J025695J568222L06550L48815o7443R0789J286469
$$ 644459381 642528763 641984177 643009872 644578094 644884644 645233459 645166016 645256805 646543274
2355F46543274M30679O96640o17523O80924k49711j752090j73950P4615k01797j518097
$$ 646543274 646973953 647670593 647053070 647733994 647484283 645732193 645558243 645632858 645431061 643912964
2364.7F43912964M95148p9270r12018q23974j009903k07825r61075o48460r15604n00259
$$ 643912964 644408112 644328842 643416824 642592850 641582947 641375122 640414047 639765587 638849983 638349724
2374.3F38349724q60062q00781j46141j055679m88167n14374o13442o41021m60396
$$ 638349724 637489662 636688881 636542740 635487061 634998894 634484520 633871078 633230057 632769661
2383F32769661o4964n21393m56162o04896m13513l44963j80054j57509l74641n1003
$$ 632769661 632704697 632183304 631727142 631122246 630708733 630363770 630183716 630026207 629651566 629600563
2392.6F29600563j34087q6326n67169l4562M3717n48973k19116l70903J02806l00370
$$ 629600563 629466476 629380150 628812981 628778419 628822136 628273163 628054047 627683144 627785950 627485580
2402.3F27485580l04374j82343l77540M2228n05218l88870k87247j24931m55323o72798
$$ 627485580 627181206 626998863 626621323 626663551 626158333 625769463 625482216 625357285 624901962 624229164
2411.9F24229164j11885j95847j02195l69454k8076j55105m77028n33409p41692j32599
$$ 624229164 624117279 623921432 623819237 623449783 623421707 623266602 622789574 622256165 621514473 621381874
2421.6F21381874k31934k44674m21753k45056p6866l36228l78570p97120r0942K01645
$$ 621381874 621149940 620905266 620483513 620238457 620161591 619825363 619446793 618649673 618558731 618760376
2431.2F18760376j47362p31163n11780J32637l05900Q0376l75977q96187p25517n04646
$$ 618760376 618613014 617881851 617370071 617502708 617196808 617277184 616901207 616005020 615279503 614774857
2440.8F14774857j67313l13377j93482l41072j63994j79329n01709o90307n22576j65405
$$ 614774857 614607544 614294167 614100685 613759613 613595619 613416290 612914581 612224274 611701698 611536293
2450.5F11536293r0332P4654m02336k45820m41207n96390n11132q66127k36511k88811
$$ 611536293 611445961 611520615 611118279 610872459 610431252 609834862 609323730 608457603 608221092 607932281
2460.1F07932281l07655o37741m37546L1891l00522J4153m75769k63138m49791r02367
$$ 607932281 607624626 606986885 606549339 606581230 606280708 606294861 605819092 605555954 605106163 604203796
2469.8F04203796m92439k66456Q1977n40428n69916m45022k70653k41165o48728o29196
$$ 604203796 603711357 603444901 603526878 602986450 602416534 601971512 601700859 601459694 600810966 600181770
2479.4F00181770q05549l58162j76735N2719l07770p81402p71790p69730j20582m71459
$$ 600181770 599376221 599018059 598841324 598894043 598586273 597804871 597033081 596263351 596142769 595671310
2489.1E95671310l52172m42200m74816j43127n49622j51672l88107m54903m07715m36744
$$ 595671310 595319138 594876938 594402122 594258995 593709373 593557701 593169594 592714691 592306976 591870232
2498.7E91870232o42167q54110m07486m56124K26326O562o12793p39517o84472k51312
$$ 591870232 591228065 590373955 589966469 589510345 589736671 589743233 589130440 588390923 587706451 587455139
2508.3E87455139m97398m09279o37779n23720o05431m58374J2589k56424K7199p29409
$$ 587455139 586957741 586548462 585910683 585386963 584781532 584323158 584335747 584079323 584106522 583377113
2518E83377113q92143m94766m74281l07999k69737N8097m04090m47236n90209l37182
$$ 583377113 582484970 581990204 581515923 581207924 580938187 580996284 580592194 580144958 579554749 579217567
2527.6E79217567r5863p95250q25500o67343l9j65023k84310k75421o94237k96898
$$ 579217567 579121704 578326454 577500954 576833611 576833572 576668549 576384239 576108818 575414581 575117683
2537.3E75117683k32963k89765m54177l26386o90956n74303O3210l70026l14369n56412
$$ 575117683 574884720 574594955 574140778 573814392 573123436 572549133 572612343 572242317 571927948 571371536
2546.9E71371536o96373n64308l21922j73111m14658m87060l94402J17989m30947n24177
$$ 571371536 570675163 570110855 569788933 569615822 569201164 568714104 568319702 568437691 568006744 567482567
2556.6E67482567l93067n60798l54424n71823p1792l14332n66101l72963l10821m70734
$$ 567482567 567089500 566528702 566174278 565602455 565530663 565216331 564650230 564277267 563966446 563495712
2566.2E63495712o86378j21041n59768n68199k93351j01013q9531n52826j91116k21863
$$ 563495712 562809334 562688293 562128525 561560326 561266975 561165962 561076431 560523605 560332489 560110626
2575.9E60110626k38266p90024p32612m89807o15616o6338n30395j61972N4397k14576
$$ 560110626 559872360 559082336 558349724 557859917 557244301 557177963 556647568 556485596 556539993 556325417
2585.5E56325417k96898n93186m75998p10182n41344n57098j10092k49977r48906l74489
$$ 556325417 556028519 555435333 554959335 554249153 553707809 553150711 553040619 552790642 551841736 551467247
2595.1E51467247j35002l66707o87599k28005l48739q00019n00564k35405j78795o05431
$$ 551467247 551332245 550965538 550277939 550049934 549701195 548901176 548400612 548165207 547986412 547380981
2604.8E47380981l32565o15806n27420j34011n44929n48401q09975l98598k47879n83572
$$ 547380981 547048416 546432610 545905190 545771179 545226250 544677849 543867874 543469276 543221397 542637825
2614.4E42637825o83517l15247k38647p00112m04701o78825l15094m22059p09648j28097
$$ 542637825 541954308 541639061 541400414 540700302 540295601 539616776 539301682 538879623 538169975 538041878
2624.1E38041878o70052q27522o11229q6517l41645o01120k94723n06973j74828m19617
$$ 538041878 537371826 536544304 535933075 535846558 535504913 534903793 534609070 534102097 533927269 533507652
2633.7E33507652n02052q21610q18176k28386m57306m79278q80966q38013n24139j48392
$$ 533507652 533005600 532183990 531365814 531137428 530680122 530200844 529319878 528481865 527957726 527809334
2643.4E27809334M4784m23393m51279m50134m15726o29997n82619m79927n13801l43628
$$ 527809334 527854118 527430725 526979446 526529312 526113586 525483589 524900970 524421043 523907242 523563614
2653E23563614k85339m04473p52601m14505l44162k72255k85073n20324m07830o76765
$$ 523563614 523278275 522873802 522121201 521706696 521362534 521090279 520805206 520284882 519877052 519200287
2662.6E19200287l12576l96195l86886j4763l18261m69017n95321k45171j95350n08385
$$ 519200287 518887711 518491516 518104630 518089867 517771606 517302589 516707268 516462097 516266747 515758362
2672.3E15758362p62253n21698j57242k74544p5454j16883k08816m62914m38156o21452
$$ 515758362 514996109 514474411 514317169 514042625 513967171 513850288 513641472 513178558 512740402 512118950
2681.9E12118950q75359l58390j37940j6060n39436l33061J7624o13976p13348m25568
$$ 512118950 511243591 510885201 510747261 510731201 510191765 509858704 509876328 509262352 508549004 508123436
2691.6E08123436l586l42483m36669l51448j06468m3182n72510j98364n53055p15447
$$ 508123436 508119850 507777367 507340698 506989250 506882782 506839600 506267090 506068726 505515671 504800224
2701.2E04800224l87611k07481j44616n08422l05253o05468m88396J9112L6468l01247
$$ 504800224 504412613 504205132 504060516 503552094 503246841 502641373 502152977 502172089 502208557 501907310
2710.9E01907310o64558o09512n96428k3956q8196j78490r3193m54636l29437k59437
$$ 501907310 501242752 500633240 500036812 500012856 499924660 499746170 499652977 499198341 498868904 498609467
2720.5D98609467k53029n70946k40517R2049l21961n19065k16751K04429k82745n26009
$$ 498609467 498356438 497785492 497544975 497637024 497315063 496795998 496579247 496783676 496500931 495974922
2730.2D95974922o24733k47612P1259l93410m01764j28097M04663l36457q55445k76070
$$ 495974922 495350189 495102577 495173836 494780426 494378662 494250565 494655228 494318771 493463326 493187256
2739.8D93187256l967k5559n53894l79028j32599O5002j05934l80173l01170l82767
$$ 493187256 493183289 493157730 492603836 492224808 492092209 492157211 492051277 491671104 491369934 490987167
2749.4D90987167j7624l90090l29590q2779k10610Q1978j03836m81453p33604k97661
$$ 490987167 490969543 490579453 490249863 490167084 489956474 490038452 489934616 489453163 488719559 488421898
2759.1D88421898j85738j45111j94816m07372l31077o98929k24228o5117j45722l61900
$$ 488421898 488236160 488091049 487896233 487488861 487157784 486458855 486234627 486169510 486023788 485661888
2768.7D85661888n37987J08033p4273j89971l87040o04400q43430o81114k70310m89006
$$ 485661888 485123901 485231934 485157661 484967690 484580650 483976250 483132820 482451706 482181396 481692390
2778.4D81692390k03971m88549j72462N7220m97322l71399l97796l48053m22135j73530
$$ 481692390 481488419 480999870 480827408 480884628 480387306 480015907 479618111 479270058 478847923 478674393
2788D78674393n88570q62389l99017p63016n22651j62316l95775p53479m15039k94571
$$ 478674393 478085823 477223434 476824417 476061401 475538750 475376434 474980659 474227180 473812141 473517570
2797.7D73517570q03642p75985o59028k89344m10843p48329j041680n94406M0779m88434
$$ 473517570 472713928 471937943 471278915 470989571 470578728 469830399 468788719 468194313 468235092 467746658
2807.3D67746658m74701p02400r46579r55963q70743m33426o72836o67839n00793m60091
$$ 467746658 467271957 466569557 465622978 464667015 463796272 463362846 462690010 462022171 461521378 461061287
2816.9D61061287p84416q72116o06537p03812n69000r03740j175003o66084l20740
$$ 461061287 460276871 459404755 458798218 458094406 457525406 456621666 455446663 454780579 454459839
2825.6D54459839o50292p72552q96072r37653n90515r69773r31968r90944j083412
$$ 454459839 453809547 453036995 452140923 451203270 450612755 449642982 448711014 447720070 446636658
2834.3D46636658p74269p35588o20766j248245j403809j370049j575393j537743j646614
$$ 446636658 445862389 445126801 444506035 443257790 441853981 440483932 438908539 437370796 435724182
2843D35724182j587067j628990j409874j914291k414894k060089j756211j571884j431236
$$ 435724182 434137115 432508125 431098251 429183960 426769066 424708977 422952766 421380882 419949646
2851.7D19949646r00650q30231p06367k94190K05841l7231n59311K08168N9929l67737
$$ 419949646 419048996 418218765 417512398 417218208 417424049 417386818 416827507 417035675 417095604 416727867
2861.3D16727867q01391p10755R2621l58048n57708r82208j068573n18418p87392q33816
$$ 416727867 415926476 415215721 415308342 414950294 414392586 413410378 412341805 411823387 411035995 410202179
2870.9D10202179m12064o03065j195221m96636j52244p34329q35152p86171o22864
$$ 410202179 409790115 409187050 407991829 407495193 407342949 406608620 405773468 404987297 404364433
2879.6D04364433l22189k04849r35059j234131r16633o47316p08924j079864o07910
$$ 404364433 404042244 403837395 402902336 401668205 400751572 400104256 399395332 398315468 397707558
2888.3C97707558o65551r40589q92563r30710o32591q43659q02040o00929r90029r65538
$$ 397707558 397042007 396101418 395208855 394278145 393645554 392801895 391999855 391398926 390408897 389443359
2897.9C89443359o81152p73659n03387m70658p72056m84123o41594q68492p71981o98661
$$ 389443359 388762207 387988548 387485161 387014503 386242447 385758324 385116730 384248238 383476257 382777596
2907.6C82777596j065293j128692o38657j054535j115379j129265j259461j300239
$$ 382777596 381712303 380583611 379944954 378890419 377775040 376645775 375386314 374086075
2915.3C74086075j354866j084938j373520r73396j028634j153564p33681p73277j32332
$$ 374086075 372731209 371646271 370272751 369299355 368270721 367117157 366383476 365610199 365477867
2924C65477867n09033q40340l69491o6109L20396J37482k0218R9907O26488O65016
$$ 365477867 364968834 364128494 363759003 363692894 364013290 364150772 364130554 364230461 364856949 365521965
2933.6C65521965N5923j87530K58942P08351M90494M20646L49693O30303P65457N07469
$$ 365521965 365577888 365390358 365649300 366357651 366848145 367268791 367618484 368248787 369014244 369521713
2943.3C69521713P30438Q49915P54967O90651N21888p5531K44828J031799J029701
$$ 369521713 370252151 371102066 371857033 372547684 373069572 372994041 373238869 374270668 375300369
2952C75300369Q01277R6093j32523J52855N37872N33982K27241O20995O96983M98085
$$ 375300369 376101646 376197739 376065216 376218071 376755943 377289925 377517166 378138161 378835144 379333229
2961.6C79333229M95873L62777L41645N87730O15654Q99734J101456N20897L85361
$$ 379333229 379829102 380191879 380533524 381121254 381736908 382636642 383738098 384258995 384644356
2970.3C84644356O09245R65118P79801L01361M95224P57408N33638N7907M53148M88625
$$ 384644356 385253601 386218719 386998520 387299881 387795105 388552513 389086151 389144058 389597206 390085831
2979.9C90085831K73590K28500J54457K42310j58425L94059K87437L0899M58031J16424
$$ 390085831 390359421 390587921 390742378 390984688 390826263 391220322 391507759 391538658 391996689 392113113
2989.6C92113113M61770J81770m11148k81220J08452p973l44429L7308k48871n34057
$$ 392113113 392574883 392756653 392345505 392064285 392172737 392164764 391820335 391857643 391608772 391074715
2999.2C91074715o47545k63138o5002m30451m03747o93322k95219m18053o51092m50058
$$ 391074715 390427170 390164032 390099030 389668579 389264832 388571510 388276291 387858238 387207146 386757088
3008.8C86757088n00984j64910n33905n81818l36380k62870o00395r34830p05910q57391
$$ 386757088 386256104 386091194 385557289 384975471 384639091 384376221 383775826 382840996 382135086 381277695
3018.5C81277695m77486m60396m87785l84598p60383p54509q72269p57370o59180o23627
$$ 381277695 380800209 380339813 379852028 379467430 378707047 377952538 377080269 376322899 375663719 375040092
3028.1C75040092o58073o44379n05638n95321l17078m65622q18672r22012r87435q09860
$$ 375040092 374382019 373737640 373232002 372636681 372319603 371853981 371035309 370113297 369125862 368316002
3037.8C68316002n14755n72396r24072q41560o21605n56946q84438q69445q36678j112251
$$ 368316002 367801247 367228851 366304779 365463219 364841614 364284668 363400230 362530785 361694107 360581856
3047.4C60581856n60341k58942o47278j033973q57697p90596q77228o38237o82335
$$ 360581856 360021515 359762573 359115295 358081322 357223625 356433029 355555801 354917564 354235229
3056.1C54235229m76341o23817o12259o17638j040382p79762n94254q17413j061440
$$ 354235229 353758888 353135071 352522812 351905174 350864792 350085030 349490776 348673363 347611923
3064.8C47611923m04854j39923n87845p13768q84933o49223o77414n45235l76205m59176
$$ 347611923 347207069 347067146 346479301 345765533 344880600 344231377 343553963 343008728 342632523 342173347
3074.4C42173347o47506q49724l16773m41665o84586p83844p33261m75273r36394q09402
$$ 342173347 341525841 340676117 340359344 339917679 339233093 338449249 337715988 337240715 336304321 335494919
3084.1C35494919m30527m67262p11250m84009j22376n28793r71909j075630n96351
$$ 335494919 335064392 334597130 333885880 333401871 333279495 332750702 331778793 330703163 330106812
3092.7C30106812m30794o97441r75533p27348j4420j31302o81953j186714q37364l29094
$$ 330106812 329676018 328978577 328003044 327275696 327261276 327129974 326448021 325261307 324423943 324094849
3102.4C24094849k65694n44663j055450p29141n04570l84712o58837q90808l90777
$$ 324094849 323829155 323284492 322229042 321499901 320995331 320610619 319951782 319060974 318670197
3111.1C18670197n13287o48155p24850o35109n80673r11465r14631o85577l78037o48250
$$ 318670197 318156910 317508755 316783905 316148796 315568123 314656658 313742027 313056450 312678413 312030163
3120.7C12030163r74446r28478o11763k64568o87065r56707o06957o20689n46417n97744
$$ 312030163 311055717 310127239 309515476 309250908 308563843 307607136 307000179 306379490 305833073 305235329
3130.4C05235329j172047p11670k73914o08177p40033q66050m92535m74319m73443
$$ 305235329 304063282 303351612 303077698 302469521 301729488 300863438 300370903 299896584 299423141
3139B99423141k64282r26094j243896q32787p41520q61072l93448j46942l76854p37648
$$ 299423141 299158859 298232765 296988869 296156082 295414562 294553490 294160042 294013100 293636246 292898598
3148.7B92898598q78830n92404l63750m25167j264363j052684n41573n93109l53146
$$ 292898598 292019768 291427364 291063614 290638447 289374084 288321400 287779827 287186718 286833572
3157.4B86833572j030731q08830m70810p06100p88460j095257o49624o19965m37755
$$ 286833572 285802841 284994011 284523201 283817101 283028641 281933384 281283760 280663795 280226040
3166B80226040m85497q73031n01213n75714o54126n87654n27706o60591r11980j089554
$$ 280226040 279740543 278867512 278366299 277790585 277136459 276548805 276021099 275360508 274448528 273358974
3175.7B73358974n80406j86043q20140m01383m18148r86919p75471n35145p44457j204834
$$ 273358974 272778568 272592525 271772385 271371002 270952854 269965935 269190464 268655319 267910862 266706028
3185.3B66706028n47333l00731k07959j60293q57716q83903o98262l55186m14429m94194
$$ 266706028 266158695 265857964 265650005 265489712 264631996 263748093 263049831 262694645 262280216 261786022
3195B61786022p78999q01106k69603j021271p72839k16446k67067l05557r59987q47455
$$ 261786022 261007023 260205917 259936314 258915043 258142204 257925758 257658691 257353134 256393147 255545692
3204.6B55545692n71270m05445q38356r57431k39487o78768m09642k9373n08442m90131
$$ 255545692 254974422 254568977 253730621 252773190 252533703 251854935 251445293 251415920 250907478 250417347
3214.3B50417347p37820r15661p86056k55127r4662r34391p90558m76379n29842O504
$$ 250417347 249679527 248763866 247977810 247722683 247628021 246693630 245903072 245426693 244896851 244903355
3223.9B44903355l35732r62200p04727k46277k40765n65395o27556p32193m04568k17552
$$ 244903355 244567623 243605423 242900696 242654419 242413654 241848259 241220703 240488510 240083942 239866390
3233.5B39866390o09665l90339l96766p69043p11212l02868o5193l98198o18648l67794
$$ 239866390 239256725 238866386 238469620 237700577 236989365 236686497 236621304 236223106 235604458 235236664
3243.2B35236664p0744l69358o50005m09088m78668m57669l85151p03582n78442k94838
$$ 235236664 235165920 234796562 234146557 233737469 233258801 232801132 232415981 231712399 231133957 230839119
3252.8B30839119j44997o0062m75865o01158o29329p69711n94635j72157K61726m30736
$$ 230839119 230694122 230634060 230158195 229557037 228927708 228157997 227563362 227391205 227652931 227222195
3262.5B27222195q50945j45225j91136o83517n70889k20775j80951k21862m31748l03459
$$ 227222195 226371250 226226025 226034889 225351372 224780483 224559708 224378757 224156895 223725147 223421688
3272.1B23421688j3485m05388n14564l77999l25126m90456m71287l13873m70695N5332
$$ 223421688 223408203 223002815 222488251 222110252 221785126 221294670 220823383 220509510 220038815 220094147
3281.8B20094147L46908j06620p22809r06430m56199k53487m4250P8029j50165n77488
$$ 220094147 220441055 220334435 219611626 218705196 218248997 217995510 217951260 218029289 217879124 217301636
3291.4B17301636k94571K67525k66819o06900l28846l6258l66612o27251j57775j85471
$$ 217301636 217007065 217274590 217007771 216400871 216072025 216035767 215669155 215041904 214884129 214698658
3301B14698658l41625m36917m03022q4763j27792r6760j21174n92842o97765l43419
$$ 214698658 214357033 213920116 213517094 213432331 213304539 213207779 213086605 212493763 211795998 211452579
3310.7B11452579j04064j17646n37815o86798l04508l02181o13690l21426q5221m14428
$$ 211452579 211348515 211230869 210693054 210006256 209701748 209399567 208785877 208464451 208379230 207964802
3320.3B07964802k28443l40252m97055l28255p07932n57670k92931l06778o86702q25615
$$ 207964802 207736359 207396107 206899052 206570797 205862865 205305195 205012264 204705486 204018784 203193169
3330B03193169o7845j46103o58588q63361n83020k42138m33063j54495j03016o77948
$$ 203193169 203125324 202979221 202320633 201457272 200874252 200632114 200199051 200044556 199941540 199263592
3339.6A99263592q78792n24674l51772k25353k01836n09376k64626j15204j13315J4515
$$ 199263592 198384800 197860126 197508354 197283001 197081165 196571789 196307163 196191959 196078644 196093159
3349.3A96093159m52442r24836o13308l8070J10016n2739m57439n69916l05118J61876
$$ 196093159 195640717 194715881 194102573 194064503 194174519 194121780 193664341 193094425 192789307 192951183
3358.9A92951183K82269l18794o96564o66638K537K67334r2163n19657r04331k45438
$$ 192951183 193233452 192914658 192218094 191551456 191553993 191821327 191729164 191209507 190305176 190059738
3368.6A90059738J41392L23105O5136q96359n44338J05648O9981l63140o03390m34323
$$ 190059738 190201130 190524235 190589371 189693012 189148674 189254322 189324303 188961163 188357773 187923450
3378.2A87923450j21021J30425N1613j04599n57881l90701M7855J04923K00806j52
$$ 187923450 187802429 187932854 187984467 187879868 187321987 186931286 186979141 187084064 187284870 187284718
3387.8A87284718j16978j42574K46944K33364m70028o82602k2125P49893P0019n69439
$$ 187284718 187167740 187025166 187272110 187505474 187035446 186352844 186330719 187080612 187150631 186581192
3397.5A86581192m25320k54993N6038j38493j77994o0596R0675J72272q6365k49672
$$ 186581192 186155872 185900879 185956917 185818424 185640430 185579834 185670509 185842781 185756416 185506744
3407.1A85506744j72157J36089K15588N25208L28292n44605l59936L32718O65665N31864
$$ 185506744 185334587 185470676 185686264 186211472 186539764 185995159 185635223 185967941 186633606 187165470
3416.8A87165470j37348o40144j03512M49638R823J37577N14908O6643M3239K52629
$$ 187165470 187028122 186387978 186284466 186734104 186743927 186881504 187396412 187463055 187506294 187758923
3426.4A87758923p2194K7943L39584M56028J43357k92683J90239N22900N23376O09608
$$ 187758923 187686729 187714672 188054256 188510284 188653641 188360958 188551197 189074097 189597473 190207081
3436.1A90207081K23732R250M67682K95258j23901M42581L95450K01607L79906O70261
$$ 190207081 190430813 190440063 190907745 191203003 191079102 191521683 191917133 192118740 192498646 193168907
3445.7A93168907P66277k64644k9202K99740N38960P40108J32084P15275N05257l1968
$$ 193168907 193935184 193670540 193641338 193941078 194480038 195220146 195352230 196067505 196572762 196540794
3455.3A96540794L41759M50001L30124M50001J230030R63649N89428l1509l67947Q33664
$$ 196540794 196882553 197332554 197662678 198112679 199342709 200306358 200895786 200864277 200496330 201329994
3465B01329994R45606Q39158O33029K72217L63331M08306R97582R97715L68824J67885
$$ 201329994 202275600 203114758 203747787 204020004 204383335 204791641 205789223 206786938 207155762 207323647
3474.6B07323647N52921M79336L53622P25727P59373J122417R83486L84808J94416
$$ 207323647 207876568 208355904 208709526 209435253 210194626 211317043 212300529 212685337 212879753
3483.3B12879753L81031R48696R74312R33495R49802K40593J66836R15184P09629O24237
$$ 212879753 213260784 214209480 215183792 216117287 217067089 217307682 217474518 218389702 219099331 219723568
3493B19723568J043243O59619M78019K32163N64079J225891R21631Q38375J120339
$$ 219723568 220766811 221426430 221904449 222136612 222700691 223926582 224848213 225686588 226806927
3501.6B26806927J018276M26884M76474R12095Q57963P05071J077766Q60996j20239
$$ 226806927 227825203 228252087 228728561 229640656 230498619 231203690 232281456 233142452 233022213
3510.3B33022213P39975J161632R31283J077442O68316R45739J086712N63126P10659
$$ 233022213 233762188 234923820 235855103 236932545 237600861 238546600 239633312 240196438 240907097
3519B40907097J184215R92756Q44498P00150M80670J163731J449719J324825Q77189
$$ 240907097 242091312 243084068 243928566 244628716 245109386 246273117 247722836 249047661 249924850
3527.7B49924850J008072J145153O17199M53434K99797R71051J359024J941433J577968
$$ 249924850 250932922 252078075 252695274 253148708 253448505 254419556 255778580 257720013 259297981
3536.4B59297981K40174J219577R85184Q75588J551876J468582J393451J235981J208077
$$ 259297981 259538155 260757732 261742916 262618504 264170380 265638962 267032413 268268394 269476471
3545B69476471P73621J190414P00874P68280J377430J913071K476768O35167P94239
$$ 269476471 270250092 271440506 272141380 272909660 274287090 276200161 278676929 279312096 280106335
3553.7B80106335R46922J205730K043724J301632J612168J330814J257801P43942J695519
$$ 280106335 281053257 282258987 284302711 285604343 287216511 288547325 289805126 290549068 292244587
3562.4B92244587K129765Q80107L468628K440548Q35438Q13980r15966K046433K019386
$$ 292244587 294374352 295254459 298723087 301163635 301999073 302813053 301897087 303943520 305962906
3571.1C05962906J803284J827716J664963J647244J449241J893807J139316K414265
$$ 305962906 307766190 309593906 311258869 312906113 314355354 316249161 317388477 319802742
3578.8C19802742K362595N98945J392632K580108J842423J031685M067497L112297
$$ 319802742 322165337 322764282 324156914 326737022 328579445 329611130 333678627 336790924
3586.5C36790924m09164J236190p9689K464371L104820K887612K354965J182289K594948
$$ 336790924 336381760 337617950 337538261 340002632 343107452 345995064 348350029 349532318 352127266
3595.2C52127266J32751K015267L660087J222535K790107K020302J237412K356491
$$ 352127266 352260017 354275284 357935371 359157906 361948013 363968315 365205727 367562218
3602.9C67562218J741066J997642L415261L469162q53310J786346K178688O34346N743409
$$ 367562218 369303284 371300926 374716187 378185349 377332039 379118385 381297073 381931419 387674828
3611.6C87674828J854209o05888M261551P86667M061623M890136J187668K586670J057739
$$ 387674828 389529037 388923149 393184700 393971367 398032990 402923126 404110794 406697464 407755203
3620.3D07755203Q64105J934357K572632L211594L175735K774696L091813P029533
$$ 407755203 408619308 410553665 413126297 416337891 419513626 422288322 425380135 432409668
3628D32409668L535042q221970K078285M643174O149101L077316j226539J939392M020233
$$ 432409668 435944710 427722740 429801025 434444199 440593300 443670616 442444077 444383469 448403702
3636.6D48403702L770256J391144J810341K960700L030091J920242J398468L652573
$$ 448403702 452173958 453565102 455375443 458336143 461366234 463286476 464684944 468337517
3644.4D68337517M639854O612091J444474k975541N624581K178688j143151j232681
$$ 468337517 472977371 479589462 481033936 478058395 483682976 485861664 484718513 483485832
3652.1D83485832M114609M515152M689178O540833o037293R96743N915489K006798
$$ 483485832 487600441 492115593 496804771 503345604 497308311 498305054 504220543 506227341
3659.8E06227341J726608J430931K954712J483574J743431K217560J251640N066681
$$ 506227341 507953949 509384880 512339592 513823166 515566597 517784157 519035797 524102478
3667.5E24102478L218040P89223K501641n525399R28994Q194923J0518684K151566
$$ 524102478 527320518 528109741 530611382 525085983 526014977 534209900 544728584 546880150
3675.2E46880150j7635384O43082P603340M743767j586456P51953K859153K329636
$$ 546880150 529244766 529887848 537491188 542234955 540648499 541400452 544259605 546589241
3682.9E46589241J841736N83687K11639M015503Q821869n703278o247596P630615m254990
$$ 546589241 548430977 549014664 549226303 553241806 562063675 556360397 550112801 557743416 553488426
3691.6E53488426j429100M944420J264000J907501Q40759o2637R16634j96305K106934
$$ 553488426 552059326 557003746 558267746 560175247 561016006 560953369 561870003 561673698 563780632
3700.3E63780632L396034l681106j736718N119057J816559n56374L06397L338966N623207
$$ 563780632 567176666 563495560 561758842 566877899 568694458 568138084 568444481 571783447 577406654
3709E77406654o566925K709389O730652j3647537J806640M466896K36893L42598K581825
$$ 577406654 570839729 573549118 580279770 566632233 568438873 572905769 573142662 573485260 576067085
3717.7E76067085K775421k625541k42768N196724k310104m718857N508995K385674
$$ 576067085 578842506 576216965 575974197 581170921 578860817 574141960 579650955 582036629
3725.4E82036629j148415l284531j061439L807335J923561O257706j028939q892517
$$ 582036629 580888214 577603683 576542244 580349579 582273140 588530846 587501907 578609390
3733.1E78609390Q452263L340683q505134j943703M46701K80723K876702L894882l704376
$$ 578609390 587061653 590402336 581897202 579953499 580400200 580680923 583557625 587452507 583748131
3741.8E83748131J851120J2847366m900665k0601006Q336792N370522O181297J65825
$$ 583748131 585599251 598446617 593545952 572944946 581281738 586652260 592833557 592999382
3749.5E92999382j0480118R675064m702491r010239N221100M147529L636856n031089
$$ 592999382 582519264 592194328 587491837 578481598 583702698 587850227 591487083 586455994
3757.2E86455994J119270O576653n778809l485565L427467J770592n875L887673j373024
$$ 586455994 587575264 594151917 588373108 584887543 588315010 590085602 590079727 593967400 592594376
3765.9E92594376n797615K410163N370942J741294q886413Q87833L498802L74336R80034
$$ 592594376 586796761 589206924 594577866 596319160 587432747 588320580 591819382 592193718 593173752
3774.5E93173752p91092L09143N80788L047065R89685q008461J171799J951714Q80851
$$ 593173752 592382660 592691803 593272591 596319656 597309341 589300880 590472679 592424393 593305244
3783.2E93305244K618752k090912j079903R50776P73277R87053p56607l94173J98593
$$ 593305244 595923996 593833084 592753181 593703957 594477234 595464287 594707680 594313507 594512100
3791.9E94512100M22859j01242J491547M516945l009453n417023J703339L776207O598015
$$ 594512100 594934959 594833717 596325264 600842209 597832756 592415733 594119072 597895279 604493294
3800.6F04493294l388405j0723038K020989J828537M689865O674957q056755o294365
$$ 604493294 601104889 590381851 592402840 594231377 598921242 605596199 597539444 591245079
3808.3E91245079L697624K005425L0098L92265L59154J512985N571175l07923j3803520
$$ 591245079 594942703 596948128 596978226 597370491 597729645 599242630 604813805 604505882 590702362
3817E90702362K799912N079689N849876N817375j8084755k508964N429840K812462
$$ 590702362 593502274 598581963 604431839 610249214 592164459 589655495 595085335 597897797
3824.7E97897797K930793k09579m652557J49345J487389K438087K597504p406349J454429
$$ 597897797 600828590 600619011 595966454 596115799 597603188 600041275 602638779 595232430 596686859
3833.4E96686859P725029n442161k161484R308967n070800o592713P601052m369507
$$ 596686859 604411888 598969727 596808243 606117210 601046410 594453697 602054749 597685242
3841.1E97685242k476006O005592k093048m029312K169495J403618K58255K086296
$$ 597685242 595209236 601214828 599121780 595092468 597261963 598665581 598923836 601010132
3848.8F01010132p44515R15566N670433m418793K456818j3461876k688255J0644455
$$ 601010132 600265617 601181183 606851616 602432823 604889641 591427765 588739510 599383965
3856.5E99383965K99415k298698J713447K016640K985573n187454j470528O468429
$$ 599383965 599683380 597384682 599098129 601114769 604100342 598912888 597442360 603910789
3864.2F03910789l829383o402588K709808M753952P616997m789429j2105331K697944
$$ 603910789 600081406 593678818 596388626 601142578 608759575 603970146 591864815 594562759
3871.9E94562759N766220M292183q926963j569596L666992L28179K607078N012436
$$ 594562759 600328979 604621162 595694199 594124603 597791595 598119774 600726852 605739288
3879.7F05739288l295059q721161L831635K242775J086921N902520j1139870j777725
$$ 605739288 602444229 593723068 597554703 599797478 600884399 606786919 595647049 593869324
3887.4E93869324L970260O12793M181900J002961p730370J57471L355636j690826K65770
$$ 593869324 597839584 598452377 602634277 603637238 595906868 596064339 599419975 597729149 597994919
3896.1E97994919J456337K272949L525276q752060K113800K760010m972763M664764
$$ 597994919 599451256 601724205 605249481 596497421 598611221 601371231 596398468 601063232
3903.8F01063232j876792k742463j74102m72641J450996k87323j9531O2256J122856
$$ 601063232 599186440 596443977 596269875 595797234 597248230 596960907 596941376 597003632 598126488
3912.5E98126488J376571o47773M10728J725884l098755m325295L805351J401711l633537
$$ 598126488 599503059 598855286 599266014 600991898 597893143 593567848 597373199 598774910 595141373
3921.1E95141373J935081K218361J364784j410980l721428M47540R81827J375427l63845
$$ 595141373 597076454 599294815 600659599 599248619 595527191 595974731 596956558 598331985 597968140
3929.8E97968140j041603J633529j567001j150742M08325p66525Q95462J326027l44047
$$ 597968140 596926537 598560066 596993065 595842323 596250648 595484123 596379585 597705612 597361565
3938.5E97361565j322174m85688J351281J299514k887268j080208J925965P79457J081505
$$ 597361565 596039391 595553703 596904984 598204498 595317230 594237022 596162987 596942444 598023949
3947.2E98023949j453858j26762P78198k690124J288147J240692q72689j55754j00860
$$ 598023949 596570091 596443329 597221527 594531403 595819550 597060242 596187553 596031799 595930939
3955.8E95930939Q57849J26648l81012j150971j15814Q44307q14209O7673J96152l02086
$$ 595930939 596788788 596915436 596534424 595383453 595267639 596111946 595297737 595365410 595561562 595259476
3965.5E95259476m9935r575P05719L27263r37538j90697P18537R6702r3994q5830j18027
$$ 595259476 595209541 595199966 595905685 596232948 595295410 595104713 595823250 595919952 595825958 595740128 595622101
3976.1E95622101o40450n82809L3722L85246Q58994M23812K31476j31607k86560m33006
$$ 595622101 594981651 594398842 594432564 594817810 595676804 596100616 596332092 596200485 595913925 595480919
3985.7E95480919o63300k54287j64910O18897Q1520l22495Q0643r422O00662J04866
$$ 595480919 594817619 594563332 594398422 595017319 595098839 594776344 594856987 594847565 595448227 595553093
3995.4E95553093m63676l88260L44810N83000R6894
$$ 595553093 595089417 594701157 595045967 595628967 595725861
4000.2E95725861
$$ 595725861
##END=$$ End of the data block
