##TITLE=$$ Begin of the data block
##JCAMP-DX=5.00 $$ ACD/SpecManager v 10.08
##SPECTROMETER/DATA SYSTEM=Varian
##DATE=14 Jan 2013 10:50:20
##DATA TYPE=INFRARED SPECTRUM
##DATA CLASS=XYDATA
##ORIGIN=
##OWNER=
##NPOINTS=3735
##FIRSTX=399.26403809
##LASTX=4000.35498047
##MAXX=4000.35498047
##MINX=399.26403809
##MAXY=67.44154358
##MINY=18.57178307
##XFACTOR=1.0000000000
##YFACTOR=0.000000100000000
##FIRSTY=41.37584305
##DELTAX=0.96440572
##XUNITS=1/CM
##YUNITS=TRANSMITTANCE
##XYDATA=(X++(Y..Y))
$$ plain form
399.3 413758430 403629951 389641876 392051773 391829758 393348465 393960381 393846092 393338089 390204735
407.9 390204735 396866226 402565002 404193878 398863716 391164970 392530746 392719994 387902985 386581421
416.6 386581421 395155830 408343163 404225388 394115486 392981148 397646904 393469124 385770493
424.3 385770493 386584740 395568810 399133720 392739143 387230034 389543152 395290718 393848534 390800743
433 390800743 388832397 386339226 388571968 390078087 390645447 392779045 392010117 389256630 387344017
441.7 387344017 388806152 394642792 396710320 392064285 388096924 387064667 387469368 386810532 386843948
450.4 386843948 389947090 390646095 386921005 386958008 390734138 388619537 382004318 377817001 379091606
459.1 379091606 381961823 385286827 389846420 391098633 387105522 382935791 381359215 380953026 380259666
$$ packed form
399.3D13758430j0128479j3988075K409897k22015J518707O11916j14289n08003l133354
407.9C90204735O661491N698776J628876n330162p698746J365776J89248m817009j321564
416.6C86581421Q574409J3187333m117775j0109902j134338M665756m177780p698631
424.3C85770493Q14247Q984070L564910o394577n509109K313118N747566j442184l047791
433C90800743j968346k493171K232742J506119N67360K133598p68928k753487j912613
441.7C87344017J462135N836640K067528m646035l967361j032257M04701o58836L3416
450.4C86843948L103142O99005l725090L7003L776130k114601o615219m187317J274605
459.1C79091606K870217L325004M559593J252213l993111m169731j576576m06189o93360
$$ plain form
467.7 380259666 382703056 384374695 383805962 383423462 380302277 380830460 384699554 383595428 377506142
476.4 377506142 374735832 375369797 377243309 380644836 381535683 378913841 377235947 376021233 373021278
485.1 373021278 372940102 374790421 374875870 374728966 374444771 373513298 373268166 373405075 371884232 371329498
494.7 371329498 371351242 372009773 375941963 375666084 372194099 373252754 374217834 373411751 374512520
503.4 374512520 372910080 369267349 369985886 371518593 369286804 366497650 365449982 366627808 367758331
512.1 367758331 366132011 363284798 363184128 363639908 362760162 363986778 365914803 363718529 360289574
520.8 360289574 360655365 362585640 362948761 360491753 358920059 359329834 357881203 358097496 359381180
529.5 359381180 358310165 356502762 355818291 356965904 359279289 360082321 358704376 357507401 356110153
$$ packed form
467.7C80259666K443390J671639n68733l82500l121185N28183L869094j104126o089286
476.4C77506142k770310O33965J873512L401527Q90847k621842j677894j214714k999955
485.1C73021278q1176J850319Q5449j46904k84195r31473k45132J36909j520843n54734
494.7C71329498K1744O58531L932190k75879l471985J058655R65080q06083J100769
503.4C74512520j602440l642731P18537J532707k231789k789154j047668J177826J130523
512.1C67758331j626320k847213j00670M55780q79746J226616J928025k196274l428955
520.8C60289574L65791J930275L63121k457008j571694M09775j448631K16293J283684
529.5C59381180j071015j807403o84471J147613K313385Q03032j377945j196975j397248
$$ plain form
538.1 356110153 354970512 354505081 354162712 356099319 356320305 353628349 353550110 354813271 354576569
546.8 354576569 352822304 350530281 350339241 351396561 350960922 349585228 348451691 348729477 349458504
555.5 349458504 348422775 347636528 347794418 346678085 344987106 343381538 343412170 346007385 347532043
564.2 347532043 347315941 346842422 347171516 347938843 348239822 348308601 347262535 346540680 346952324 347674713
573.8 347674713 348332863 348091049 346923561 344211082 342881775 344498329 345487709 345672455 345060921
582.5 345060921 344408646 345714951 347823219 348362236 347277908 345843811 344803963 345863876 346987572
591.2 346987572 346387062 347156563 347924767 347680626 347371864 347375336 348571129 349444427 348913155 347832260
600.8 347832260 347613335 347383156 346367569 346076088 345656433 344841232 344223251 343908043 343843307 343184052
$$ packed form
538.1C56110153j139641m65431l42369J936607K20986k691956p8239J263161k36702
546.8C54576569j754265k292023j91040J057320m35639j375694j133537K77786P29027
555.5C49458504j035729p86247J57890j116333j690979j605568L0632K595215J524658
564.2C47532043k16102m73519L29094P67327L00979O8779j046066p21855M11644P22389
573.8C47674713O58150k41814j167488k712479j329307J616554R89380J84746o11534
582.5C45060921o52275J306305K108268N39017j084328j434097j039848J059913J123696
591.2C46987572o00510P69501P68204k44141l08762L472J195793Q73298n31272j080895
600.8C47832260k18925k30179j015587k91481m19655q15201o17981l15208o4736o59255
$$ plain form
610.5 343184052 343062477 342984543 342084923 341623497 341417542 341545868 341513405 340920410 340503120 340705605
620.1 340705605 341922722 343351746 344584999 345324097 345034370 344654846 346112442 347971687 348758163
628.8 348758163 350097427 351295547 351996727 353079338 354631805 356671257 358227272 358854637 359451942
637.5 359451942 360119858 360837021 362819252 365447693 366965752 367549667 368750839 369224472 368826942
646.2 368826942 370564690 371350441 370372238 371112862 372631073 373674622 374879913 376817551 377554626
654.8 377554626 377362556 377417870 376882553 376343727 375443039 374117470 373908386 373680534 373071747 373564606
664.5 373564606 374120979 374681816 376594963 377415047 375288353 375562325 376956825 377802086 378205299
673.2 378205299 379506302 380997887 381689491 382476921 384300728 385437126 385472870 385864983 387197227
$$ packed form
610.5C43184052j21575p7934q99620m61426k05955J28326l2463n92995m17290K02485
620.1C40705605J217117J429024J233253P39098k89727l79524J457596J859245P86476
628.8C48758163J339264J198120P01180J082611J552467K039452J556015O27365N97305
637.5C59451942O67916P17163J982231K628441J518059N83915J201172M73633l97530
646.2C68826942J737748P85751r78203P40624J518211J043549J205291J937638P37075
654.8C77554626j92070N5314n35317n38826r00688j325569k09084k27852o08787M92859
664.5C73564606N56373N60837J913147Q20084k126694K73972J394500Q45261M03213
673.2C78205299J301003J491585O91604P87430J823807J136398L5744L92113J332244
$$ plain form
681.8 387197227 388856163 390058823 391251945 392557907 393680725 394012756 394378471 395184288 395942879
690.5 395942879 396930695 397423363 397724800 398442268 399524879 399972000 400158730 400477562 400117989 400745850
700.2 400745850 401695213 402136230 402886353 403870850 404601212 404848175 405996513 407741585 409093590
708.8 409093590 409186783 408975449 409657898 410179787 410867844 411716766 412716408 413815956 414559631 414682083
718.5 414682083 415448532 416410828 415687943 415756493 416209450 416633911 417470093 418364944 419676857 420030251
728.1 420030251 420754089 422448921 424078064 424703598 424868889 425706787 426555176 427754860 427783623
736.8 427783623 427770653 428528976 428913918 429895248 429525833 428354454 429593849 431721115 432314606
745.5 432314606 432789345 433188286 433358459 433856239 434399910 435654488 436077461 436716270 438081322
$$ packed form
681.8C87197227J658936J202660J193122J305962J122818L32031L65715Q05817P58591
690.5C95942879R87816M92668L01437P17468J082611M47121J86730L18832l59573O27861
700.2D00745850R49363M41017P50123R84497P30362K46963J148338J745072J352005
708.8D09093590R3193k11334O82449N21889O88057Q48922R99642J099548P43675J22452
718.5D14682083P66449R62296p22885O8550M52957M24461Q36182Q94851J311913L53394
728.1D20030251P23838J694832J629143O25534J65291Q37898Q48389J199684K8763
736.8D27783623j2970P58323L84942R81330l69415j171379J239395K127266N93491
745.5D32314606M74739L98941J70173M97780N43671J254578M22973O38809J365052
$$ plain form
754.2 438081322 438425789 438570824 439733315 441893578 443102188 444364128 445419159 445604401 446323318
762.8 446323318 447702751 449015770 448896790 449485970 450216599 450063477 450127983 450377159 450834961 450955429
772.5 450955429 451211967 450873260 451416092 451943893 451889191 452554665 451854820 451787071 452191429 452434540
782.1 452434540 452165527 451300354 451890221 453068466 454549026 454959030 454775505 454553757 454704666
790.8 454704666 455453224 455663185 456371422 456285820 456048889 455985794 455479660 454837456 454138870 453380241
800.5 453380241 452266083 452434578 451675262 449716034 447880554 446517944 446389122 445361519 443547974
809.1 443547974 441750870 440567551 439017448 436981049 435253792 433833771 434049225 434146423 433134079
817.8 433134079 431810188 431709480 432502213 432319717 432629585 434239922 436711769 439066391 441775589
$$ packed form
754.2D38081322L44467J45035J162491K160263J208610J261940J055031J85242P18917
762.8D46323318J379433J313019j18980N89180P30629j53122O4506K49176M57802J20468
772.5D50955429K56538l38707N42832N27801n4702O65474o99845o7749M04358K43111
782.1D52434540k69013q65173N89867J178245J480560M10004j83525k21748J50909
790.8D54704666P48558K09961P08237q5602k36931o3095n06134o42204o98586p58629
800.5D53380241j114158J68495p59316j959228j835480j362610j28822j027603j813545
809.1D43547974j797104j183319j550103k036399j727257j420021K15454R7198j012344
817.8D33134079j323891j00708P92733j82496L09868J610337K471847K354622K709198
$$ plain form
826.5 441775589 444622612 447024078 450173187 453708496 456245041 457551117 460239716 462708511
834.2 462708511 464921799 467886848 469882889 472180023 473838348 475604019 477218704 478587456
841.9 478587456 479760628 481013489 482895889 483301048 484889412 486346817 487774048 489331360 489697151
850.6 489697151 490804405 491431694 492640877 493307343 494968300 497011147 498065109 499934883 500939789
859.3 500939789 502943153 503848343 504055443 504410515 504358788 504820938 504335136 504733467 504682312 504309654
868.9 504309654 503651886 502375603 500733566 498973045 498143578 496101227 495135956 494314003 492601013
877.6 492601013 492045479 492019043 492128372 491658745 490803871 489505272 489399300 488572578 486699142 485741463
887.3 485741463 484473724 483693428 483732567 484617119 483990135 483143501 483329201 483330803 483943024 484382477
$$ packed form
826.5D41775589K847023K401466L149109L535309K536545J306076K688599K468795
834.2D62708511K213288K965049J996041K297134J658325J765671J614685J368752
841.9D78587456J173172J252861J882400M05159J588364J457405J427231J557312L65791
850.6D89697151J107254O27289J209183O66466J660957K042847J053962J869774J004906
859.3E00939789K003364R05190K07100L55072n1727M62150m85802L98331n1155l72658
868.9E04309654o57768j276283j642037j760521q29467k042351r65271q21953j712990
877.6D92601013n55534k6436J09329m69627q54874j298599j05972q26722j873436r57679
887.3D85741463j267739p80296L9139Q84552o26984q46634J85700J602O12221M39453
$$ plain form
896.9 484382477 485425911 485273132 484927216 484967957 484571915 484105949 483367767 485314751 487133408
905.6 487133408 489102821 491083984 491984444 494777603 496928444 497716026 496871223 496699257 497072296
914.3 497072296 495701981 493798294 492260628 491437263 489043503 486740074 484497795 482267265 480219994
922.9 480219994 476983299 474676132 472218895 469328842 466190720 463487053 461214905 458662834
930.7 458662834 456530228 453874283 451543694 449560699 448608170 447981300 446951485 446611366 445038605
939.3 445038605 443274651 442074089 440839500 439355240 437349434 436045494 435434532 434912949 434645576
948 434645576 434844704 434153786 432948723 432448349 432172279 431670227 430430870 428682060 426762810
956.7 426762810 425247231 423292961 420971680 418917885 416754570 415093918 413411369 411456909
$$ packed form
896.9D84382477J043434j52779l45916M0741l96042m65966p38182J946984J818657
905.6D87133408J969413J981163R00460K793159K150841P87582q44803j71966L73039
914.3D97072296j370315j903687j537666q23365k393760k303429k242279k230530k047271
922.9D80219994l236695k307167k457237k890053l138122k703667k272148k552071
930.7D58662834k132606k655945k330589j982995r52529o26870j029815l40119j572761
939.3D45038605j763954j200562j234589j484260k005806j303940o10962n21583k67373
948D34645576J99128o90918j205063n00374k76070n02052j239357j748810j919250
956.7D26762810j515579j954270k321281k053795k163315j660652j682549j954460
$$ plain form
964.4 411456909 409475250 407836990 406198082 404348106 402296524 399864960 397936592 395453835
972.1 395453835 392807236 390410347 387359009 384216423 380971527 377664986 373834534 369501228
979.8 369501228 364904747 360289307 356037521 351540642 346714363 342118721 337818985 333602867
987.6 333602867 329667397 326648026 323820801 319963799 316335716 313160954 309881458 307061234
995.3 307061234 304624348 302329292 300274010 297658443 294086037 291542950 289437428 287007866
1003 287007866 284629631 282073383 279781418 277278824 275395031 273637981 271775589 270045376 268550491
1011.7 268550491 267561569 265361748 262849655 260671864 259341221 258078690 255672626 253393745
1019.4 253393745 251547737 249814720 247551956 245996647 244124680 242092171 240765934 239233284
$$ packed form
964.4D11456909j981659j638260j638908j849976k051582k431564j928368k482757
972.1C95453835k646599k396889l051338l142586l244896l306541l830452m333306
979.8C69501228m596481m615440m251786m496879m826279m595642m299736m216118
987.6C33602867l935470l019371k827225l857002l628083l174762l279496k820224
995.3C07061234k436886k295056k055282k615567l572406k543087k105522k429562
1003B87007866k378235k556248k291965k502594j883793j757050j862392j730213j494885
1011.7B68550491r88922k199821k512093k177791j330643j262531k406064k278881
1019.4B53393745j846008j733017k262764j555309j871967k032509j326237j532650
$$ plain form
1027.1 239233284 238170300 236830349 235908604 234624462 233835220 233279266 232876034 233571987 232966900
1035.8 232966900 233288174 234021473 235788059 237691650 238365383 240047607 240867119 241608467 241948452
1044.5 241948452 242284679 242190323 241498203 241338081 241019611 241409893 240185909 238869743 237679615
1053.1 237679615 236339321 235946598 235043201 234589100 233722267 234130726 234623833 234585781 235395565 236759663
1062.8 236759663 239424896 241253376 242229500 242574577 243874893 245193615 245710869 246715851 246801357
1071.5 246801357 246927605 247330227 248453979 249088383 249683399 250400295 250409241 250763893 250749989 251747475
1081.1 251747475 252068653 252876587 254713440 255971527 257444172 258203526 259491749 259709072 260255527
1089.8 260255527 262450161 265106258 266962471 266902180 267983608 269388809 270797138 271638966 272447968
$$ packed form
1027.1B39233284j062984j339951r21745j284142p89242n55954m03232O95953o05087
1035.8B32966900L21274P33299J766586J903591O73733J682224Q19512P41348L39985
1044.5B41948452L36227r4356o92120j60122l18470L90282j223984j316166j190128
1053.1B37679615j340294l92723r03397m54101q66833M08459M93107l8052Q09784J364098
1062.8B36759663K665233J828480R76124L45077J300316J318722N17254J004982Q5506
1071.5B46801357J26248M02622J123752O34404N95016P16896Q946L54652j3904R97486
1081.1B51747475L21178Q07934J836853J258087J472645P59354J288223K17323N46455
1089.8B60255527K194634K656097J856213o0291J081428J405201J408329Q41828Q09002
$$ plain form
1098.5 272447968 274090195 275212498 276963234 278582916 280361595 281451073 282406235 284079762
1106.2 284079762 285121346 285474262 285686378 286976032 287184772 287252121 288512077 289917278 290801239
1114.9 290801239 291016788 292477207 293074703 292527332 292142162 292224312 292949104 293431015 293663864 293582859
1124.5 293582859 294604683 295341530 295701504 296778851 298185978 300076370 301730919 303343258 304083061
1133.2 304083061 305630398 307842140 309992657 312714500 314503841 316154060 317657204 319635353
1140.9 319635353 321166115 321825066 323045998 323983650 324841957 325056648 325067368 325497437 326151772
1149.6 326151772 326751595 326750793 326896858 326932373 327083549 327079811 326709251 326364212 325934410 325552902 324702415
1160.2 324702415 324104691 324108124 324316635 324582748 325464783 327053719 328700218 330585289 332391205
$$ packed form
1098.5B72447968J642227J122303J750736J619682J778679J089478R55162J673527
1106.2B84079762J041584L52916K12116J289654K08740O7349J259956J405201Q83961
1114.9B90801239K15549J460419N97496n47371l85170Q2150P24792M81911K32849q1005
1124.5B93582859J021824P36847L59974J077347J407127J890392J654549J612339P39803
1133.2C04083061J547337K211742K150517K721843J789341J650219J503144J978149
1140.9C19635353J530762O58951J220932R37652Q58307K14691J0720M30069O54335
1149.6C26151772N99823q02J46065L5515J51176l738l70560l45039m29802l81508q50487
1160.2C24702415n97724L433K08511K66113Q82035J588936J646499J885071J805916
$$ plain form
1168.9 332391205 334722824 337507820 340739174 344029427 346642647 349028854 351659203 354656372
1176.6 354656372 357181282 359415894 361840248 364676056 367540207 370054741 371971970 373488998
1184.3 373488998 375553780 377544479 378814278 379320946 379726906 380236855 380720596 381332474 381689796
1193 381689796 381455612 380867653 379975967 378829308 378255043 377437096 376207657 375101204 374113617
1201.6 374113617 373313904 372183418 371375427 370469322 369038200 367688293 366631622 366031723 365496864
1210.3 365496864 365269127 364720192 364266968 364603119 363937340 362773743 362392654 362297401 361617241 360705414
1220 360705414 360128860 359683151 359614830 359157791 358467026 357803955 356835937 356276703 355606880 354637756
1229.6 354637756 353736877 353061714 352532768 351959152 351691513 351212425 350734749 350566521 350365028 350017776
$$ packed form
1168.9C32391205K331619K784996L231354L290253K613220K386207K630349K997169
1176.6C54656372K524910K234612K424354K835808K864151K514534J917229J517028
1184.3C73488998K064782J990699J269799N06668M05960N09949M83741O11878L57322
1193C81689796k34184n87959q91686j146659n74265q17947j229439j106453r87587
1201.6C74113617p99713j130486q07991r06105j431122j349907j056671n99899n34859
1210.3C65496864k27737n48935m53224L36151o65779j163597l81089r5253o80160r11827
1220C60705414n76554m45709o8321m57039o90765o63071r68018n59234o69823r69124
1229.6C54637756r00879o75163n28946n73616k67639m79088m77676j68228k01493l47252
$$ plain form
1239.3 350017776 349831123 350052376 349927635 349929848 350205688 349904022 349125443 348543205 348045120 347420578
1248.9 347420578 347415886 347268906 346993637 347209396 347248993 347120476 346686401 346090393 345949402 346190567
1258.5 346190567 346097107 346296120 346753311 346922035 347560616 348055115 348412781 348445778 348596573 349405441
1268.2 349405441 350125084 351182518 352157288 353189240 354257393 355080948 356086388 357134476 358207207
1276.9 358207207 359374161 360502472 361384583 362671471 363967323 364936180 366385536 367965240 369001503
1285.5 369001503 370034447 371465454 372762070 374175491 375332298 376086426 376740074 377749062 379217224
1294.2 379217224 380176430 380716705 381158180 382058868 382741241 382957649 383353348 383809013 384330063 384228859
1303.9 384228859 383973236 383838844 383768578 383978653 383702660 382495956 382016411 382806892 382500191 381539345
$$ packed form
1239.3C50017776j86653K21253j24741K213K75840l01666p78579n82238m98085o24542
1248.9C47420578m692j46980k75269K15759L9597j28517m34075n96008j40991K41165
1258.5C46190567r3460J99013M57191J68724O38581M94499L57666L2997J50795Q08868
1268.2C49405441P19643J057434R74770J031952J068153Q23555J005440J048088J072731
1276.9C58207207J166954J128311Q82111J286888J295852R68857J449356J579704J036263
1285.5C69001503J032944J431007J296616J413421J156807P54128O53648J008988J468162
1294.2C79217224R59206N40275M41475R00688O82373K16408L95699M55665N21050j01204
1303.9C84228859k55623j34392p0266K10075k75993j206704m79545P90481l06701r60846
$$ plain form
1313.5 381539345 381108246 381068268 381135330 381186295 381942673 382153473 382039185 382572365 383483467 384451408
1323.2 384451408 385248566 385951385 385949173 386172295 386489410 386451378 386316910 385892487 385731583 385667191
1332.8 385667191 385137863 384310150 384275589 384359627 384205360 384506416 384611206 384915695 385129166 385486832
1342.4 385486832 386053009 386787605 387614136 388160515 388867340 389125977 389163322 389010696 388984680 388786201
1352.1 388786201 388509064 388750381 388081398 387349777 387115669 386934090 386581802 386494675 386138573 385395317
1361.7 385395317 385628777 384418373 384117661 384480019 383964539 383644257 382627716 381702232 381409874
1370.4 381409874 381300697 381290588 381605377 381564598 381085472 381250839 381007767 381267929 381165085 380534210
1380.1 380534210 379869118 378996239 378151588 376795769 376068077 375575371 375001106 373108749 371698151
$$ packed form
1313.5C81539345m31099l9978O7062N0965P56378K10800j14288N33180R11102R67941
1323.2C84451408P97158P02819k212K23122L17115l8032j34468m24423j60904o4392
1332.8C85667191n29328q27713l4561Q4038j54267L01056J04790L04489K13471L57666
1342.4C85486832N66177P34596Q26531N46379P06825K58637L7345j52626k6016j98479
1352.1C88786201k77137K41317o68983p31621k34108j81579l52288q7127l56102p43256
1361.7C85395317K33460j210404l00712L62358n15480l20282j016541r25484k92358
1370.4C81409874j09177j0109L14789m0779m79126J65367k43072K60162j02844o30875
1380.1C80534210o65092q72879q44651j355819p27692m92706n74265j892357j410598
$$ plain form
1388.7 371698151 371101646 369293594 367555847 365832405 364990921 363149796 359748688 358584595 356947784
1397.4 356947784 355298729 352233505 349850998 348738327 346735725 344980202 343349380 341054153
1405.1 341054153 338933945 337669830 336130486 334371681 333267136 331684914 329777412 328249512
1412.8 328249512 327324638 326489716 325869522 325699577 325363770 326096306 324210663 322748070 323257675
1421.5 323257675 323368492 324116707 323221931 323481827 324734993 325387802 326650314 327262688 327432060
1430.2 327432060 327821045 329326591 330592651 331874504 334170609 336106567 337652779 338334084 340649681
1438.9 340649681 342738419 344342918 345577736 346523514 348174362 349194450 351100693 352637329
1446.6 352637329 353813286 355122147 356841049 358839493 359586220 361059151 362282486 364283371
$$ packed form
1388.7C71698151n96505j808052j737747j723442q41484j841125l401108j164093j636811
1397.4C56947784j649055l065224k382507j112671k002602j755523j630822k295227
1405.1C41054153k120208j264115j539344j758805j104545j582222j907502j527900
1412.8C28249512r24874q34922o20194j69945l35807P32536j885643j462593N09605
1421.5C23257675J10817P48215q94776K59896J253166O52809J262512O12374J69372
1430.2C27432060L88985J505546J266060J281853K296105J935958J546212O81305K315597
1438.9C40649681K088738J604499J234818R45778J650848J020088J906243J536636
1446.6C52637329J175957J308861J718902J998444P46727J472931J223335K000885
$$ plain form
1454.3 364283371 366234360 367456284 368862953 368763313 372078438 373360558 375462189 376972084 378711662
1463 378711662 382074013 383191795 384651146 386485558 389240952 391639137 394265823 398036880 400859947
1471.7 400859947 403895683 405125809 408581886 412432556 414318848 416316872 419282379 421995125
1479.4 421995125 424222832 426280708 427678795 429217911 430375938 431500015 433395119 434301796
1487.1 434301796 434590111 436582947 436971817 434962921 435115089 435403748 434712410 434384499 434738083
1495.8 434738083 430602341 429990959 428826218 425477943 425322876 424517746 423240662 422294044 423080521
1504.5 423080521 423551407 419136543 416191635 416146927 417299461 416509705 417021942 416175690 414176750
1513.1 414176750 414578056 414344139 414320679 412985229 410315857 411795845 414017792 413621979 412144279
$$ packed form
1454.3C64283371J950989J221924J406669r9640L315125J282120K101631J509895J739578
1463C78711662L362351J117782J459351J834412K755394K398185K626686L771057K823067
1471.7D00859947L035736J230126L456077L850670J886292J998024K965507K712746
1479.4D21995125K227707K057876J398087J539116J158027J124077J895104R06677
1487.1D34301796K88315J992836L88870k008896J52168K88659o91338l27911L53584
1495.8D34738083m135742o11382j164741l348275j55067q05130j277084r46618P86477
1504.5D23080521M70886m414864k944908m4708J152534p89756N12237q46252j998940
1513.1D14176750M01306k33917k3460j335450k669372J479988K221947l95813j477700
$$ plain form
1521.8 412144279 411199989 411446533 413465614 412235222 412232513 413705292 413102913 413105965 413901939 414915695
1531.5 414915695 415973701 416524239 413705673 414323235 415464287 416864929 419852409 419173851 415295563
1540.1 415295563 415208244 415067444 414429359 415925941 417197838 415442963 416629372 417251701 418453827
1548.8 418453827 418837967 417272682 418005066 418262291 419248886 417089272 416704025 418806458 421272049
1557.5 421272049 423806419 417408981 412237549 411816559 412849197 411730690 410479507 407667313
1565.2 407667313 404870148 404143791 402883530 402826271 394577675 391959229 390371552 387224236 384875679
1573.9 384875679 382495499 381962013 369438820 366983833 364208870 360597115 357357788 352176933
1581.6 352176933 348814354 343228226 339600830 334576492 330253716 326492043 321570129 318286533
$$ packed form
1521.8D12144279r44290K46544K019081j230392k709J472779o02379L052P95974J013756
1531.5D14915695J058006N50538k818566O17562J141052J400642K987480o78558l878288
1540.1D15295563q7319j40800o38085J496582J271897j754875J186409O22329J202126
1548.8D18453827L84140j565285P32384K57225R86595k159614l85247K102433K465591
1557.5D21272049K534370o397438n171432m20990J032638j118507j251183k812194
1565.2D07667313k797165p26357j260261n7259q248596k618446j587677l147316k348557
1573.9C84875679k380180n33486j2523193k454987k774963l611755l239327n180855
1581.6C52176933l362579n586128l627396n024338m322776l761673m921914l283596
$$ plain form
1589.3 318286533 313080177 310746326 306046143 302589207 298819923 294183865 291505241 286786098
1597 286786098 284852734 280831184 278856106 275817776 272679024 270878677 267254887 265990105 262699413
1605.7 262699413 262054749 259156895 257489090 256348782 253699741 253931561 251436329 251698284 249933624
1614.4 249933624 250164700 250618668 244949112 246491146 245588684 246736870 245410118 246685677 247139530
1623.1 247139530 244529266 245814171 245587883 247696438 246267929 247124310 247791805 248556862 249789066
1631.7 249789066 249889870 252566204 252840729 254198589 252997494 255148277 256043339 256424007 258629436
1640.4 258629436 258795128 261210594 261843796 264128113 266187229 266077404 269354496 268187828 270576515
1649.1 270576515 271533260 274527760 277214184 278763065 278079967 276724014 279836845 280900917 283412533
$$ packed form
1589.3C18286533n206356k333851m700183l456936l769284m636058k678624m719143
1597B86786098j933364m021550j975078l038330l138752j800347l623790j264782l290692
1605.7B62699413o44664k897854j667805j140308k649041K31820k495232K61955j764660
1614.4B49933624K31076M53968n669556J542034r02462J148186j326752J275559M53853
1623.1B47139530k610264J284905k26288K108555j428509Q56381O67495P65057J232204
1631.7B49789066J00804K676334K74525J357860j201095K150783Q95062L80668K205429
1640.4B58629436J65692K415466O33202K284317K059116j09825L277092j166668K388687
1649.1B70576515R56745K994500K686424J548881o83098j355953L112831J064072K511616
$$ plain form
1657.8 283412533 284401531 286004887 288157978 289797153 292314434 292462234 296235466 298316460 300877628
1666.5 300877628 303727188 306265583 308901653 310010223 314620323 315833492 319425468 323552399
1674.2 323552399 326761436 328702698 331152496 335594177 338707085 343314934 345924034 350244141
1681.9 350244141 356529198 359585342 362456779 364129944 370324707 375001450 378792915 382801666
1689.6 382801666 386472092 391508980 395954056 401163292 406539841 412094612 413133469 417794151
1697.3 417794151 424252892 430803337 436845512 432825356 439785118 445816002 450575714 453849144
1705 453849144 457227478 460105934 462156181 465928078 468799362 470925751 473546410 476672516 480532684
1713.7 480532684 482254829 483085518 487139435 490500641 485335350 487210312 490796585 493077698
$$ packed form
1657.8B83412533R88998J603356K153091J639175K517281J47800L773232K080994K561168
1666.5C00877628K849560K538395K636070J108570M610100J213169L591976M126931
1674.2C23552399L209037J941262K449798M441681L112908M607849K609100M320107
1681.9C50244141O285057L056144K871437J673165O194763M676743L791465M008751
1689.6C82801666L670426N036888M445076N209236N376549N554771J038857M660682
1697.3D17794151O458741O550445O042175m020156O959762O030884M759712L273430
1705D53849144L378334K878456K050247L771897K871284K126389K620659L126106L860168
1713.7D80532684J722145Q30689M053917L361206n165291J874962L586273K281113
$$ plain form
1721.4 493077698 494872475 496161995 497321548 498846550 500538483 501734123 503251953 505801582
1729.1 505801582 506385193 506730309 510547638 515128593 513898048 508530884 512662201 516577110 519019508
1737.8 519019508 522559013 524125481 522851219 526759186 530483284 531861420 533728600 537396545
1745.5 537396545 541204834 544033012 546206589 548384209 553924294 556509819 557257576 562145615
1753.3 562145615 565474052 569156456 573308983 573690224 574978218 578170776 581548424 585859680
1761 585859680 586448097 586282654 589902077 592163315 593697968 596435204 599219131 597358360 599285278
1769.7 599285278 604607697 606632385 604897308 602733116 606944160 609541435 608563919 610504074
1777.4 610504074 611735306 613968582 615290909 614669380 615919495 617993813 619919357 619560547 619939613
$$ packed form
1721.4D93077698J794777J289520J159553J525002J691933J195640J517830K549629
1729.1E05801582N83611L45116L817329M580955j230545n367164M131317L914909K442398
1737.8E19019508L539505J566468j274262L907967L724098J378136J867180L667945
1745.5E37396545L808289K828178K173577K177620N540085K585525P47757M888039
1753.3E62145615L328437L682404M152527L81241J287994L192558L377648M311256
1761E85859680N88417j65443L619423K261238J534653K737236K783927j860771J926918
1769.7E99285278N322419K024688j735077k164192M211044K597275r77516J940155
1777.4F10504074J231232K233276J322327o21529J250115K074318J925544l58810L79066
$$ plain form
1786 619939613 621803551 622977104 623610802 625712891 627662582 628814430 627279358 625901833 629702148
1794.7 629702148 631301804 630753098 631924362 633972740 634714012 633387566 635446243 635684700 636117477
1803.4 636117477 638115959 638829041 639827728 640585480 641160202 641941833 643321152 642626419 643001404
1812.1 643001404 644441757 644739838 645883255 646216812 647371063 647545242 647619781 648946991 649332504
1820.8 649332504 650184097 650034409 651442566 652921600 650477982 650585251 652667542 654972992 655975037
1829.4 655975037 652441559 652083893 654377365 655062027 655544281 656051102 656944656 657533188 656631851
1838.1 656631851 657459564 657736740 658563995 659673080 661803207 663662872 657699585 658685989 660939713
1846.8 660939713 661273651 660898895 660792770 661717377 662024078 662913513 662872467 663141098 663285751 663244476
$$ packed form
1786F19939613J863938J173553O33698K102089J949691J151848j535072j377525L800315
1794.7F29702148J599656n48706J171264K048378P41272j326446K058677K38457M32777
1803.4F36117477J998482P13082R98687P57752N74722P81631J379319o94733L74985
1812.1F43001404J440353K98081J143417L33557J154251J74179P4539J327210L85513
1820.8F49332504Q51593j49688J408157J479034k443618J07269K082291K305450J002045
1829.4F55975037l533478l57666K293472O84662M82254N06821Q93554N88532r01337
1838.1F56631851Q27713K77176Q27255J109085K130127J859665n963287R86404K253724
1846.8F60939713L33938l74756j06125R24607L06701Q89435m1046K68631J44653m1275
$$ plain form
1856.4 663244476 664166641 664170151 664503326 664526825 664879990 665000916 665519333 665904541 665713348 666867065
1866.1 666867065 666929321 667781525 667409821 665516129 666117706 667313614 668076401 667806091 668311234
1874.8 668311234 668042450 667654343 667714539 668125916 668830643 668735657 669358749 669281998 669688263 669724884
1884.4 669724884 669169922 669235458 669144135 670963821 671186905 668897171 669203796 670628510 670902557
1893.1 670902557 670915146 670829849 669824982 670399323 670725555 671113052 671376877 671262283 671801834 671749649
1902.7 671749649 672057343 671810532 671880417 672008972 671871796 672356720 672610245 672591553 672260818 673076859
1912.4 673076859 672966843 672878113 672849503 672711945 674415436 672723618 671344223 672420273 673257370
1921.1 673257370 674299622 673374786 672083206 672350998 673053741 673071518 673084946 672926331 672933960 673227386
$$ packed form
1856.4F63244476R22165L510L33175K3499L53165J20926N18417L85208j91193J153717
1866.1F66867065O2256Q52204l71704j893692O01577J195908P62787k70310N05143
1874.8F68311234k68784l88107O0196M11377P04727r4986O23092p6751M06265L6621
1884.4F69724884n54962O5536r1323J819686K23084k289734L06625J424714K74047
1893.1F70902557J2589q5297j004867N74341L26232L87497K63825j14594N39551n2185
1902.7F71749649L07694k46811O9885J28555j37176M84924K53525j8692l30735Q16041
1912.4F73076859j10016q8730k8610j37558J703491j691818j379395J076050Q37097
1921.1F73257370J042252r24836j291580K67792P02743J7777J3428j58615P629K93426
$$ plain form
1930.7 673227386 673064880 673179321 672852783 672976456 672866364 672854080 672990341 672683563 672947235 672758713
1940.3 672758713 674015503 674308395 671795197 671733017 672617874 672639999 672266769 672484589 672272644 672517929
1950 672517929 673025894 672775803 672286072 671735153 671752472 671484756 671528549 671628571 671683807 671791916
1959.6 671791916 671799545 671925125 671237717 671113358 670964966 671039505 671449661 670984039 670570984 670702515
1969.3 670702515 671372147 671003876 670916595 671058960 670777588 670883713 670436935 670217667 670397644 671044769
1978.9 671044769 670817032 670447235 670553284 670102005 670135574 669754486 669642487 669638901 669662781 669668961 669407272
1989.5 669407272 670129242 670271149 669173889 668012238 668157425 668397446 668307495 668553009 668527298 668971786
1999.2 668971786 668686371 668557510 668450851 667959137 667888794 667375488 667251129 666957855 666653671 666478500
$$ packed form
1930.7F73227386j62506J14441l26538J23673j10092j2284J36261l06778K63672j88522
1940.3F72758713J256790K92892k513198o2180Q84857K2125l73230K17820k11945K45285
1950F72517929N07965k50091m89731n50919J7319k67716M3793J00022N5236J08109
1959.6F71791916P629J25580o87408j24359j48392P4539M10156m65622m13055J31531
1969.3F70702515O69632l68271q7281J42365k81372J06125m46778k19268J79977O47125
1978.9F71044769k27737l69797J06049m51279L3569l81088j11999l586K3880O180k61689
1989.5F69407272P21970J41907j097260j161651J45187K40021q9951K45514k5711M44488
1999.2F68971786k85415j28861j06659m91714p0343n13306j24359k93274l04184j75171
$$ plain form
2008.8 666478500 666647568 666902390 666440048 666190338 665812302 665888748 666235428 666085587 665226135 664995880
2018.5 664995880 665454636 665379181 665531235 665062485 664598694 664130630 663576431 663495102 663260651 663211899
2028.1 663211899 662975311 663044968 662940216 662941895 662931213 662637939 662526474 661846313 661739349 661700974
2037.7 661700974 661694183 661433716 661231995 661417160 660993881 661105042 660546570 660115738 659920578 659654617
2047.4 659654617 659767075 659506378 659807434 659617004 659682770 659835129 659663925 659359436 658685989 658730621
2057 658730621 658405685 658614197 658812180 658760071 658869095 658690796 658735580 657990265 657807236 657786179
2066.7 657786179 657785568 657856216 657497864 657478561 657037811 657195969 657323456 657137070 657086029 656972275 656920853
2077.3 656920853 656556396 656459427 656304092 656306381 656072388 656188660 656351242 655815582 655767365 655396271
$$ packed form
2008.8F66478500J69068K54822m62342k49710l78036P6446L46680j49841q59452k30255
2018.5F64995880M58756p5455J52054m68750m63791m68064n54199q1329k34451m8752
2028.1F63211899k36588O9657j04752J679j0682k93274j11465o80161j06964l8375
2037.7F61700974o791k60467k01721J85165m23279J11161n58472m30832j95160k65961
2047.4F59654617J12458k60697L01056j90430O5766J52359j71204l04489o73447M4632
2057F58730621l24936K08512J97983n2109J09024j78299M4784p45315j83029k1057
2066.7F57786179o11P0648l58352j9303m40750J58158J27487j86386n1041j13754n1422
2077.3F56920853l64457r6969j55335K289k33993J16272J62582n35660m8217l71094
$$ plain form
2086.9 655396271 655184250 655192719 655324631 655199661 654929581 655139465 654826813 654592819 654245300 654179535
2096.6 654179535 653982010 653549118 653385696 653164368 653519592 653414536 653247070 652903366 652769623 652889023
2106.2 652889023 652395477 652161255 651782379 651997070 652045288 651889496 651818542 651337585 651253815 651085739
2115.9 651085739 651055832 650765228 650774078 650638428 650202179 650432816 650450592 650160370 649429626 649575119
2125.5 649575119 649808502 649578857 649731522 649844971 649945602 649662018 649998703 650062256 649868698 649592209
2135.1 649592209 648871613 648708725 648655472 648999786 648971024 649281235 649497528 649277649 649598389 649309616
2144.8 649309616 649033127 648651047 648683014 648694534 648903046 649249802 648647537 648694382 648754959 649217148
2154.4 649217148 649145279 648614578 648810272 648795242 649089279 648783417 648675385 648792953 649009399 649263458
$$ packed form
2086.9F55396271k12021Q469J31912j24970k70080K09884l12652k33994l47519o5765
2096.6F54179535j97525m32892j63422k21328L55224j05056j67466l43704j33743J19400
2106.2F52889023m93546k34222l78876K14691M8218j55792p0954m80957q3770j68076
2115.9F51085739k9907k90604Q850j35650m36249K30637J7776k90222p30744J45493
2125.5F49575119K33383k29645J52665J13449J00631k83584L36685O3553j93558k76489
2135.1F49592209p20596j62888n3253L44314k8762L10211K16293k19879L20740k88773
2144.8F49309616k76489l82080L1967J1520K08512L46756o02265M6845O0577M62189
2154.4F49217148p1869n30701J95694j5030K94037l05862j08032J17568K16446K54059
$$ plain form
2164.1 649263458 649032516 649078674 648835983 649103394 649106979 649019241 649160309 649039917 649121933 649021683
2173.7 649021683 649339752 649201660 649012375 648807068 648796387 649056778 648966522 649589691 649374466 649117432
2183.4 649117432 649415283 649710617 649735336 649260254 649457550 649398880 649447098 649339981 649569626 650121765
2193 650121765 649989014 650027924 649665070 649488831 649322510 649476547 649836731 649997482 650314865 650176392
2202.6 650176392 650298538 650052872 649797211 649647827 649763947 650142441 650085678 650326233 650108643 650195236
2212.3 650195236 650169830 649999619 650185165 650002670 650014267 649841843 649955139 649939270 650056992 650182190
2221.9 650182190 650143585 650414505 650133209 650163040 649980087 650051651 650281219 650028534 649970093 649847641
2231.6 649847641 649844513 649467163 649827194 650219727 650069427 649897079 649453812 649907532 650191803 649950104
$$ packed form
2164.1F49263458k30942M6158k42691K67411L585q7738J41068j20392Q2016j00250
2173.7F49021683L18069j38092j89285k05307j0681K60391r0256O23169k15225k57034
2183.4F49117432K97851K95334K4719m75082J97296n8670M8218j07117K29645N52139
2193F50121765j32751L8910l62854j76239j66321J54037L60184J60751L17383j38473
2202.6F50176392J22146k45666k55661j49384J16120L78494n6763K40555k17590Q6593
2212.3F50195236k5406j70211J85546j82495J1597j72424J13296j5869J17722J25198
2221.9F50182190l8605K70920k81296K9831j82953P1564K29568k52685n8441j22452
2231.6F49847641l128l77350L60031L92533j50300j72348m43267M53720K84271k41699
$$ plain form
2241.2 649950104 649631882 649722595 649836655 649822922 650086517 649821167 649743652 649365311 649403305 649620209
2250.9 649620209 649296875 649415588 649358902 649332581 649403076 649878693 649760818 649318237 649312668 649162674
2260.5 649162674 649142380 648776932 648883514 648856812 649256973 649861069 649699707 649741211 649195480 649050446
2270.2 649050446 648939209 648752289 648483810 648412170 648925629 648707962 648930817 648659134 648242264 648075409
2279.8 648075409 648043442 648332825 648036499 648387222 648097534 647598190 647293777 647327042 647911301 647771683
2289.4 647771683 648115845 647780228 647409439 647253723 647048798 647399750 647471619 647908936 647560043 647516708
2299.1 647516708 647692261 647298584 647100754 646935730 647467575 647201004 647074890 647419739 647513657 647511749
2308.7 647511749 647345352 648008347 648054657 647955170 647692795 647176437 647571945 647750168 647577438 647956772
$$ packed form
2241.2F49950104l18222R0713J14060j3733K63595k65350p7515l78341L7994K16904
2250.9F49620209l23334J18713n6686k6321P0495M75617j17875m42581n569j49994
2260.5F49162674k0294l65448J06582k6702M00161O04096j61362M1504n45731j45034
2270.2F49050446j11237j86920k68479p1640N13459k17667K22855k71683m16870j66855
2279.8F48075409l1967K89383k96326L50723k89688m99344l04413L3265N84259j39618
2289.4F47771683L44162l35617l70789j55716k04925L50952P1869M37317l48893m3335
2299.1F47516708J75553l93677j97830j65024N31845k66571j26114L44849R3918j908
2308.7F47511749j66397O62995M6310r9487k62375n16358L95508J78223j72730L79334
$$ plain form
2318.4 647956772 648955154 648518829 647584381 648163223 648855438 648346329 648079376 648371124 647857666 648001862
2328 648001862 648336716 648862000 649031448 648518372 648371048 647933121 648179474 648267441 648384171 648004608
2337.7 648004608 647603760 647700195 647132721 646997070 646351929 646649399 647039795 646456146 645952301 644138336
2347.3 644138336 642722702 643527222 645160217 645824127 646587448 646836853 647522354 648577728 648610764
2356 648610764 650335007 650091629 649701462 649755859 648577805 646830673 646093521 646597290 644471588
2364.7 644471588 644622574 644725037 643144684 642892151 643256531 643809052 642692566 641375656 640268860
2373.3 640268860 639773331 638871841 637490120 636968689 636168594 635628891 635376167 635085907 634323311
2382 634323311 633938751 633985100 633416176 633087425 632643051 632216911 632057457 631980438 631606331 631290817
$$ packed form
2318.4F47956772R98382m36325r34448N78842O92215n09109k66953K91748n13458J44196
2328F48001862L34854N25284J69448n13076j47324m37927K46353Q7967J16730l79563
2337.7F48004608m00848R6435n67474j35651o45141K97470L90396n83649n03845j813965
2347.3F44138336j415634Q04520J632995O63910P63321K49405O85501J055374L3036
2356F48610764J724243k43378l90167N4397j178054j747132p37152N03769k125702
2364.7F44471588J50986J02463j580353k52533L64380N52521j116486j316910j106796
2373.3F40268860m95529r01490j381721n21431q00095n39703k52724k90260p62596
2382F34323311l84560M6349n68924l28751m44374m26140j59454p7019l74107l15514
$$ plain form
2391.7 631290817 631326447 630877838 630820122 630593719 630244446 630168648 629932327 629462242 628872375 629199486
2401.3 629199486 629271584 628972702 628472137 627950554 627767067 627190666 626886253 626492004 626299896 625962715
2410.9 625962715 625460320 625430031 625355492 625341454 625001106 624881020 624318390 623618431 623473015 623187561
2420.6 623187561 622872543 622190895 622073860 622273598 622321320 621874008 621082153 620755768 620163498 619743538
2430.2 619743538 619543610 619424744 618830414 618409500 618433228 617900352 617843437 617224121 616181450 615878448
2439.9 615878448 615913048 615905762 615870018 615855446 615254669 615024452 614700623 613894615 613286934 613007317
2449.5 613007317 612759171 611985664 611860924 611841011 611580658 611501808 611198997 610613708 609918671 609626770
2459.2 609626770 609232674 608710709 608099403 607930031 607894745 607640305 607475739 606776428 606394081 605921402
$$ packed form
2391.7F31290817L5630m48609n7716k26403l49273p5798k36321m70085n89867L27111
2401.3F29199486P2098k98882n00565n21583j83487n76401l04413l94249j92108l37181
2410.9F25962715n02395l0289p4539j4038l40348j20086n62630o99959j45416k85454
2420.6F23187561l15018o81648j17035J99738M7722m47312p91855l26385n92270m19960
2430.2F19743538j99928j18866n94330m20914K3728n32876n6915o19316j042671l03002
2439.9F15878448L4600p286l5744j4572o00777k30217l23829q06008o07681k79617
2449.5F13007317k48146p73507j24740j9913k60353p8850l02811n85289o95037k91901
2459.2F09626770l94096n21965o11306j69372l5286k54440j64566o99311l82347m72679
$$ plain form
2468.8 605921402 605535126 605223656 604710236 604342499 603489418 603365669 603251686 602868347 602408562 601862984
2478.5 601862984 601627808 600799637 600443039 600047798 599537544 599303131 598874283 598519554 598067093 597963905
2488.1 597963905 597458076 596692200 595977783 595565910 595543556 595223045 594944153 594501953 594226723 593591232
2497.7 593591232 592916031 592636185 592020149 591190224 590448799 590516739 590332031 589923096 589635963 589086113
2507.4 589086113 588529282 587897949 587501831 586888390 586474533 585979233 585466156 584984093 584511337 584669876
2517 584669876 584114838 583807487 583628807 583000908 582679558 582436447 582207375 581395226 580962219 580708923
2526.7 580708923 580508537 580181923 579214020 578676567 578388023 578367844 578004761 577565956 577142792 576553764
2536.3 576553764 576299858 575806580 575431976 575048256 574865341 574388466 573787231 573575249 573156204 573102875
$$ packed form
2468.8F05921402l86276l11470n13420l67737q53081j23749j13983l83339m59785n45578
2478.5F01862984k35176q28171l56598l95241n10254k34413m28848l54729m52461j03188
2488.1E97963905n05829p65876p14417m11873k2354l20511k78892m42200k75230o35491
2497.7E93591232o75201k79846o16036q29925p41425O7940j84708m08935k87133n49850
2507.4E89086113n56831o31333l96118o13441m13857m95300n13077m82063m72756J58539
2517E84669876n55038l07351j78680o27899l21350k43111k29072q12149m33007k53296
2526.7E80708923k00386l26614r67903n37453k88544k0179l63083m38805m23164n89028
2536.3E76553764k53906m93278l74604l83720j82915m76875o01235k11982m19045n3329
$$ plain form
2546 573102875 572615013 571928902 571452408 571154861 571049347 570475540 569805984 569307175 569120255 568741455
2555.6 568741455 568569069 568214989 567540741 567187347 566705704 566688538 566359558 565995598 565949402 565545425
2565.2 565545425 564827194 564083710 563795280 563000679 562478104 562231255 561977577 562064323 561788788 561749306
2574.9 561749306 561377869 560656357 560028229 559590683 559202309 558728905 558369255 557668152 557249451 557029457
2584.5 557029457 557173958 557056084 556326141 555911789 555297318 555017166 554754333 554092827 553548546 553187561
2594.2 553187561 552676544 552242012 552038727 551285744 550787468 550476685 550463257 550251579 549394608 548982658
2603.8 548982658 548254662 547685432 547397652 547079506 546612930 546051331 545666924 545021667 544882889 544487686
2613.5 544487686 544024811 543859291 543292694 542587547 541876373 541387024 540511246 539889565 539288139 538689804
$$ packed form
2546E73102875m87862o86111m76494k97547j05514n73807o69556m98809j86920l78800
2555.6E68741455j72386l54080o74248l53394m81643j7166l28980l63960m6196m03977
2565.2E65545425p18231p43484k88430p94601n22575k46849k53678Q6746k75535l9482
2574.9E61749306l71437p21512o28128m37546l88374m73404l59650p01103m18701k19994
2584.5E57029457J44501j17874p29943m14352o14471k80152k62833o61506n44281l60985
2594.2E53187561n11017m34532k03285p52983m98276l10783j3428k11678q56971m11950
2603.8E48982658p27996n69230k87780l18146m66576n61599l84407o45257j38778l95203
2613.5E44487686m62875j65520n66597p05147p11174m89349q75778o21681o01426n98335
$$ plain form
2623.1 538689804 538438454 537876320 537742805 537357368 536755333 535953903 535230560 535068626 534731674 534708672
2632.8 534708672 534455872 533718109 532803764 532306633 532054138 531420670 530834656 530237427 530014267 529574661
2642.4 529574661 528992920 528577766 528199883 527968445 527312279 526645088 526045837 525921211 525934029 525452042
2652 525452042 524731979 524097099 523939781 523383026 522724533 522257805 521765022 521407852 521185379 520888176
2661.7 520888176 520311012 520160942 519721947 519024696 518730087 518661995 518556709 517892342 517159004 516627998
2671.3 516627998 516564941 516427536 515972786 515622063 515351944 515078583 514464340 514229622 513952942 513398285
2681 513398285 512859268 512340088 512117081 511936073 511762695 511127472 510821457 510523071 509880142 509537773
2690.6 509537773 509080467 508911934 508558044 508311653 507894974 507466545 507647896 507310410 506721344 506015396
$$ packed form
2623.1E38689804k51350n62134j33515l85437o02035q01430p23343j61934l36952k3002
2632.8E34708672k52800p37763r14345m97131k52495o33468n86014n97229k23160m39606
2642.4E29574661n81741m15154l77883k31438o56166o67191n99251j24626J2818m81987
2652E25452042p20063o34880j57318n56755o58493m66728m92783l57170k22473k97203
2661.7E20888176n77164j50070m38995o97251k94609o8092j05286o64367p33338n31006
2671.3E16627998o3057j37405m54750l50723k70119k73361o14243k34718k76680n54657
2681E13398285n39017n19180k23007j81008j73378o35223l06015k98386o42929l42369
2690.6E09537773m57306j68533l53890k46391m16679m28429J81351l37486n89066p05948
$$ plain form
2700.3 506015396 505936813 505804710 505146980 504891815 504543877 504364319 504031563 503700447 503398705 503027687
2709.9 503027687 502691536 502358818 502111893 501587791 501430855 500911446 500485954 500469017 499978867 499775047
2719.5 499775047 499651222 499491386 498877487 498400612 498425446 498307724 497923508 497182808 496970291 496735535
2729.2 496735535 496494980 496337929 495964851 495877419 495848770 495936813 495750427 495573730 495302849 494800835
2738.8 494800835 494504700 494268837 494114151 493561897 493035316 492977257 493091393 492882195 492690048 492709274
2748.5 492709274 492404327 492084923 491496010 491068993 490926781 491025772 491112404 490563927 490138092 489865608
2758.1 489865608 489672623 489295540 489155502 489163437 488838539 488561325 487881660 487427368 487156525 486811676
2767.8 486811676 486300850 486116943 486205826 485605316 485682907 485687332 485328674 485056419 484467278 483866692
$$ packed form
2700.3E06015396p8583j32103o57730k55165l47938j79558l32756l31116l01742l71018
2709.9E03027687l36151l32718k46925n24102j56936n19409m25492j6937m90150k03820
2719.5D99775047j23825j59836o13899m76875K4834j17722l84216p40700k12517k34756
2729.2D96735535k40555j57051l73078q7432k8649Q8043j86386j76697k70881n02014
2738.8D94800835k96135k35863j54686n52254n26581n8059J14136k09198j92147J9226
2748.5D92709274l04947l19404n88913m27017j42212R8991Q6632n48477m25835k72484
2758.1D89865608j92985l77083j40038P935l24898k77214o79665m54292k70843l44849
2767.8D86811676n10826j83907Q8883o00510P7591M425l58658k72255n89141o00586
$$ plain form
2777.4 483866692 483007660 482788010 482368660 481973495 482006798 481168480 480363007 480165672 480400467 479929924
2787 479929924 479339256 479267120 478410950 477634239 477246666 476719246 476508942 476240082 475206642 474480438
2796.7 474480438 474315643 473700409 473037071 472656784 472183762 471400261 470777588 470150414 469475594 469171715
2806.3 469171715 468744431 468022537 467340698 466865540 466103363 465355988 464774055 464017372 463158302 462074318
2816 462074318 461300735 460789413 460321617 459596252 458879051 458336639 457390137 456685677 456049614 455232887
2825.6 455232887 454222374 453374329 452771568 451961708 451433449 450719490 449851151 448852844 447881966
2834.3 447881966 447101593 446237984 445441284 444068375 442700043 441252975 439664154 438381729 436959763
2843 436959763 435574455 433927841 432076874 429793968 427632217 426182671 424622269 422786369 421112671
$$ packed form
2777.4D83866692q59032k19650m19350l95165L3303q38318q05473j97335K34795m70543
2787D79929924n90668p2136q56170p76711l87573n27420k10304k68860j033440p26204
2796.7D74480438j64795o15234o63338l80287m73022p83501o22673o27174o74820l03879
2806.3D69171715m27284p21894o81839m75158p62177p47375n81933p56683q59070j083984
2816D62074318p73583n11322m67796p25365p17201n42412r46502p04460o36063q16727
2825.6D55232887j010513q48045o02761q09860n28259p13959q68339r98307r70878
2834.3D47881966p80373q63609p96700j372909j368332j447068j588821j282425j421966
2843D36959763j385308j646614j850967k282906k161751j449546j560402j835900j673698
$$ plain form
2851.7 421112671 419896164 418709450 418272362 418249855 418094139 418098793 417740097 417637901 417435951 416982651
2861.3 416982651 416631966 416507149 416150131 415238876 414908905 414494362 413770027 412668533 411305008
2870 411305008 410764885 410673828 410175018 409073296 408573570 408162193 407298431 406573601 405878181 405443039
2879.6 405443039 404928246 404537086 403736382 402374687 401414795 400772209 399983521 398773842 398045387
2888.3 398045387 397672310 396790428 395444489 394497681 394191170 393429184 392719765 392240334 391359138
2897 391359138 390334244 389511909 388983269 388559189 388041306 387158241 386252594 385590744 384837418 383912010
2906.6 383912010 383187790 382359276 381322632 380521507 379475441 378405113 377426605 376406288 374935379
2915.3 374935379 373078346 372017632 371200485 370187721 368928146 367712440 366838112 366037941 365666656
$$ packed form
2851.7D21112671j216507j186714m37088k2507j55716M654l58696j02196k01950m53300
2861.3D16982651l50685j24817l57018r11255l29971m14543p24335j101494j363525
2870D11305008n40123r1057m98810j101722m99726m11377q63762p24830o95420m35142
2879.6D05443039n14793l91160q00704j361695r59892o42586p88688j209679p28455
2888.3C98045387l73077q81882j345939r46808l06511p61986p09419m79431q81196
2897C91359138j024894q22335n28640m24080n17883q83065r05647o61850p53326r25408
2906.6C83912010p24220q28514j036644q01125j046066j070328r78508j020317j470909
2915.3C74935379j857033j060714q17147j012764j259575j215706q74328q00171l71285
$$ plain form
2924 365666656 365506973 365244293 364406891 364198608 364921913 365138969 365208702 365166092 365523186 366135101
2933.6 366135101 366397743 366570702 366677437 367168045 367909317 368424263 368622932 369316139 370356407
2942.3 370356407 371006203 371541786 371810799 372300987 373133011 373728714 374124374 374505768 375309296 376374054
2952 376374054 376657295 376713982 377362823 377674179 377726746 377695007 378045921 378988495 379472046 379887047
2961.6 379887047 380612793 381321716 381871147 382681847 383258667 383358650 383919907 384642448 385612259 386490250
2971.2 386490250 386942139 387447853 388217392 388793907 388918610 389550018 390108070 390428848 390944328 391482658
2980.9 391482658 391802368 391657143 391624489 391632195 392486038 393385429 393119583 393140564 393626938 393976402
2990.5 393976402 393711472 393273201 392964287 392655563 392590561 392625198 392603416 392305984 391951103 391405754
$$ packed form
2924C65666656j59683k62680q37402k08283P23305K17056O9733m2610L57094O11915
2933.6C66135101K62642J72959J06735M90608P41272N14946J98669O93207J040268
2942.3C70356407O49796N35583K69013M90188Q32024N95703L95660L81394Q03528J064758
2952C76374054K83241N6687O48841L11356N2567l1739L50914R42574M83551M15001
2961.6C79887047P25746P08923N49431Q10700N76820R9983N61257P22541R69811Q77991
2971.2C86490250M51889N05714P69539N76515J24703O31408N58052L20778N15480N38330
2980.9C91482658L19710j45225l2654P706Q53843Q99391k65846K0981M86374L49464
2990.5C93976402k64930m38271l08914l08724o5002L4637k1782k97432l54881n45349
$$ plain form
3000.2 391405754 391314659 391509094 391035881 390333138 389712791 389420662 388909988 388376312 387834511 387449417
3009.8 387449417 387513351 387089844 386508675 385678177 385217361 384705048 383682404 383329697 382942696 382414513
3019.5 382414513 381586380 380770950 380128632 379456215 379095879 378328018 377447281 376677322 376174278 375504341
3029.1 375504341 374591255 374179459 373775139 373239365 372220306 371508217 371263275 370585289 369672279
3037.8 369672279 368536034 367951355 367604446 366579285 365458336 364896736 364336739 363411636 362813339
3046.5 362813339 362321701 361666679 361031227 360278702 359319420 358483353 357544403 356466064 355856857
3055.1 355856857 355236588 354501724 353658257 352840958 352598457 352294922 351262512 350369682 350087357
3063.8 350087357 349313164 348597984 348172340 347463417 346977234 346298027 345255585 344504242 344184418
$$ packed form
3000.2C91405754r1095J94435m73213p02743o20347k92129n10674n33676n41801l85094
3009.8C87449417O3934m23507n81169q30498m60816n12313j022644l52707l87001n28183
3019.5C82414513q28133q15430o42318o72417l60336p67861q80737p69959n03044o69937
3029.1C75504341r13086m11796m04320n35774j019059p12089k44942o77986r13010
3037.8C69672279j136245n84679l46909j025161j120949n61600n59997r25103n98297
3046.5C62813339m91638o55022o35452p52525r59282q36067r38950j078339o09207
3055.1C55856857o20269p34864q43467q17299k42501l03535j032410q92830k82325
3063.8C50087357p74193p15180m25644p08923m86183o79207j042442p51343l19824
$$ plain form
3072.5 344184418 343547554 343137894 342773743 341735878 341098785 340377922 339688263 339068413 338559532
3081.2 338559532 338385124 337435722 336821899 336539154 335881195 335104942 334285355 333804207 333197556 332507095
3090.8 332507095 331827621 331296349 330696068 329923935 329577179 329145927 328605042 328118515 327201767 325986824
3100.5 325986824 325260162 324865456 324495201 324102821 323329659 322782135 322293396 321765404 321251106 320214920
3110.1 320214920 319211597 318621559 318242664 317549324 316856384 316215572 315378895 314923534 314287910
3118.8 314287910 313831081 313754444 313090191 312079048 310932064 309995804 309460583 308982372 308448658
3127.5 308448658 307436543 306343250 305595093 305088787 304884968 303997478 303028240 302783661 302272053
3136.1 302272053 301540985 300535946 299943314 299965458 299342041 298120766 297092514 296620502 295910187
$$ packed form
3072.5C44184418o36864m09660l64151j037865o37093p20863o89659o19850n08881
3081.2C38559532j74408r49402o13823k82745o57959p76253q19587m81148o06651o90461
3090.8C32507095o79474n31272o00281p72133l46756m31252n40885m86527r16748j214943
3100.5C25986824p26662l94706l70255l92380p73162n47524m88739n27992n14298j036186
3110.1C20214920j003323n90038l78895o93340o92940o40812q36677m55361o35624
3118.8C14287910m56829p6637o64253j011143j146984r36260n35221m78211n33714
3127.5C08448658j012115j093293p48157n06306k03819q87490r69238k44579n11608
3136.1C02272053p31068j005039n92632K2144o23417j221275j028252m72012p10315
$$ plain form
3144.8 295910187 295222855 294844685 294241962 293769093 293002090 291916943 291164627 290854816 290147743
3153.5 290147743 289221439 289016533 288377895 287318096 286630745 285952358 285351067 284880581 284151955
3162.2 284151955 283285542 282724686 282010574 281255627 280798531 280225506 279453697 278659382 277954140 277141819
3171.8 277141819 276460209 276173687 275613651 274523735 273760052 273267078 272688675 272269783 271494999
3180.5 271494999 270543957 269780159 269336624 268932362 268064499 267648392 267544994 266858330 265686684
3189.2 265686684 264827900 264287033 263388119 262913399 263071957 262766075 261798630 261174793 260775185 260193176
3198.8 260193176 259728565 258788757 257849541 257403717 256903133 256212864 255672321 255130577 254240894 253927803
3208.5 253927803 253634109 252659359 252048378 251877022 251646042 251002064 250394058 250118313 249617481 249040165
$$ packed form
3144.8B95910187o87332l78170o02723m72869p67003j085147p52316l09811p07073
3153.5B90147743r26304k04906o38638j059799o87351o78387o01291m70486p28626
3162.2B84151955q66413n60856p14112p54947m57096n73025p71809p94315p05242q12321
3171.8B77141819o81610k86522n60036j089916p63683m92974n78403m18892p74784
3180.5B71494999r51042p63798m43535m04262q67863m16107j03398o86664j171646
3189.2B65686684q58784n40867q98914m74720J58558l05882r67445o23837l99608n82009
3198.8B60193176m64611r39808r39216m45824n00584o90269n40543n41744q89683l13091
3208.5B53927803k93694r74750o10981j71356k30980o43978o08006k75745n00832n77316
$$ plain form
3218.1 249040165 248550034 247574635 246718426 246441402 245971508 245496197 244717560 243791485 243717136 243803844
3227.8 243803844 243539543 243094845 242286530 241394253 240988960 240703640 240194130 239676208 239100876 238262920
3237.4 238262920 237564240 237530346 237145081 236657810 236627369 236285000 235828648 235234966 235161781 235103188
3247 235103188 234107380 233341961 232963848 232653561 232356033 231880817 231436367 231310482 231140270 230575562
3256.7 230575562 229786224 228946972 228384895 227742519 227239780 227217331 227051964 226724472 226373749 226055088
3266.3 226055088 226074257 226329041 225922852 225291538 224891281 224373150 224160995 224003983 223911152 223266392
3276 223266392 222357883 222337017 222188492 222036533 221941833 221294861 220708027 220571709 220042877 219179554
3285.6 219179554 219216080 219198360 218640709 218628483 218805923 218246269 217578678 217275124 216713982 216616344
$$ packed form
3218.1B49040165m90131r75399q56209k77024m69894m75311p78637r26075p4349Q6708
3227.8B43803844k64301m44698q08315q92277m05293k85320n09510n17922n75332q37956
3237.4B38262920o98680l3894l85265m87271l0441l42369m56352n93682p3185n8593
3247B35103188r95808p65419l78113l10287k97528m75216m44450j25885j70212n64708
3256.7B30575562p89338q39252n62077o42376n02739k2449j65367l27492l50723l18661
3266.3B26055088J9169K54784m06189o31314m00257n18131k12155j57012r2831o44760
3276B23266392r08509k0866j48525j51959r4700o46972n86834j36318n28832q63323
3285.6B19179554L6526j7720n57651j2226J77440n59654o67591l03554n61142r7638
$$ plain form
3295.3 216616344 216658611 216297626 216009960 215400219 214941883 214933739 214874954 214653988 214483032 214326725
3304.9 214326725 214018307 213599796 213002949 212551117 212413654 212458286 212375088 211883411 211214466 210668011
3314.6 210668011 210141621 209541016 209294548 209174690 208785210 208442249 208557091 208270741 207301350 207050362
3324.2 207050362 206735687 206003971 205428066 204792633 204592285 204121475 203406544 203373795 203489857 202877636
3333.8 202877636 202184219 202103176 201579494 200857964 200197353 199649677 199613285 199214306 198714771 198255272
3343.5 198255272 197787991 197517757 196941490 196610794 196591930 196436825 196020260 195272179 195035400 195153275
3353.1 195153275 194915676 194683933 194570503 194080982 193385334 193448162 193434143 192617474 192164516 192342281
3362.8 192342281 192629623 192159729 191602554 191474590 190904636 190546494 190166759 189848824 189964485 189876213
$$ packed form
3295.3B16616344M2267l60985k87666o09741m58336q144n8785k20966j70956j56307
3304.9B14326725l08418m18511n96847m51832j37463M4632q3198m91677o68945n46455
3314.6B10668011n26390o00605k46468j19858l89480l42961J14842k86350r69391k50988
3324.2B07050362l14675p31716n75905o35433k00348m70810p14931l2749J16062o12221
3333.8B02877636o93417q1043n23682p21530o60611n47676l6392l98979m99535m59499
3343.5A98255272m67281k70234n76267l30696j8864j55105m16565p48081k36779J17875
3353.1A95153275k37599k31743j13430m89521o95648O2828j4019q16669m52958J77765
3362.8A92342281K87342m69894n57175j27964n69954l58142l79735l17935J15661q8272
$$ plain form
3372.4 189876213 189665833 189349346 189328232 189499912 189426670 188818989 188180237 188521824 188957958 188795280
3382.1 188795280 188329582 187798920 187387753 187507076 187701244 187542191 187536602 187164669 187010727 187413902
3391.7 187413902 187661381 187325211 186448803 186214199 186103973 186150475 186731567 186610260 186301270 186395836
3401.3 186395836 186352711 186353264 186926804 187019825 186630077 186694298 186537933 186247845 185936241 185717831 185985641
3412 185985641 186121769 186040382 186387939 186885223 186776848 186528244 186746941 187287750 187549953 187518578
3421.6 187518578 187485046 187157269 187043304 187544613 188012390 188004665 188218708 188518200 188602962 188915825
3431.2 188915825 188912621 188983994 189523106 189987583 190068874 190223007 190646973 190843639 191639118 192596264
3440.9 192596264 192703571 192273941 192232342 192681389 193068390 193788414 193737144 193558998 194380646 195266342
$$ packed form
3372.4A89876213k10380l16487k1114J71680p3242o07681o38752L41587M36134j62678
3382.1A88795280m65698n30662m11167J19323J94168j59053n589l71933j53942M03175
3391.7A87413902K47479l36170q76408k34604j10226M6502N81092j21307l08990R4566
3401.3A86395836m3125N53N73540R3021l89748O4221j56365k90088l11604k18410K67810
3412A85985641J36128q1387L47557M97284j08375k48604K18697N40809K62203l1375
3421.6A87518578l3532l27777j13965N01309M67777p725K14043K99492Q4762L12863
3431.2A88915825l204P1373N39112M64477Q1291J54133M23966J96666P95479R57146
3440.9A92596264J07307m29630m1599M49047L87001P20024n1270j78146Q21648Q85696
$$ plain form
3450.5 195266342 195900192 195827675 195998173 196469402 196610718 197070713 197900829 198840542 199539318 200181541
3460.2 200181541 200611992 200951672 200936604 201003704 202207699 203097954 203408585 203564529 203951836 205044689
3469.8 205044689 205800533 206060562 206434460 207406101 208455372 209008255 209430008 209678516 210383987
3478.5 210383987 211632710 212032814 211968307 212478027 213162422 213899899 214304104 215019951 216227779
3487.2 216227779 216887836 217469501 218299236 219406948 219877663 220070381 220944138 221679306 222401409
3495.8 222401409 222856617 223618336 224718227 225370903 226229954 227434883 228670254 229090443 229080276
3504.5 229080276 229633846 230859470 232201614 233337383 233874550 233656483 234394646 235463314 236794186
3513.2 236794186 238019791 238276844 238854790 239606686 240970287 242587090 243376617 244049187 245000706
$$ packed form
3450.5A95266342O33850p2517J70498M71229J41316M59995Q30116R39713O98776O42223
3460.2B00181541M30451L39680j5068O7100J203995Q90255L10631J55944L87307J092853
3469.8B05044689P55844K60029L73898R71641J049271N52883M21753K48508P05471
3478.5B10383987J248723M00104o4507N09720O84395P37477M04205P15847J207828
3487.2B16227779O60057N81665Q29735J107712M70715J92718Q73757P35168P22103
3495.8B22401409M55208P61719J099891O52676Q59051J204929J235371M20189j0167
3504.5B29080276N53570J225624J342144J135769N37167k18067P38163J068668J330872
3513.2B36794186J225605K57053N77946P51896J363601J616803P89527O72570R51519
$$ plain form
3521.9 245000706 245814552 246470337 247739811 248684692 249233055 249905949 251072083 252135620 252993336
3530.6 252993336 254403419 255198898 256112328 256941814 258159695 260129223 261005669 261814709 262565403
3539.2 262565403 263906860 265224571 266211281 267422657 268339882 269870949 271097164 272407436 272903843
3547.9 272903843 273808098 275586281 277242470 279521751 279992809 281180077 282501621 283404026 285596008
3556.6 285596008 286799450 288277111 289751396 291029987 292018738 293632221 295390091 296328659 300153866
3565.3 300153866 302741585 303581829 303927746 303066292 305777626 307722855 309163818 311113453 313067341
3574 313067341 314364586 315595436 317800503 318789310 321083145 323137856 323825531 325465279 327720490
3582.6 327720490 329870758 331084213 334950752 338427238 338869896 339890251 338634720 341019554
$$ packed form
3521.9B45000706Q13846O55785J269474R44881N48363O72894J166134J063537Q57716
3530.6B52993336J410083P95479R13430Q29486J217881J969528Q76446Q09040P50694
3539.2B62565403J341457J317711R86710J211376R17225J531067J226215J310272M96407
3547.9B72903843R04255J778183J656189K279281M71058J187268J321544R02405K191982
3556.6B85596008J203442J477661J474285J278591R88751J613483J757870R38568L825207
3565.3C00153866K587719Q40244L45917q61454K711334J945229J440963J949635J953888
3574C13067341J297245J230850K205067R88807K293835K054711O87675J639748K255211
3582.6C27720490K150268J213455L866539L476486M42658J020355j255531K384834
$$ plain form
3590.4 341019554 344441910 347421074 349402885 350447044 353193665 353077087 355363388 359266624
3598.1 359266624 360641098 363415070 364943810 365966454 368266373 370335617 372524643 375577507
3605.8 375577507 379096527 379666138 382815819 383979568 383125381 389436760 392628937 391645622 395463867
3614.5 395463867 396330185 399594345 403760147 404647484 406568527 407855759 409831619 412805481 415749130
3623.1 415749130 418535118 421699371 424779282 427501678 433684349 437019119 430337563 432691231
3630.9 432691231 436271439 441204109 444792213 445074310 447350883 450640411 453577881 455171165
3638.6 455171165 456917648 459975700 463843575 466065445 467112846 470185928 474767380 482128448
3646.3 482128448 484464149 481250725 485981178 486890259 484666557 483680878 488525963 494076729 499298019
$$ packed form
3590.4C41019554L422356K979164J981811J044159K746621j16578K286301L903236
3598.1C59266624J374474K773972J528740J022644K299919K069244K189026L052864
3605.8C75577507L519020N69611L149681J163749q54187O311379L192177r83315L818245
3614.5C95463867Q66318L264160M165802Q87337J921043J287232J975860K973862K943649
3623.1D15749130K785988L164253L079911K722396O182671L334770o681556K353668
3630.9D32691231L580208M932670L588104K82097K276573L289528K937470J593284
3638.6D55171165J746483L058052L867875K221870J047401L073082M581452P361068
3646.3D82128448K335701l213424M730453R09081k223702r85679M845085N550766N221290
$$ plain form
3655 499298019 505582314 499953995 500867310 506467094 508497734 510464706 512087021 515140343 516833611
3663.6 516833611 518345985 520551338 521692886 526281471 530153503 531580734 533461418 527464142
3671.4 527464142 528238831 536366997 546572533 548291550 531353378 532072716 539582748 544510498
3679.1 544510498 542269859 542575912 545955620 548563690 550887566 552154541 552663345 556396599 563823891
3687.8 563823891 556731148 551231003 559952736 556724396 555459099 560441513 561270294 562904472
3695.5 562904472 563486633 562980385 564215279 564669571 566823730 569948692 566043625 564168282 569027176
3704.1 569027176 570386086 570488052 571562881 574429588 580051537 573373756 575433655 582309036
3711.9 582309036 568607559 570181198 574618607 575086861 575633202 578218994 580775833 577709312
$$ packed form
3655D99298019O284295n628319R13315N599784K030640J966972J622315L053322J693268
3663.6E16833611J512374K205353J141548M588585L872032J427231J880684n997276
3671.4E27464142P74689Q128166J0205536J719017j6938172P19338P510032M927750
3679.1E44510498k240639L06053L379708K608070K323876J266975N08804L733254P427292
3687.8E63823891p092743n500145Q721733l228340j265297M982414Q28781J634178
3695.5E62904472N82161n06248J234894M54292K154159L124962l905067j875343M858894
3704.1E69027176J358910J01966J074829K866707N621949o677781K059899O875381
3711.9E82309036j3701477J573639M437409M68254N46341K585792K556839l066521
$$ plain form
3719.6 577709312 577752304 584080734 582772331 577109489 581715927 584175568 583720131 580857391 579524002
3728.3 579524002 582958298 584782257 591034813 589848785 581001511 589371643 593153229 584983749
3736 584983749 582580070 583777771 583774185 585590744 589141769 585437737 587510338 600640678 597866287
3744.7 597866287 576461716 583681030 589318161 595836639 595763474 583809853 593794327 591002617
3752.4 591002617 581472778 586677208 590800056 594719963 590071411 590423431 596022072 589047890
3760.1 589047890 586142006 590048790 591837692 592352257 596391029 595072784 589776077 592460480
3767.8 592460480 597778549 600118866 591065102 590394516 593795052 594645157 595841370 595266266 595316315
3776.5 595316315 595763550 599097023 600364418 591744156 592562714 594833412 596122742 599049263 596992645
$$ packed form
3719.6E77709312M2992O328430j308403n662842M606438K459641m55437k862740j333389
3728.3E79524002L434296J823959O252556j186028q847274Q370132L781586q169480
3736E84983749k403679J197701l586J816559L551025l704032K072601J3130340k774391
3744.7E97866287k1404571P219314N637131O518478p3165j1953621R984474k791710
3752.4E91002617r529839N204430M122848L919907m648552L52020N598641o974182
3760.1E89047890k905884L906784J788902N14565M038772j318245n296707K684403
3767.8E92460480N318069K340317r053764o70586L400536Q50105J196213n75104N0049
3776.5E95316315M47235L333473J267395q620262Q18558K270698J289330K926521k056618
$$ plain form
3785.2 596992645 595529594 595925980 596225853 597018089 597031097 597430916 597615318 597663651 596713181 597804527
3794.8 597804527 601908150 599257736 595399323 597282295 601220818 607831383 604017334 592789459
3802.5 592789459 594958801 597371025 601427040 606907425 598584061 593592033 597507629 598741951
3810.2 598741951 599195328 600355873 600271416 601219521 607546654 607705040 591655922 594993782 601338005
3818.9 601338005 607191505 611622849 594278374 592847595 598117523 600324974 602350273 602015190
3826.6 602015190 597934608 598196068 600090523 603666992 606940765 597584686 598408852 606903076 601504555
3835.3 601504555 599443398 608885078 602499542 595727615 603318443 598789330 597025604 603810425
3843 603810425 602431717 598206482 599928970 600712280 600380554 602500801 602761383 604931946 610667343
$$ packed form
3785.2E96992645j463051L96386K99873P92236J3008L99819J84402M8333r50470J091346
3794.8E97804527M103623k650414l858413J882972L938523O610565l814049j1227875
3802.5E92789459K169342K412224M056015N480385q323364m992028L915596J234322
3810.2E98741951M53377J160545q4457R48105O327133J58386j6049118L337860O344223
3818.9F01338005N853500M431344j7344475j430779N269928K207451K025299l35083
3826.6F02015190m080582K61460J894455L576469L273773r356079Q24166Q494224n398521
3835.3F01504555k061157R441680o385536o771927P590828m529113j763726O784821
3843F03810425j378708m225235J722488P83310l31726K120247K60582K170563N735397
$$ plain form
3851.7 610667343 606545219 610200500 596260300 592080994 601316528 601076736 598471680 600092697
3859.4 600092697 602622681 605767136 601647530 600726929 607037735 602830276 595736961 598575020
3867.1 598575020 603451080 611258354 607803535 595382309 596652412 602163277 607161636 598692322
3874.8 598692322 596741638 599836197 600256691 603278885 608412399 604452515 596156769 600438232
3882.6 600438232 602140350 603070679 607720451 596742172 596368294 600202599 601205635 605781937
3890.3 605781937 607085342 598342056 597315331 600472221 599180908 600505219 602067146 604314842
3898 604314842 607685585 598280258 601211700 603880997 598368149 602732124 600588264 598453751 599126892
3906.7 599126892 599438286 600804482 600424919 600441170 600060539 600422859 600998726 600491409 601350060 603121605
$$ packed form
3851.7F10667343m122124L655281j3940200m179306R235534k39792k605056J621017
3859.4F00092697K529984L144455m119606r20601O310806m207459p093315K838059
3867.1E98575020M876060P807274l454819j2421226J270103N510865M998359q469314
3874.8E98692322j950684L094559M20494L022194N133514l959884q295746M281463
3882.6F00438232J702118R30329M649772j0978279l73878L834305J003036M576302
3890.3F05781937J303405q743286j026725L156890j291313J324311J561927K247696
3898F04314842L370743r405327K931442K669297n512848M363975k143860k134513O73141
3906.7E99126892L11394J366196l79563J6251l80631L62320N75867n07317Q58651J771545
$$ plain form
3916.3 603121605 600224152 596013260 599636078 601336937 598279037 599755630 601212883 602591743
3924 602591743 601474113 597708626 598657990 600272865 601588936 601304588 600008354 601023712 599282570
3932.7 599282570 598038979 599209900 598846169 598932877 600081253 599999199 599026985 599115410 600627289
3941.4 600627289 601548004 598252754 597060127 597948074 598031120 600007172 599264908 598966064 599421043
3950.1 599421043 596763039 598139305 599348068 598670959 598694496 598665810 599191513 598737984 598544884
3958.7 598544884 598495903 598671494 598551178 597133102 597222595 597794647 597529907 597209702 597098389 597249107
3968.4 597249107 597619400 597780457 598358612 598699417 598071671 597952423 597860794 597567253 596880379 596996269
3978 596996269 597966156 598105583 598502464 598777084 598203239 597395782 597732582 598236046 597865028 597616920
$$ packed form
3916.3F03121605k897453m210892L622818J700859l057900J476593J457253J378860
3924F02591743j117630l765487R49364J614875J316071k84348j296234J015358j741142
3932.7E99282570j243591J170921l63731Q6708J148376q2054r72214Q8425J511879
3941.4F00627289R20715l295250j192627Q87947Q3046J976052p42264k98844M54979
3950.1E99421043k658004J376266J208763o77109K3537k8686N25703m53529j93100
3958.7E98544884m8981J75591j20316j418076Q9493N72052k64740l20205j11313J50718
3968.4E97249107L70293J61057N78155L40805o27746j19248r1629k93541o86874J15890
3978E96996269R69887J39427L96881K74620n73845q07457L36800N03464l71018k48108
$$ plain form
3987.7 597616920 597230644 597500038 597489395 597523155 597652397 597149162 597402191 597415504 597737350 598253326
3997.3 598253326 597953796 597454491 597429352
4000.2 597429352
$$ packed form
3987.7E97616920l86276K69394j0643L3760J29242n03235K53029J3313L21846N15976
3997.3E98253326k99530m99305k5139
4000.2E97429352
##END=$$ End of the data block
