##TITLE=$$ Begin of the data block
##JCAMP-DX=5.00 $$ ACD/SpecManager v 10.08
##SPECTROMETER/DATA SYSTEM=Varian
##DATE=14 Jan 2013 10:50:10
##DATA TYPE=INFRARED SPECTRUM
##DATA CLASS=XYDATA
##ORIGIN=
##OWNER=
##NPOINTS=3735
##FIRSTX=399.26403809
##LASTX=4000.35498047
##MAXX=4000.35498047
##MINX=399.26403809
##MAXY=67.76434326
##MINY=18.69629478
##XFACTOR=1.0000000000
##YFACTOR=0.000000100000000
##FIRSTY=40.45410156
##DELTAX=0.96440572
##XUNITS=1/CM
##YUNITS=TRANSMITTANCE
##XYDATA=(X++(Y..Y))
$$ plain form
399.3 404541016 407046242 402056503 396484528 389504585 386046181 391922722 396333656 393616409
407 393616409 391485672 398176651 400060616 395843086 396341057 396417274 396077194 393617554 385868111
415.7 385868111 383624840 389729042 390135880 384811134 388459167 388250999 387070694 385654106 389495544
424.3 389495544 393992882 392408600 393496399 393385582 391814423 394135742 392860832 390667076 392318115
433 392318115 391334190 390159645 392537727 395050735 395671349 392467194 388347626 386796417 386378899
441.7 386378899 390963326 396183319 394372139 389499092 386409454 386998978 387947311 387382011 389418716
450.4 389418716 393502312 393135834 390818367 392051773 395124702 397326813 393683395 386397018 386618652
459.1 386618652 386593590 386078606 386146202 384396477 382793961 386313095 391000633 390850029 389408493
$$ packed form
399.3D04541016K505226m989739n571975o979943l458404N876541M410934k717247
407C93616409k130737O690979J883965m217530M97971P6217l40080k459640p749443
415.7C85868111k243271O104202M06838n324746L648033k08168j180305j416588L841438
424.3C89495544M497338j584282J087799j10817j571159K321319j274910k193756J651039
433C92318115r83925j174545K378082K513008O20614l204155m119568j551209m17518
441.7C86378899M584427N219993j811180m873047l089638N89524R48333n65300K036705
450.4C89418716M083596l66478k317467J233406L072929K202111l643418p286377K21634
459.1C86618652k5062n14984O7596j749725j602516L519134M687538j50604j441536
$$ plain form
467.7 389408493 388623276 387412148 385716209 384880066 383748970 385320702 387221031 382748299 377904663
476.4 377904663 375113411 375900154 378475189 377388115 378267136 375114288 372515755 374218826 372717857
485.1 372717857 373070869 372416916 372928581 374854050 372960091 370863800 370846329 371256142 371816864
493.8 371816864 372744408 371986351 373570290 376130905 375650864 373021393 369597282 372018318 375714569
502.5 375714569 371670570 367982941 369614830 370779953 369441948 370600433 368161469 364955254
510.2 364955254 365201759 365922699 366499176 365848198 368303299 369649658 366046753 365190468 365131874
518.9 365131874 362943878 362005997 361675415 361883469 362876358 361195793 360447998 361538277 360186386
527.5 360186386 360014420 360210457 359646454 358567505 356798820 356465225 357525215 358896408 359225502
$$ packed form
467.7C89408493p85217j211128j695939q36143j131096J571732J900329m472732m843636
476.4C77904663k791252P86743K575035j087074Q79021l152848k598533J703071j500969
485.1C72717857L53012o53953N11665J925469j893959k096291j7471M09813N60722
493.8C71816864R27544p58057J583939K560615m80041k629471l424111K421036L696251
502.5C75714569m043999l687629J631889J165123j338005J158485k438964l206215
510.2C64955254K46505P20940N76477o50978K455101J346359l602905q56285n8594
518.9C65131874k187996r37881l30582K08054R92889j680565p47795J090279j351891
527.5C60186386j71966J96037n64003j078949j768685l33595J059990J371193L29094
$$ plain form
536.2 359225502 357434769 355206032 354402504 355128899 356223106 356432343 356301651 356021423 355652580
544.9 355652580 355166931 354136581 353857193 354020691 354338303 353453178 351408997 350451698 350348282
553.6 350348282 351322670 350397949 348359947 347740974 346195793 344346123 344012108 345563316 346154556
562.3 346154556 346065407 345911560 346164970 348954620 349630966 348231888 348389397 348641090 348861122 348510208
571.9 348510208 347644272 347587280 348120422 347744560 346740227 345202370 344297943 345313072 345864258
580.6 345864258 345717201 344672165 344411354 345555954 345081100 344557800 345002594 346097298 346677055
589.3 346677055 346288376 347022705 347621880 348212051 349345398 349322510 349438095 349576416 349292145 349296951
598.9 349296951 349118271 349403763 349525909 349429245 349455376 348335533 346656609 345417290 345154381 344886932
$$ packed form
536.2C59225502j790733k228737q03528P26395J094207K09237j30692k80228l68843
544.9C55652580m85649j030350k79388J63498L17612q85125k044181r57299j03416
553.6C50348282R74388r24721k038002o18973j545181j849670l34015J551208N91240
562.3C46154556q9149j53847K53410K789650O76346j399078J57509K51693K20032l50914
571.9C48510208q65936n6992N33142l75862j004333j537857r04427J015129N51186
580.6C45864258j47057j045036k60811J144600m74854n23300M44794J094704N79757
589.3C46677055l88679P34329N99175N90171J133347k2888J15585J38321k84271M806
598.9C49296951j78680K85492J22146r6664K6131j119843j678924j239319k62909k67449
$$ plain form
608.5 344886932 344433861 344396095 343127785 341915550 342056541 343065529 343484039 342755699 342177353
617.2 342177353 340326157 339451485 341314011 342888718 343606911 344558830 345935059 346269188 345479546
625.9 345479546 346576462 348042107 348349457 349265366 350273170 352385330 354891396 355137329 355667763
634.6 355667763 357876854 359994087 360850601 360840797 361672668 363714066 366296387 368034286 368043633 368398209
644.2 368398209 369982109 370721016 370536041 371490288 372730713 373112183 374070129 375221672 376277580
652.9 376277580 377131500 377897491 378064270 377053719 377019234 376430435 375871048 376373672 375581169 374646912
662.5 374646912 374842072 375905418 376073189 376101456 377664566 379344368 378972511 377686386 376924820
671.2 376924820 378073578 379541855 380818481 381484070 382207832 383724022 385032425 386139946 387376213
$$ packed form
608.5C44886932m53071l7766j268310j212235J40991J008988M18510p28340n78346
617.2C42177353j851196q74672J862526J574707P18193R51919J376229L34129p89642
625.9C45479546J096916J465645L07350R15909J007804K112160K506066K45933N30434
634.6C55667763K209091K117233Q56514r804Q31871K041398K582321J737899R347L54576
644.2C68398209J583900P38907j84975R54247J240425L81470R57946J151543J055908
652.9C76277580Q53920P65991J66779j010551l4485n88799n59387N02624p92503r34257
662.5C74646912J95160J063346J67771K8267J563110J679802l71857j286125p61566
671.2C76924820J148758J468277J276626O65589P23762J516190J308403J107521J236267
$$ plain form
679.9 387376213 387711983 388048782 389273186 390643196 392853050 394477310 394029884 393629761 394636993
688.6 394636993 395965881 397087936 397836456 398481560 399239388 399568367 400496674 401338501 402037888
697.3 402037888 402525749 401917610 401972961 402534447 403803139 405258904 406516304 407352142 406769218
705.9 406769218 407429581 408422699 408746338 409431419 409976540 410891800 411857452 413043861 414190292
714.6 414190292 414314003 414125595 415218811 416700096 417022133 416590233 416208115 416911736 418289604
723.3 418289604 419437370 420099754 421249466 422132072 422509499 423667526 424299278 425333366 426303215
732 426303215 427018547 427823219 427908821 428857841 429397736 429703102 430109787 430285988 430519867 430562019
741.6 430562019 431358948 431952667 432746544 433543930 433843346 434153595 434539642 435320091 436265526 437207069
$$ packed form
679.9C87376213L35770L36799J224404J370010K209854J624260m47426m00123J007232
688.6C94636993J328888J122055P48520O45104P57828L28979R28307Q41827O99387
697.3D02037888M87861o08139N5351N61486J268692J455765J257400Q35838n82924
705.9D06769218O60363R93118L23639O85081N45121R15260R65652J186409J146431
714.6D14190292J23711j88408J093216J481285L22037m31900l82118P03621J377868
723.3D18289604J147766O62384J149712Q82606L77427J158027O31752J034088R69849
732D26303215P15332Q04672Q5602R49020N39895L05366M06685J76201K33879M2152
741.6D30562019P96929N93719P93877P97386K99416L10249L86047P80449R45435R41543
$$ plain form
751.3 437207069 436626282 436698647 438615074 439461746 439352112 440850449 444036789 446050415 446936760
760 446936760 446907654 447360497 448518906 449274635 450163803 450626640 451975632 452122955 451599197 451929016
769.6 451929016 451831093 452542534 453242607 453451195 452446671 452506981 453728981 453787537 453694420 453341331
779.2 453341331 453455582 452995529 453092232 454005165 454620934 455126839 455261765 456336098 456320000 456270142
788.9 456270142 456843109 457143898 457729683 457687149 457651749 457129860 457121620 457207031 456774368 455956535 454993706
799.5 454993706 454318886 453284264 453424492 452219658 449910278 448646355 447646484 447390862 446942253
808.2 446942253 445328140 442798767 441210060 439621811 438312111 437166138 435079269 434625206 434913826
816.9 434913826 434984322 434222679 433066940 432798004 433280563 434605331 436014557 437654648 439416046
$$ packed form
751.3D37207069n80787P2365J916427Q46672j09634J498337L186340K013626Q86345
760D46936760k9106M52843J158409P55729Q89168M62837J348992J47323n23758L29819
769.6D51929016r7923P11441P00073K08588j004524O0310J222000N8556r3117l53089
779.2D53341331J14251m60053R6703R12933O15769N05905J34926J074333j6098m9858
788.9D56270142N72967L00789N85785m2534l5400n21889q240Q5411m32663q17833r62829
799.5D54993706o74820j034622J40228j204834k309380j263923r99871k55622m48609
808.2D46942253j614113k529373j588707j588249j309700j145973k086869m54063K88620
816.9D34913826P0496p61643j155739k68936M82559J324768J409226J640091J761398
$$ plain form
825.5 439416046 442505226 445455170 447671280 450913773 454027023 456895142 458646812 460763741
833.3 460763741 462657051 465094032 468475876 470494766 473315697 475444107 477665672 478756905
841 478756905 478792953 480390396 481965866 483991280 484834709 485961952 487368240 488915558 490440407
849.6 490440407 490954132 492289886 492537422 493280563 495013046 496749191 497624893 498794594 501136703
858.3 501136703 502393570 503713799 503886719 504992294 505870972 505709038 506329193 506477318 507357750
867 507357750 506203575 504958992 503914986 502280121 501144180 499264984 498240166 497237473 496805611
875.7 496805611 495489578 494212570 493744392 492645607 492654991 491936493 490776711 489345970 488589592
884.4 488589592 488026657 487330360 487752228 487034149 486264229 485530663 485442848 485208511 484093819 483971672
$$ packed form
825.5D39416046L089180K949944K216110L242493L113250K868119J751670K116929
833.3D60763741J893310K436981L381844K018890K820931K128410K221565J091233
841D78756905L6048J597443J575470K025414Q43429J127243J406288J547318J524849
849.6D90440407N13725J335754K47536P43141J732483J736145Q75702J169701K342109
858.3E01136703J256867J320229J72920J105575Q78678j61934O20155J48125Q80432
867E07357750j154175j244583j044006j634865j135941j879196j024818j002693m31862
875.7D96805611j316033j277008m68178j098785R384p18498j159782j430741p56378
884.4D88589592n62935o96297M21868p18079p69920p33566q7815k34337j114692j22147
$$ plain form
894 483971672 484093590 484648552 485487328 486454277 486406517 486122437 485912743 485130730 484418449 484093513
903.7 484093513 485817871 487354660 489106140 492027435 494744835 496829147 497716866 498484764 498420105
912.3 498420105 498424568 497310333 495841103 494552422 492523193 491760597 489860802 487248688 484286499
921 484286499 482103958 480327682 477207642 474902458 472034492 469477386 467011147 464200134 461567535
929.7 461567535 458498268 456341209 454503059 452670212 450629807 449030800 447654686 446513023
937.4 446513023 445759773 444372406 443835831 443266525 442061615 440010681 438106537 437679024 436703262
946.1 436703262 435251160 433975563 433849602 433949814 433213882 433030014 432908173 432360382 431307030
954.8 431307030 429546471 427427902 425831833 424099503 421758690 418846741 416173935 414818039
$$ packed form
894D83971672J21918N54962Q38776R66949m7760k84080k09694p82013p12281l24936
903.7D84093513J724358J536789J751480K921295K717400K084312Q87719P67898o4659
912.3D98420105M463j114235j469230j288681k029229p62596j899795k612114k962189
921D84286499k182541j776276l120040k305184k867966k557106k466239k811013k632599
929.7D61567535l069267k157059j838150j832847k040405j599007j376114j141663
937.4D46513023p53250j387367n36575n69306j204910k050934j904144m27513r75762
946.1D36703262j452102j275597j25961J00212p35932j83868j21841n47791j053352
954.8D31307030j760559k118569j596069j732330k340813k911949k672806j355896
$$ plain form
962.5 414818039 412837830 410557671 408858795 407273369 406209030 404972992 402887459 400842896
970.2 400842896 399337234 396576614 393184700 390221024 387008286 383890686 380754967 377331696
977.9 377331696 373161087 369048653 365343399 360625801 355555420 350861473 346199875 342213211
985.6 342213211 338030510 333626633 330181923 326742210 323050194 319582138 316112137 312963943
993.3 312963943 310934162 307977810 304435081 302469234 300377369 297793655 294935188 292499065
1001.1 292499065 289981880 286728249 283720341 281136360 279643593 277954464 275908527 273909168
1008.8 273909168 272330933 271036434 268822765 266860180 265485554 264069920 261888161 259753265
1016.5 259753265 257605267 255880394 254683361 252419739 250397511 248023911 246173172 244821053
$$ packed form
962.5D14818039j980209k280159j698876j585426j064339j236038k085533k044563
970.2D00842896j505662k760620l391914k963676l212738l117600l135719l423271
977.9C77331696m170609m112434l705254m717598n070381m693947m661598l986664
985.6C42213211m182701m403877l444710l439713l692016l468056l470001l148194
993.3C12963943k029781k956352l542729j965847k091865k583714k858467k436123
1001.1B92499065k517185l253631l007908k583981j492767j689129k045937j999359
1008.8B73909168j578235j294499k213669j962585j374626j415634k181759k134896
1016.5B59753265k147998j724873j197033k263622k022228k373600j850739j352119
$$ plain form
1024.2 244821053 242734985 240305176 238083172 237395420 236497974 235730858 234567280 234153843 234332542
1032.9 234332542 232745857 232344284 232577515 233114166 234074421 235839043 237737846 238884621 240004597
1041.6 240004597 240269203 241494083 242676315 243164330 243153000 242491016 241879482 241060104 240687504
1050.2 240687504 239689255 239000702 238016186 236793098 236095772 235073986 234404545 233403206 233724995
1058.9 233724995 234353008 235222950 236552563 237843952 239821548 241314201 243001671 243419704 244325123
1067.6 244325123 245383224 245708313 247155838 247471600 247681122 248178310 248944931 249526253 249535942 249925690
1077.2 249925690 250621986 251239262 251364880 252673473 253646965 254405785 255364170 256316204 257889729
1085.9 257889729 258393612 259437428 261052017 262253780 263232784 264722748 265979786 266763382 268039131
$$ packed form
1024.2B44821053k086068k429809k222004o87752q97446p67116j163578m13437J78699
1032.9B34332542j586685m01573K33231N36651R60255J764622J898803J146775J119976
1041.6B40004597K64606J224880J182232M88015j1330o61984o11534q19378l72600
1050.2B40687504r98249o88553r84516j223088o97326j021786o69441j001339L21789
1058.9B33724995O28013Q69942J329613J291389J977596J492653J687470M18033R05419
1067.6B44325123J058101L25089J447525L15762K09522M97188P66621N81322R689L89748
1077.2B49925690O96296O17276J25618J308593R73492P58820R58385R52034J573525
1085.9B57889729N03883J043816J614589J201763R79004J489964J257038P83596J275749
$$ plain form
1094.6 268039131 268696232 270503483 272426090 273666630 275116673 276269054 277130032 277921677 279730244
1103.3 279730244 281280937 282892742 283914528 284555416 285356064 285200901 286232624 287694283 288700161
1112 288700161 289430790 290563869 291936512 292626343 293108082 293420696 293839817 293089218 293159657 294196262
1121.6 294196262 294287510 293876171 293871727 295218010 295035439 295576916 297239017 297989941 299536667 301089935
1131.2 301089935 303148518 305081177 307687054 310215530 311834927 313818378 314850731 315705814
1139 315705814 317143669 319440041 321471024 322571831 323386688 323914223 324451332 325112991 325763130
1147.6 325763130 325803223 326500130 326829758 326660690 327417259 327518578 327482414 327321968 326750679 325890656
1157.3 325890656 325273666 325264587 324936218 324333992 323845711 324932632 325801430 326108246 327529907 329132233
$$ packed form
1094.6B68039131O57101J807251J922607J240540J450043J152381Q60978P91645J808567
1103.3B79730244J550693J611805J021786O40888Q00648j55163J031723J461659J005878
1112B88700161P30629J133079J372643O89831M81739L12614M19121p50599P0439J036605
1121.6B94196262R1248m11339m444J346283j82571N41477J662101P50924J546726J553268
1131.2C01089935K058583J932659K605877K528476J619397J983451J032353Q55083
1139C15705814J437855K296372K030983J100807Q14857N27535N37109O61659O50139
1147.6C25763130M0093O96907L29628j69068P56569J01319l6164j60446n71289q60023
1157.3C25890656o16990r079l28369o02226m88281J086921Q68798L06816J421661J602326
$$ plain form
1166.9 329132233 331191444 332991447 335095558 338083801 341058273 343626633 346263733 349174995
1174.6 349174995 352111740 355106087 357691078 360276909 362305222 364366989 367157669 369911728
1182.4 369911728 372403717 374505234 376190910 377431755 378413277 378711624 379365959 380650558 381609726
1191 381609726 381819153 381498146 381413574 381125336 380549126 379397316 378301811 377317505 376255379 375568695
1200.7 375568695 374350395 373415909 372672386 371601486 370593872 369505997 368585472 367318916 366252594
1209.4 366252594 365780106 365770073 365815773 365214767 364692497 364030380 363336449 362895432 362278824 361466827
1219 361466827 361075630 360843964 360268936 360410690 359840355 358595161 358123398 357528419 357102966 356427727
1228.6 356427727 355508423 354632111 353778076 353368454 352952614 352480545 351753731 351344299 351127205 350773315
$$ packed form
1166.9C29132233K059211J800003K104111K988243K974472K568360K637100K911262
1174.6C49174995K936745K994347K584991K585831K028313K061767K790680K754059
1182.4C69911728K491989K101517J685676J240845R81522K98347O54335J284599R59168
1191C81609726K09427l21007q4572k88238n76210j151810j095505r84306j062126o86684
1200.7C75568695j218300r34486p43523j070900j007614j087875r20525j266556j066322
1209.4C66252594m72488j0033M5700o01006n22270o62117o93931m41017o16608q11997
1219C61466827l91197k31666n75028J41754n70335j245194m71763n94979m25453o75239
1228.6C56427727r19304q76312q54035m09622m15840m72069p26814m09432k17094l53890
$$ plain form
1238.3 350773315 350437241 349951668 350066147 350103378 350084724 350188942 349725037 349297104 349141960 348735428
1247.9 348735428 348086662 348044395 348165436 348022919 347827950 347616692 347649231 347614517 347216682 346549187
1257.6 346549187 346526680 346804543 346920509 347239456 347487946 347920990 348111992 348303833 348964920 349585953
1267.2 349585953 349934502 350528946 351489868 352662239 353999443 354703026 355670128 356713638 357462234
1275.9 357462234 358370514 359242783 360491104 361592636 362837219 364420395 366072578 367449570 368472519
1284.6 368472519 369641876 371017570 372563477 373646698 374892921 375996017 376955299 377999573
1292.3 377999573 378806305 380030441 380909348 381607132 382206955 382712517 383221169 383383217 383662682
1301 383662682 384390450 385176125 385187645 385253639 385214233 385008049 384881096 384242897 384027214 384249992
$$ packed form
1238.3C50773315l36074m85573J14479L7231j8654J04218m63905m27933j55144m06532
1247.9C48735428o48766m2267J21041j42517j94969k11258L2539l4714l97835o67495
1257.6C46549187k2507K77863J15966L18947K48490M33044J91002J91841O61087O21033
1267.2C49585953L48549N94444R60922J172371J337204P03583R67102J043510P48596
1275.9C57462234R08280Q72269J248321J101532J244583J583176J652183J376992J022949
1284.6C68472519J169357J375694J545907J083221J246223J103096R59282J044274
1292.3C77999573Q06732J224136Q78907O97784N99823N05562N08652J62048K79465
1301C83662682P27768P85675J1520O5994l9406k06184j26953o38199k15683K22778
$$ plain form
1310.6 384249992 384179840 383309135 382556152 382428894 382134476 381653214 381390343 382176208 383001480 383154716
1320.3 383154716 383386307 384220009 385347214 385946045 386527596 386976089 387281303 387538338 387659035
1328.9 387659035 387354317 386798782 386533051 386257896 385723381 385049057 385216446 385319977 385082283 385444946
1338.6 385444946 385584030 385564423 385481644 386193199 386888390 387197838 387905960 388388519 389164658 389774933
1348.2 389774933 390050735 389998093 390039253 389859848 389223061 388995209 388529358 388374290 388217812 387931709
1357.9 387931709 387389183 387202339 387254829 386537857 386649551 385218277 384321899 384579315 384461441 384631500
1367.5 384631500 383973618 383056679 382403641 382383499 382634659 382794800 382938271 382000580 381814346 381855850
1377.2 381855850 382099953 381981621 381454811 380839195 379919128 379116058 377650337 376942902 376772003
$$ packed form
1310.6C84249992p0152q70705p52983j27258k94418m81262k62871P85865Q25272J53236
1320.3C83154716K31591Q33702J127205N98831N81551M48493L05214K57035J20697
1328.9C87659035l04718n55535k65731k75155n34515o74324J67389J03531k37694L62663
1338.6C85444946J39084j9607q2779P11555O95191L09448P08122M82559P76139O10275
1348.2C89774933K75802n2642M1160j79405o36787k27852m65851j55068j56478k86103
1357.9C87931709n42526j86844N2490p16972J11694j431274q96378K57416j17874J70059
1367.5C84631500o57882r16939o53038k0142K51160J60141J43471r37691j86234M1504
1377.2C81855850K44103j18332n26810o15616r20067q03070j465721p07435j70899
$$ plain form
1385.8 376772003 376019135 373844147 372194633 371595497 369953003 368075371 366641541 366045418 364041367
1394.5 364041367 360514603 359168396 357838707 356691513 353119392 350077362 348898163 346848221
1402.2 346848221 345118523 343740959 341526413 339052620 337960014 336969185 335253906 333642273
1409.9 333642273 332024689 331001625 329590683 328227119 327365913 326742554 326440735 325625153 326353645
1418.6 326353645 324624557 323276138 324109077 323940468 324546890 324201431 324703712 325786476 326147385
1427.3 326147385 327258720 327986450 328516960 328770981 330339470 331956444 333357887 335666847 337749443
1436 337749443 338501854 338266411 340731468 342737236 344489288 346260147 347385788 349178963 349964142
1444.7 349964142 351652756 353530464 355448036 356565781 357413864 359540253 360686646 362104721
$$ packed form
1385.8C76772003p52868k174988j649514n99136j642494j877632j433830n96123k004051
1394.5C64041367l526764j346207j329689j147194l572121l042030j179199k049942
1402.2C46848221j729698j377564k214546k473793j092606r90829j715279j611633
1409.9C33642273j617584j023064j410942j363564q61206o23359l01819q15582P28492
1418.6C26353645j729088j348419Q32939j68609O06422l45459N02281J082764L60909
1427.3C26147385J111335P27730N30510K54021J568489J616974J401443K308960K082596
1436C37749443P52411k35443K465057K005768J752052J770859J125641J793175P85179
1444.7C49964142J688614J877708J917572J117745Q48083K126389J146393J418075
$$ plain form
1452.4 362104721 363044357 365067253 367101974 367926979 370113907 370386963 373128128 374109917 376493149
1461.1 376493149 378387451 379626427 381967850 382377701 384811745 387150726 389985161 392498436
1468.8 392498436 395101089 398847389 401549950 404611511 406812057 410318260 413526497 415433540
1476.5 415433540 417966805 420573235 422717819 424948997 427265358 428798790 430572624 431740379
1484.2 431740379 432819595 434921188 436169319 436540489 438147469 438901749 436810112 436375694 436737061
1492.9 436737061 435980377 435537682 435216560 430552979 431025314 430209846 426371689 426132431 425601234
1501.6 425601234 424533501 423533020 424102974 424721451 422223091 418146210 416986084 417806816 417174110
1510.2 417174110 418223343 417986870 416033821 415738106 415263710 415921059 415204468 412028198 413160553
$$ packed form
1452.4C62104721R39636K022896K034721Q25005K186928K73056K741165R81789K383232
1461.1C76493149J894302J238976K341423M09851K434044K338981K834435K513275
1468.8C92498436K602653L746300K702561L061561K200546L506203L208237J907043
1476.5D15433540K533265K606430K144584K231178K316361J533432J773834J167755
1484.2D31740379J079216K101593J248131L71170J606980P54280k091637m34418L61367
1492.9D36737061p56684m42695l21122m663581M72335q15468l838157k39258n31197
1501.6D25601234j067733j000481N69954O18477k498360m076881j160126Q20732o32706
1510.2D17174110J049233k36473j953049k95715m74396O57349p16591l176270J132355
$$ plain form
1518.9 413160553 415613976 415905991 413848839 412362061 412697105 414683647 413480339 413401031 414658089
1527.6 414658089 414686127 415340233 416080971 416779785 417800407 418444328 415014839 415544052 416663132
1536.3 416663132 417617378 420169144 419892044 417066193 417440605 417423859 416457138 417789612 418666687
1545 418666687 416740456 418037796 418705063 419685783 419808502 418508492 419533691 420446396 421844978
1553.6 421844978 419129028 418675537 421183891 424273987 423115807 412269363 412308769 413290825 414640541
1562.3 414640541 413512230 412109413 409349556 406880226 405991478 404136620 404039726 396421509 393785858
1571 393785858 391891632 388440971 386172867 383771782 383076782 371075134 368833809 366151505 362387733
1579.7 362387733 358814545 353478851 350105171 344798470 341446609 336167145 331475105 327575035
$$ packed form
1518.9D13160553K453423K92015k057152j486778L35044J986542j203308p9308J257058
1527.6D14658089K8038O54106P40738O98814J020622O43921l429489N29213J119080
1536.3D16663132R54246K551766k77100k825851L74412j6746r66721J332474Q77075
1545D18666687j926231J297340O67267R80720J22719j300010J025199R12705J398582
1553.6D21844978k715950m53491K508354L090096j158180j0846444L9406R82056J349716
1562.3D14640541j128311j402817k759857k469330q88748j854858r6894p618217k635651
1571C93785858j894226l450661k268104k401085o95000j2001648k241325k682304l763772
1579.7C62387733l573188n335694l373680n306701l351861n279464m692040l900070
$$ plain form
1587.4 327575035 322970161 320084801 314577808 311692696 306725349 303304977 299586353 294922276
1595.1 294922276 292265244 287684631 285960712 281878452 279560184 276265144 273420506 271643333
1602.8 271643333 267566528 266589851 263367958 262352753 259806442 258703327 257450790 254347591
1610.5 254347591 254838619 252501259 252183380 250249825 250779724 251127357 245105782 246831036 245989113
1619.2 245989113 247264900 246070900 247271957 247744179 245537071 246752644 246209698 248248272 246971989
1627.9 246971989 247778149 248336544 248916492 250139046 250318260 253278008 254471283 255883446 253507118
1636.6 253507118 255263424 256051216 256938229 259414005 259533176 262032299 262749271 265141068 267446308
1645.3 267446308 267722969 270648785 269493656 271935711 272595005 275332642 277265396 276188946 276937561
$$ packed form
1587.4C27575035m604874k885360n506993k885112m967347l420372l718624m664077
1595.1B94922276k657032m580613j723919m082260k318268l295040k844638j777173
1602.8B71643333m076805r76677l221893j015205k546311j103115j252537l103199
1610.5B54347591M91028k337360l17879j933555N29899L47633o021575J725254q41923
1619.2B45989113J275787j194000J201057M72222k207108J215573n42946K038574j276283
1627.9B46971989Q06160N58395N79948J222554J79214K959748J193275J412163k376328
1636.6B53507118J756306P87792Q87013K475776J19171K499123P16972K391797K305240
1645.3B67446308K76661K925816j155129K442055O59294K737637J932754j076450P48615
$$ plain form
1653.9 276937561 276829205 281014328 282161674 284141350 285052376 286901703 289471569 291523685 294298630
1662.6 294298630 293919945 297119923 299264832 301993008 304779701 307528076 310409012 311090374 315639992
1671.3 315639992 317172604 320828094 324901314 328228912 330388756 332899361 337367020 340467644
1679 340467644 344841614 347615700 352384605 358504410 360597115 362157021 364551277 371538506 376531067
1687.7 376531067 380526352 384545937 387807236 392651291 397219391 402614861 407956009 413686256
1695.4 413686256 415068703 419479027 426085930 432834854 439181099 435123596 441703644 447077599
1703.1 447077599 451564484 455766487 459327660 461786194 464112701 468365707 471313477 472932739
1710.8 472932739 475242386 478282928 482458572 484380913 484651070 488368568 491819077 487425385
$$ packed form
1653.9B76937561j08356M185123J147346J979676R11026J849327K569866K052116K774945
1662.6B94298630l78685L199978K144909K728176K786693K748375K880936O81362M549618
1671.3C15639992J532612L655490M073220L327598K159844K510605M467659L100624
1679C40467644M373970K774086M768905O119805K092705J559906K394256O987229M992561
1687.7C76531067L995285M019585L261299M844055M568100N395470N341148N730247
1695.4D13686256J382447M410324O606903O748924O346245m057503O580048N373955
1703.1D47077599M486885M202003L561173K458534K326507M253006K947770J619262
1710.8D72932739K309647L040542M175644J922341K70157L717498L450509m393692
$$ plain form
1718.5 487425385 489283333 492798462 494961281 496994286 498383598 498987045 500445862 502111244
1726.3 502111244 503452263 505144730 507333603 507667236 508219147 512346382 517012787 516487923 511455460
1734.9 511455460 514784851 518703690 521012802 524149513 525632439 524485474 528324585 531952782
1742.7 531952782 533302727 535298653 539254417 543064919 546291466 549274864 550769081 555569649
1750.4 555569649 557658691 558466606 563937187 567673492 571361504 575151787 575268440 577010460 580562935
1759 580562935 583907166 587991104 588515472 588692856 592098045 594147682 596042023 598637085 601186066
1767.7 601186066 599778519 601591682 606606712 608261032 606661530 605305252 609543304 611960945
1775.4 611960945 611193657 613370438 614509048 616663208 617953377 617349243 618678665 620477066 622381592
$$ packed form
1718.5D87425385J857948L515129K162819K033005J389312O03447J458817J665382
1726.3E02111244J341019J692467K188873L33633N51911M127235M666405n24864n032463
1734.9E11455460L329391L918839K309112L136711J482926j146965L839111L628197
1742.7E31952782J349945J995926L955764L810502L226547K983398J494217M800568
1750.4E55569649K089042Q07915N470581L736305L688012L790283J16653J742020L552475
1759E80562935L344231M083938N24368J77384L405189K049637J894341K595062K548981
1767.7F01186066j407547J813163N015030J654320j599502j356278M238052K417641
1775.4F11960945p67288K176781J138610K154160J290169o04134J329422J798401J904526
$$ plain form
1784.1 622381592 622241745 622405853 624396248 625814552 626325493 627983475 629569283 631140976 629833527
1792.8 629833527 628561707 632557907 634013901 633432922 634706421 636808319 637642708 636326637 638402710
1801.5 638402710 638853722 639304390 640889435 641305237 642399750 643123779 643500824 644525833 646073608
1810.2 646073608 645138702 645438690 646510696 646708527 648353195 649126740 650256042 650080948 650110855
1818.8 650110855 651407394 651924057 652983627 652566681 653893585 655733643 653440247 653133850 655340271
1827.5 655340271 658190460 659125900 655265732 655215454 657572403 657830124 658111115 658577423 659350357
1836.2 659350357 660112000 659359970 660287704 660648346 661280746 662157822 664392700 666491928 660389252
1844.9 660389252 661421356 663799210 664084015 663767929 663833160 664648209 664720001 665630264 665651321 665840836
$$ packed form
1784.1F22381592j39847J64108J990395J418304N10941J657982J585808J571693j307449
1792.8F29833527j271820L996200J455994n80979J273499K101898Q34389j316071K076073
1801.5F38402710M51012M50668J585045M15802J094513P24029L77045J025009J547775
1810.2F46073608r34906K99988J072006J97831J644668P73545J129302j75094K9907
1818.8F50110855J296539N16663J059570m16946J326904J840058k293396l06397K206421
1827.5F55340271K850189R35440l860168n0278K356949K57721K80991M66308P72934
1836.2F59350357P61643p52030R27734L60642O32400Q77076K234878K099228o102676
1844.9F60389252J032104K377854K84805l16086O5231Q15049P1792R10263K1057J89515
$$ plain form
1854.5 665840836 666101685 666265106 666847000 666677628 667329102 667452545 667936783 667966537 668149719 668490753
1864.2 668490753 668520508 669817581 669981232 671125107 670392685 668232193 669025650 670031509 670805435
1872.8 670805435 670654755 671089554 670810089 670638428 670890274 671105576 671698151 671559372 672060623 671892471
1882.5 671892471 672082214 672210159 672016144 672309647 672223434 673716278 674036331 672355347 672739258
1891.2 672739258 674051514 674325790 674607544 674657669 673325653 673596268 673841629 674290619 674581146
1899.8 674581146 674528656 674938583 674603348 674909668 674816055 674776154 674695206 674909973 675696411 675759811
1909.5 675759811 675545197 674882965 675561447 675625381 675595551 675675430 675874634 677643433 675709991 674260864
1919.1 674260864 675476151 676491547 677245865 676173248 675040054 675135422 675890427 676110764 676259537
$$ packed form
1854.5F65840836K60849J63421N81894j69372O51474J23443M84238K9754J83182L41034
1864.2F68490753K9755J297073J63651J143875p32422k160492P93457J005859P73926
1872.8F70805435j50680M34799k79465j71661K51846K15302N92575j38779N01251j68152
1882.5F71892471J89743J27945j94015K93503q6213J492844L20053j680984L83911
1891.2F72739258J312256K74276K81754N0125j332016K70615K45361M48990K90527
1899.8F74581146n2490M09927l35235L06320r3613l9901q0948K14767P86438O3400
1909.5F75759811k14614o62232O78482O3934k9830P9879J99204J768799j933442j449127
1919.1F74260864J215287J015396P54318j072617j133194R5368P55005K20337J48773
$$ plain form
1927.8 676259537 676127472 676147308 676347046 675950928 676039658 675829086 676235580 676083984 675944214 676166077
1937.5 676166077 675699463 676064682 676027908 677185974 677322540 674771729 674778748 675462265 675309906 674942017
1947.1 674942017 675527954 675829544 675775681 675477066 675104065 675047379 674591446 674572906 674316559 674481964
1956.7 674481964 674569168 674382095 674773712 674801712 674694443 674359589 674362793 673888321 673757553 674559708
1966.4 674559708 674471512 674129562 674255066 674511108 674210052 674208374 674009705 673743134 673663559 673301468
1976 673301468 673462219 673424377 673899460 673840256 673467102 673540726 673064499 672828217 672553406 672667923
1985.7 672667923 672874680 673350601 673053207 672299728 672950821 673074799 672133102 671253128 671611557 671650772
1995.3 671650772 671409225 671531830 671320343 671851349 671515503 671268997 671303864 671139603 670949326 670360107
$$ packed form
1927.8F76259537j32065J9836J99738l96118Q8730k10572M06494j51596j39770K21863
1937.5F76166077m66614L65219l6774J158066J36566k550811P019O83517j52359l67889
1947.1F74942017N85937L01590n3863k98615l73001n6686m55933j8540k56347J65405
1956.7F74481964Q7204j87073L91617K8000j07269l34854L204m74472j30768Q02155
1966.4F74559708q8196l41950J25504K56042l01056j678j98669k66571p9575l62091
1976F73301468J60751l7842M75083n9204l73154P3624m76227k36282k74811J14517
1985.7F72667923K06757M75921k97394p53479O51093J23978r41697q79974L58429L9215
1995.3F71650772k41547J22605k11487N31006l35846k46506L4867j64261j90277n89219
$$ plain form
2005 670360107 670546341 670211029 670045471 670065918 670063782 670097275 669658813 669569626 669193268 669251099 669268112
2015.6 669268112 668858643 668378296 668522034 668704681 668234024 668456802 667832870 667160721 666997070 667104874
2025.2 667104874 667379456 666954880 666761017 666337128 666273041 666141815 666214523 666217651 665763397 665731735
2034.9 665731735 665148544 665015717 664756622 664810486 665068512 665035706 664969254 664272003 664290390 663509140
2044.5 663509140 663123550 663405838 663331146 663310089 662755737 662917328 662790756 662915344 662777176 662231750
2054.1 662231750 662036362 661676788 662170410 661965027 661751785 661663284 661817398 662194443 661846161 661919937
2063.8 661919937 661489182 661292877 661110992 660834045 660649338 660556870 660900879 660469971 660350494 660261993
2073.4 660261993 660358353 660300522 660096970 660276031 659747314 659526749 659400787 659643631 659560318 659354401
$$ packed form
2005F70360107J86234l35312j65558K0447k136L3493m38462q9187l76358N7831J7013
2015.6F69268112m09469m80347J43738J82647m70657K22778o23932o72149j63651J07804
2025.2F67104874K74582m24576j93863m23889o4087j31226P2708L128m54254l1662
2034.9F65731735n83191j32827k59095N3864K58026l2806o6452o97251J8387p81250
2044.5F63509140l85590K82288p4692k1057n54352J61591j26572J24588j38168n45426
2054.1F62231750j95388l59574M93622k05383k13242q8501J54114L77045l48282P3776
2063.8F61919937m30755j96305j81885k76947j84707r2468L44009m30908j19477q8501
2073.4F60261993R6360n7831k03552J79061n28717k20565j25962K42844q3313k05917
$$ plain form
2083.1 659354401 659610291 659404602 659313812 658684235 658361435 658414383 658553162 658479462 658197556 658141785
2092.7 658141785 657822418 658076401 657752609 657508926 657400665 657004166 656894989 656588440 656822510 656467514
2102.4 656467514 656191101 655840759 655453491 655677261 655487823 655572739 655444946 655480347 655131531 654781494
2112 654781494 654791336 654725037 654949646 654339905 654250870 654200897 654038925 653941422 653605423 653899002 653950653
2122.6 653950653 653995361 653365707 653080673 653388519 653323669 653345032 653177490 653377533 653356705 653358765 653134918
2133.2 653134918 652776718 652716370 652672348 652733688 652372131 652531357 652645645 652785645 652663651 652340393
2142.9 652340393 652682190 652666931 652743912 652380295 652307510 652419128 652437668 652620621 652384033 652617035
2152.5 652617035 652448883 652436295 652024612 651730194 652338028 652223434 652116394 651947556 652105103 652144089
$$ packed form
2083.1F59354401K55890k05689r0790o29577l22800N2948J38779p3700k81906n5771
2092.7F58141785l19367K53983l23792k43683j08261l96499j09177l06549K34070l54996
2102.4F56467514k76413l50342l87268K23770j89438Q4916j27793L5401l48816l50037
2112F54781494R842o6299K24609o09741q9035m9973j61972r7503l35999K93579N1651
2122.6F53950653M4708o29654k85034L07846o4850K1363j67542K00043k0828K060k23847
2133.2F53134918l58200o0348m4022O1340l61557J59226J14288J40000j21994l23258
2142.9F52340393L41797j5259P6981l63617p2785J11618J8540J82953k36588K33002
2152.5F52617035j68152j2588m11683k94418O07834j14594j07040j68838J57547L8986
$$ plain form
2162.1 652144089 652397461 652566681 652207413 652340698 651929855 651832047 651812668 652094193 652446823 652540283
2171.8 652540283 652935104 652764816 652922745 652596512 652307205 652260361 652335968 652555237 652275162 652676163
2181.4 652676163 652499161 652523041 652754898 652872925 653072968 652630844 652772675 652697525 652808990 652586975
2191.1 652586975 652476425 653154602 653366776 653534088 653104324 653023148 652947845 652823105 653150864 653322983
2200.7 653322983 653543472 653643723 653869553 653670959 653667603 653421631 653488770 653961182 653663406 653976517
2210.4 653976517 653842087 653526077 653238907 653326187 653898773 653525467 653282776 653354721 653776474 653594360
2220 653594360 653210678 653270264 653574142 653991470 653360596 653158951 653227921 653400421 653621674 653481293
2229.7 653481293 653500595 653546524 653794708 653393555 653329697 653212891 653192902 653541412 653126984 653349762
$$ packed form
2162.1F52144089K53372J69220l59268J33285m10843r7808j9379K81525L52630R3460
2171.8F52540283L94821j70288J57929l26233k89307m6844P5607K19269k80075M01001
2181.4F52676163j77002K3880K31857J18027K00043m42124J41831p5150J11465k22015
2191.1F52586975j10550O78177K12174J67312m29764q1176p5303j24740L27759J72119
2200.7F53322983K20489J00251K25830j98594l356k45972O7139M72412k97776L13111
2210.4F53976517j34430l16010k87170Q7280N72586l73306k42691P1945M21753j82114
2220F53594360l83682N9586L03878M17328o30874k01645O8970J72500K21253j40381
2229.7F53481293J9302M5929K48184m01153o3858j16806j9989L48510m14428K22778
$$ plain form
2239.3 653349762 653397522 653448792 653588638 653367538 653246155 653350601 653796997 653408356 653066330 652923965
2248.9 652923965 652759781 652689743 652766495 652809448 652411194 652605591 652771149 653088837 653207703 653150711
2258.6 653150711 653114395 652839584 652840195 652309494 652452774 652458878 652471695 652737198 652460327 652930450 652830963
2269.2 652830963 652704391 652552948 652301483 652111969 651912155 652466660 652525177 652607651 652354660 652140579
2278.8 652140579 652088547 651921692 651679459 650963211 651242599 651160431 651126480 651186295 651251678 651903992
2288.5 651903992 651740952 651813889 651196136 650797501 651107635 651208725 651289597 650801849 650859833 650587006
2298.1 650587006 650732117 651020126 650707703 650833435 650757446 650890656 650810852 650871887 650747375 650828094
2307.8 650828094 651387558 651171341 651075592 650994110 651071243 650704956 650514526 651013489 651184845 651203613
$$ packed form
2239.3F53349762M7760N1270J39846k21100j21383J04446M46396l88641l42026j42365
2248.9F52923965j64184p0038P6752M2953l98254J94397J65558L17688J18866n6992
2258.6F53150711l6316k74811O11n30701J43280O104J2817K65503k76871M70123r9487
2269.2F52830963j26572j51443k51465j89514j99814N54505N8517Q2474k52991k14081
2278.8F52140579n2032j66855k42233p16248K79388q2168l3951N9815O5383O52314
2288.5F51903992j63040P2937o17753l98635L10134J01090Q0872m87748N7984k72827
2298.1F50587006J45111K88009l12423J25732p5989J33210p9804O1035j24512Q0719
2307.8F50828094N59464k16217r5749q1482P7133l66287j90430M98963J71356J8768
$$ plain form
2317.4 651203613 651333618 652136307 652000961 651632385 651679840 651239777 651172028 651722336 652063599 651215286
2327.1 651215286 651204681 651769180 652287979 652423630 652086029 652335205 651908722 651790771 652148972 652388687
2336.7 652388687 651373596 650481873 651142426 651725006 651836548 650990982 650546341 650337296 650629578
2345.4 650629578 649610672 646928406 646421051 647939148 649750595 649575958 649431229 649908905 650250549
2354.1 650250549 651775436 651524582 651273193 651385193 652941666 652995605 650411682 650111771 650771866
2362.7 650771866 650574570 648846664 649232025 649163666 647888489 647823639 647528610 646683884 644768982
2371.4 644768982 644266891 644076920 643361435 642673950 641515579 640494614 639605103 639663315 639460793
2380.1 639460793 638291092 637164917 636692238 636748199 636769218 636604881 636053543 635611458 635118027 634870529
$$ packed form
2317.4F51203613J30005Q02689j35346l68576M7455m40063o7749N50308L41263q48313
2327.1F51215286j0605N64499N18799J35651l37601K49176m26483j17951L58201K39715
2336.7F52388687j015091q91723O60553N82580J11542q45566m44641k09045K92282
2345.4F50629578j018906k682266n07355J518097J811447j74637j44729M77676L41644
2354.1F50250549J524887k50854k51389J12000J556473N3939k583923k99911O60095
2362.7F50771866j97296j727906L85361o8359j275177o4850k95029q44726j914902
2371.4F44768982n02091j89971p15485o87485j158371j020965q89511N8212k02522
2380.1F39460793j169701j126175m72679N5961K1019j64337n51338m42085m93431k47498
$$ plain form
2389.7 634870529 634767685 634488335 634444313 634282837 634127579 633777885 633768120 633480225 632915306 632821236
2399.4 632821236 632434425 632257538 631802635 631423149 631248550 631198807 631392937 631029053 630752945 630325470
2409 630325470 629984093 629628334 629312592 629096680 628470497 627857857 627417450 627890358 627816658 627130013
2418.7 627130013 626862869 626543884 626195412 625573463 625397072 625082855 624822350 624801674 624686699 624483948
2428.3 624483948 623764801 623530388 623239746 622903404 622390137 621882248 621808701 621535301 621565552 621061363
2438 621061363 620323486 619516983 618942146 618816910 618659897 618584023 617774086 617685051 617743874 617268105
2447.6 617268105 616983490 616439247 616154900 615791359 615525208 614986954 614626389 614590607 614217796 613743057
2457.2 613743057 613053589 612990341 612683144 612082748 611630630 611285591 611002579 610302544 610212784 610041962
$$ packed form
2389.7F34870529j02844k79350m4022j61476j55258l49694r765k87895n64919r4070
2399.4F32821236l86811j76887m54903l79486j74599m9743J94130l63884k76108m27475
2409F30325470l41377l55759l15742k15912o26183o12640m40407M72908p3700o86645
2418.7F27130013k67144l18985l48472o21949j76391l14217k60505k0676j14975k02751
2428.3F24483948p19147k34413k90642l36342n13267n07889p3547k73400L0251n04189
2438F21061363p37877q06503n74837j25236j57013p5874q09937q9035N8823m75769
2447.6F17268105k84615n44243k84347l63541k66151n38254l60565l5782l72811m74739
2457.2F13743057o89468o3248l07197o00396m52118l45039k83012p00035q9760j70822
$$ plain form
2466.9 610041962 609519844 608757782 608161316 608258629 608231850 608044739 607444420 606890335 606173935 605625763
2476.5 605625763 605314903 604736595 604411201 603786659 603501968 603454971 603238869 602853928 602372360 601988411
2486.2 601988411 601132736 600579720 600168648 599568024 598888168 598618050 598663330 598135300 597709312 597423134
2495.8 597423134 597125244 596445160 595716400 595199890 594756660 594542999 594082909 594067345 593720818 592735367
2505.5 592735367 592033501 591631012 591387253 590921059 590504913 590051804 589519119 588799553 588459015 588332329
2515.1 588332329 588135300 588127365 587441368 586879387 586385422 585975418 585582390 585206490 585258102 584515076
2524.7 584515076 584182968 584132576 583603477 582834854 582028465 581668396 581159477 581204376 581038399 580465240
2534.4 580465240 580025635 579325752 578876572 578648643 578560448 578362198 578520851 578068314 576963120 576548653
$$ packed form
2466.9F10041962n22118p62062n96466R7313k6779j87111o00319n54085p16400n48172
2476.5F05625763l10860n78308l25394o24542k84691m6997k16102l84941m81568l83949
2486.2F01988411q55675n53016m11072o00624o79856k70118M5280n28030m25988k86178
2495.8E97423134k97890o80084p28760n16510m43230k13661m60090j5564l46527r85451
2505.5E92735367p01866m02489k43759m66194m16146m53109n32685p19566l40538j26686
2515.1E88332329j97029p935o85997n61981m93965m10004l93028l75900N1612p43026
2524.7E84515076l32108n0392n29099p68623q06389l60069n08919M4899j65977n73159
2534.4E80465240m39605o99883m49180k27929q8195j98250J58653m52537j105194m14467
$$ plain form
2544 576548653 576298103 575954628 575157890 574692307 574351273 573801765 573605690 573358688 573241234 573169212
2553.7 573169212 572942085 572147408 571423607 570942116 570516396 570209618 569605751 569437408 569382362 569159889
2563.3 569159889 568442230 567789688 567505722 566948853 566729088 565992775 565289421 565046730 564842873 564844666
2573 564844666 564802666 564663734 563889618 563242722 562964363 562856293 562096558 561186905 561281052 560855064
2582.6 560855064 560432854 560243378 560141754 559983482 559462891 558863182 557819595 557440643 557287598
2591.3 557287598 557004395 556708450 556202431 555728416 555248718 555206947 554461670 553648148 553552589 553274384
2600.9 553274384 552678185 552044830 551749496 551289749 551021690 550661469 550065842 549438171 548727036 548154182
2610.6 548154182 547562103 547409782 546971626 546703377 546347542 545475693 545016785 544279594 543999672 543587227
$$ packed form
2544E76548653k50550l43475p96738m65583l41034n49508j96075k47002j17454p2022
2553.7E73169212k27127p94677p23801m81491m25720l06778o03867j68343n5046k22473
2563.3E69159889p17659o52542k83966n56869k19765p36313p03354k42691k03857J793
2573E64844666m2000j38932p74116o46896k78359j08070p59735r09653R4147m25988
2582.6E60855064m22210j89476j01624j58272n20591n99709j043587l78952j53045
2591.3E57287598k83203k95945n06019m74015m79698m1771p45277q13522r5559k78205
2600.9E53274384n96199o33355k95334m59747k68059l60221n95627o27671p11135n72854
2610.6E48154182n92079j52321m38156k68249l55835q71849m58908p37191k79922m12445
$$ plain form
2620.2 543587227 542920723 542834969 542424507 541932106 541479301 540931320 540172768 539443665 538836441 538479309
2629.9 538479309 538146896 537636490 537491684 537180901 536769447 536082039 535389404 534999733 534428215 533850555
2639.5 533850555 533033371 532475853 532201538 531957397 531475143 530915947 530756378 530132790 529230499 528557777
2649.1 528557777 528420677 528436165 528021355 527454910 526949120 526708603 526193161 525337372 524675446 524541283
2658.8 524541283 524477501 524167023 523751945 523163338 522810898 522468796 522215958 522030373 521819572 521358566
2668.4 521358566 520505714 519994316 519664917 519581985 519234734 518707504 518421364 518097610 517887840 517497597
2678.1 517497597 517352257 516824684 515992584 515484734 515098228 514961205 514448738 514339905 514299316 513913422
2687.7 513913422 513883705 513466873 512748222 512278748 512076988 511714287 511170387 510587463 510388680 510387421
$$ packed form
2620.2E43587227o66504q5754m10462m92401m52805n47981p58552p29103o07224l57132
2629.9E38479309l32413n10406j44806l10783m11454o87408o92635l89671n71518n77660
2639.5E33850555q17184n57518k74315k44141m82254n59196j59569o23588r02291o72722
2649.1E28557777j37100J5488m14810n66445n05790k40517n15442q55789o61926j34163
2658.8E24541283o3782l10478m15078n88607l52440l42102k52838j85585k10801m61006
2668.4E21358566q52852n11398l29399q2932l47251n27230k86140l23754k09770l90243
2678.1E17497597j45340n27573q32100n07850l86506j37023n12467j08833m0589l85894
2687.7E13913422k9717m16832p18651m69474k01760l62701n43900n82924j98783j259
$$ plain form
2697.4 510387421 509938126 509538155 509111595 508820190 508495407 508163986 507876816 507242203 506837730 506412086
2707 506412086 506231308 506508141 506279488 505331917 504702568 504651566 504552879 504349556 503823662 503486481
2716.6 503486481 503045654 502497177 502371979 502252464 502207069 501816902 501416397 501271133 501257362 500992432
2726.3 500992432 500384254 500235481 499985046 499543648 499126511 498905067 498605232 498216438 498270683 498181572
2735.9 498181572 497986946 497631874 497381096 497205544 497078896 496893997 496220245 496068954 496239548 496327858
2745.6 496327858 496082573 495634689 495257797 494942513 494799538 494241409 494145355 493962708 493450546 493318748
2755.2 493318748 493076935 492918243 492518387 492295952 492016144 491739960 491682167 491286201 490881348 490336380
2764.9 490336380 490046692 489759903 489576492 489243507 488687553 488718681 488604050 488455238 488134346 487873039
$$ packed form
2697.4E10387421m49295l99971m26560k91405l24783l31421k87170o34613m04473m25644
2707E06412086j80778K76833k28653r47571o29349n1002r8687k03323n25894l37181
2716.6E03486481m40827n48477j25198j19515m5395l90167m00505j45264j3771k64930
2726.3E00992432o08178j48773k50435m41398m17137k21444k99835l88794N4245q9111
2735.9D98181572j94626l55072k50778j75552j26648j84899o73752j51291J70594Q8310
2745.6D96327858k45285m47884l76892l15284j42975n58129r6054j82647n12162j31798
2755.2D93318748k41813j58692l99856k22435k79808k76184n7793l95966m04853n44968
2764.9D90336380k89688k86789j83411l32985n55954L1128j14631j48812l20892k61307
$$ plain form
2774.5 487873039 487431984 486620026 486179199 485708504 485558815 485284424 485094719 484836311 484031639 483713875
2784.2 483713875 483397560 482854729 482287674 481955566 481473579 480662689 480186310 479723969 479488182 479394760
2793.8 479394760 478846703 477944374 477495842 477406387 476760216 475923119 475366707 474668541 473994370 473685188
2803.4 473685188 472932701 472302208 471916237 471169930 470623589 469999275 469281921 468333359 467685394 467178116
2813.1 467178116 466159935 465470352 464860573 464284782 463562813 462955627 462497101 461639175 461008682
2821.8 461008682 460365753 459575081 458657188 457793541 456823082 455877647 455590286 454998245 454010696 453134689
2831.4 453134689 452282295 451246452 450419960 449808617 448770676 447801323 446802025 445687790 444391785
2840.1 444391785 442458687 440581932 439397430 437889137 435582542 433737679 432365685 430838470
$$ packed form
2774.5D87873039m41055q11958m40827m70695j49689k74391j89705k58408q04672l17764
2784.2D83713875l16315n42831n67055l32108m81987q10890m76379m62341k35787r3422
2793.8D79394760n48057r02329m48532q9455o46171q37097n56412o98166o74171l09182
2803.4D73685188p52487o30493l85971p46307n46341o24314p17354r48562o47965n07278
2813.1D67178116j018181o89583o09779n75791p21969o07186m58526q57926o30493
2821.8D61008682o42929p90672r17893q63647r70459r45435k87361n92041r87549q76007
2831.4D53134689q52394j035843q26492o11343j037941r69353r99298j114235j296005
2840.1D44391785j933098j876755j184502j508293k306595j844863j371994j527215
$$ plain form
2847.8 430838470 428813667 426667938 424880943 423231430 421951218 421100006 420952721 420658493 420102196
2856.5 420102196 420147057 420204163 420326347 420094032 419299355 418584824 418257027 418240585 418021965 417429314
2866.1 417429314 416593857 415717468 414766197 413974724 413195686 412638741 412327576 411428795 410499268 409990730
2875.8 409990730 409573822 408978539 408495712 407638130 406711655 406687088 406051216 405071144 404202805 403171883
2885.4 403171883 402386055 401494522 400996437 400174217 398944244 398173981 397324295 396332741 395582008
2894.1 395582008 395344429 394887009 393934975 393163948 392405319 391507950 390795021 389787674 388362656
2902.8 388362656 387623405 387383194 386860352 386275482 385732040 385023270 384333344 383282051 382012939
2911.4 382012939 381216164 380048561 378659019 377185249 375784264 374843140 373443184 371944427 370644875
$$ packed form
2847.8D30838470k024803k145729j786995j649513j280212q51212j47285k94228n56297
2856.5D20102196M4861N7106J22184k32315p94677p14531l27797j6442k18620n92651
2866.1D17429314q35457q76389r51271p91473p79038n56945l11165q98781r29527n08538
2875.8D09990730m16908n95283m82827q57582r26475k4567o35872r80072q68339j030922
2885.4D03171883p85828q91533m98085q22220j229973p70263q49686r91554p50733
2894.1C95582008k37579m57420r52034p71027p58629q97369p12929j007347j425018
2902.8C88362656p39251k40211n22842n84870n43442p08770o89926j051293j269112
2911.4C82012939p96775j167603j389542j473770j400985r41124j399956j498757j299552
$$ plain form
2920.1 370644875 369639206 368889313 368265572 367878876 367496414 367131996 366576462 366756668 367086296
2928.8 367086296 366976013 367092705 367203598 367727318 367947235 368177490 368620758 368788834 369329910 369698296
2938.5 369698296 370151978 370858269 371596222 372479668 373406525 373986664 373964424 374533768 375379410 375955009
2948.1 375955009 376673317 377132683 377944260 378858452 378841629 378919907 379134712 379127274 379789391 380454941
2957.7 380454941 380890274 381397820 382039871 382749863 383014717 383568001 384283829 384678535 384916306 385562897
2967.4 385562897 386588478 387214317 387977028 388659592 389238052 389932594 390560760 390903702 390989571 391641388
2977 391641388 392178879 392661133 393211975 393521118 393938408 394273911 394674644 394969254 395443611 395656357
2986.7 395656357 395596275 395817528 395862160 396067314 396039200 395875816 396019554 396251602 396101189 395593300
$$ packed form
2920.1C70644875j005669p49893o23741l86696l82462l64418n55534J80206L29628
2928.8C67086296j10283J16692J10893N23720K19917K30255M43268J68076N41076L68386
2938.5C69698296M53682P06291P37953Q83446R26857N80139k2240N69344Q45642N75599
2948.1C75955009P18308M59366Q11577R14192j6823P8278K14805p438O62117O65550
2957.7C80454941M35333N07546O42051P09992K64854N53284P15828L94706K37771O46591
2967.4C85562897J025581O25839P62711O82564N78460O94542O28166L42942Q5869O51817
2977C91641388N37491M82254N50842L09143M17290L35503M00733K94610M74357K12746
2986.7C95656357o0082K21253M4632K05154k8114j63384J43738K32048j50413n07889
$$ plain form
2996.3 395593300 395409660 395071945 394597778 394292984 394397507 394276276 393505020 392920151 392217598 391583595
3006 391583595 391168900 390661697 390153427 389956741 389988213 389712143 389019356 388227882 387928772 387199211
3015.6 387199211 386274834 385866852 385375137 384882355 384214859 383616180 382872124 382183533 381461334 380599136
3025.2 380599136 380214081 379472733 379008102 378700867 377860336 376858101 375959244 375651016 375080986
3033.9 375080986 374431877 373796844 372830467 372086830 371481438 370872612 370035858 369007301 367969437
3042.6 367969437 367311974 366850471 365974083 365105286 364613762 364111938 363426552 362706146 361870384 361103973
3052.2 361103973 359971771 358997612 358606224 357870789 357255554 356729698 356258888 355635872 354669609
3060.9 354669609 353747253 352787209 352279243 351695595 351350594 351234016 350387459 349566727 348887215 348161392
$$ packed form
2996.3C95593300j83640l37715m74167l04794J04523j21231p71256n84869p02553o34003
3006C91583595m14695n07203n08270j96686L1472k76070o92787p91474k99110p29561
3015.6C87199211r24377m07982m91715m92782o67496n98679p44056o88591p22199q62198
3025.2C80599136l85055p41348m64631l07235q40531j002235q98857l08228n70030
3033.9C75080986o49109o35033r66377p43637o05392o08826q36754j028557j037864
3042.6C67969437o57463m61503q76388q68797m91524n01824o85386p20406q35762p66411
3052.2C61103973j132202r74159l91388p35435o15235n25856m70810o23016r66263
3060.9C54669609r22356r60044n07966n83648l45001j16578q46557q20732o79512p25823
$$ plain form
3070.6 348161392 347410202 346697922 345842400 345046768 344592094 344133873 343816643 343459549 342997437 342094040
3080.2 342094040 341087875 340532913 340006561 339508591 338706169 337680130 336971169 336595306 335935860
3088.9 335935860 335355110 335128632 334601212 334288712 333697853 332968025 332660332 331920776 331074715 330458260
3098.5 330458260 329805222 329011497 328258820 327431107 326499519 325691032 325241966 325142937 324619789 323796463
3108.2 323796463 323063698 322531586 321947861 321203232 320623665 319964504 319357014 318875961 318625088 318054714
3117.8 318054714 316912346 315924644 315320168 315068359 314458714 313715725 312908363 311889973 311331902
3126.5 311331902 310855865 310180378 309527435 308991947 308039494 306983376 306148663 305367279 305166321
3135.2 305166321 304997616 304517288 303437653 302329826 301887856 301280079 300502319 299678822 299037819
$$ packed form
3070.6C48161392p51190p12280q55522p95632m54674m58221l17230l57094m62112r03397
3080.2C42094040j006165n54962n26352m97970q02422j026039p08961l75863o59446
3088.9C35935860n80750k26478n27420l12500n90859p29828l07693p39556q46061o16455
3098.5C30458260o53038p93725p52677q27713r31588q08487m49066r9029n23148q23326
3108.2C23796463p32765n32112n83725p44629n79567o59161o07490m81053k50873n70374
3117.8C18054714j142368r87702o04476k51809o09645p42989q07362j018390n58071
3126.5C11331902m76037o75487o52943n35488r52453j056118q34713p81384k00958
3135.2C05166321j68705m80328j079635j107827m41970o07777p77760q23497o41003
$$ plain form
3143.9 299037819 298302288 297569141 297367802 296895580 295946102 295062122 294500751 293831940 293111973 292468262
3153.5 292468262 291779594 291271362 290611954 289775543 288979721 288316803 287495441 286623611 286004086 285540142
3163.1 285540142 284940014 283712158 282950573 282740116 282180843 281503830 280922680 280478516 279775620
3171.8 279775620 279239540 278607712 277523975 276742039 276174812 275590839 274778881 274206505 273820934
3180.5 273820934 273296089 272803211 271834641 271044044 270764256 270064068 269216595 268790569 268252983 267415352
3190.1 267415352 267060375 266950302 266023846 264725266 264165516 264055157 263589993 262510033 261680336
3198.8 261680336 261507721 260968170 260236168 259916649 259607353 258850479 257959156 257502251 257147923 256549053
3208.5 256549053 255969086 255383854 254683819 254211559 253715572 253040714 252427731 251955891 251492920 250549698
$$ packed form
3143.9B99037819p35531p33147k01339m72222r49478q83980n61371o68811p19967o43711
3153.5B92468262o88668n08232o59408q36411p95822o62918q21362q71830o19525m63944
3163.1B85540142o00128j227856p61585k10457n59273o77013n81150m44164p02896
3171.8B79775620n36080o31828j083737p81936n67227n83973q11958n72376l85571
3180.5B73820934n24845m92878r68570p90597k79788p00188q47473m26026n37586q37631
3190.1B67415352l54977j10073r26456j298580n59750j10359m65164j079960q29697
3198.8B61680336j72615n39551p32002l19519l09296p56874q91323m56905l54328n98870
3208.5B56549053n79967n85232p00035m72260m95987o74858o12983m71840m62971r43222
$$ plain form
3218.1 250549698 249704037 249165096 248886662 248761597 248179073 247681713 247226715 246783829 246334515 245732193
3227.8 245732193 245203705 244686279 244319611 243553238 242910233 242590885 242051487 241500053 240784264 240474339
3237.4 240474339 240299644 239970264 239802761 239532146 238869972 238206081 238090343 237369347 236492958 236295834
3247 236295834 235798683 234812851 233836403 233732624 234167747 234317245 233743057 232640514 232052670 232114677
3256.7 232114677 232186699 231710472 230983429 230112038 229458084 229239292 229062939 229016209 228567982 227779217
3266.3 227779217 227251339 227378540 227856369 227567158 226705894 226097126 226004295 225919170 225314579 224488926
3276 224488926 224132175 224166088 223801899 223216267 222899475 222848759 222678814 222562714 222575245 222035847
3285.6 222035847 221306114 221071167 220918846 220347843 220014114 220215816 220343494 219773674 218899021 218649445
$$ packed form
3218.1B50549698q45661n38941k78434j25065n82524m97360m54998m42886m49314o02322
3227.8B45732193n28488n17426l66668p66373o43005l19348n39398n51434p15789l09925
3237.4B40474339j74695l29380j67503k70615o62174o63891j15738p20996q76389j97124
3247B36295834m97151r85832r76448j03779M35123J49498n74188j102543n87844O2007
3256.7B32114677P2022m76227p27043q71391o53954k18792j76353m6730m48227p88765
3266.3B27779217n27878J27201M77829k89211q61264o08768r2831q5125o04591q25653
3276B24488926l56751L3913l64189n85632l16792n0716j69945j16100J2531n39398
3285.6B22035847p29733k34947j52321n71003l33729K01702J27678n69820q74653k49576
$$ plain form
3295.3 218649445 218281708 217817078 217840652 217679214 217162552 216661224 216557579 216540222 216387615 216082554
3304.9 216082554 215640297 215362778 215395432 215248680 214266796 213745823 213895893 213555241 212999802 212476234
3314.6 212476234 212111225 211963768 211738567 211113033 210575848 210480366 210275555 209803104 209120064 208732491
3324.2 208732491 208500061 207645950 206509972 206282616 206536026 205805588 205174236 205012436 204512062
3332.9 204512062 204186039 203681927 203248444 203377762 202818165 201746464 201064072 200311050 199953632
3341.6 199953632 200046177 199900627 199683208 199229679 198846397 198606472 198250465 197568130 196776619 196598301
3351.2 196598301 196419067 196478195 196758442 196337624 195756321 195414715 195144997 194748478 194747963 194926033
3360.8 194926033 194243546 193515301 193385239 193316841 193436413 193532257 193048496 192609634 192177372 191717606
$$ packed form
3295.3B18649445l67737m64630K3574j61438n16662n01328j03645j7357j52607l05061
3304.9B16082554m42257k77519L2654j46752r81884n20973J50070l40652n55439n23568
3314.6B12476234l65009j47457k25201o25534n37185r5482k04811m72451o83040l87573
3324.2B08732491k32430q54111j135978k27356K53410p30438o31352j61800n00374
3332.9B04512062l26023n04112m33483J29318n59597j071701o82392p53022l57418
3341.6A99953632R2545j45550k17419m53529l83282k39925l56007o82335p91511j78318
3351.2A96598301j79234N9128K80247m20818n81303l41606k69718l96519n15J78070
3360.8A94926033o82487p28245j30062o8398J19572R5844m83761m38862m32262m59766
$$ plain form
3370.5 191717606 191950130 192093220 191508179 191029949 191169014 191069374 190582409 190283928 189942608 189368916
3380.1 189368916 188741608 188952694 189338837 188892670 188856258 189170780 189003258 189103737 189526272 189107170
3389.8 189107170 188518925 188793545 189048557 188650341 187885437 187712898 188345470 188666458 188303967 187816944
3399.4 187816944 187413597 187244740 187507706 187620506 187399940 187021294 186962948 187724609 188144264 187667637
3409.1 187667637 187266216 187584743 187942295 187760391 187719727 187873096 188049278 188323746 188219986 187951145
3418.7 187951145 188225327 188707809 189140320 189345226 189104252 189039688 189114666 189493351 189879093 189738998
3428.3 189738998 190073490 190287399 189860725 190075245 190699387 190976524 191295681 191707249 191840096 192039051
3438 192039051 192629051 193030109 193059006 193368015 193730812 193849773 194059391 194870529 195839787 195590343
$$ packed form
3370.5A91717606K32524J43090n85041m78230J39065r9640m86965k98481l41320n73692
3380.1A89368916o27308K11086L86143m46167l6412L14522j67522J00479M22535m19102
3389.8A89107170n88245K74620K55012l98216p64904j72539O32572L20988l62491m87023
3399.4A87816944m03347j68857K62966J12800k20566l78646n8346P61661M19655m76627
3409.1A87667637m01421L18527L57552j81904m0664J53369J76182K74468j03760k68841
3418.7A87951145K74182M82482M32511K04906k40974o4564P4978L78685L85742j40095
3428.3A89738998L34492K13909m26674K14520O24142K77137L19157M11568J32847J98955
3438A92039051N90000M01058K8897L09009L62797J18961K09618Q11138R69258k49444
$$ plain form
3447.6 195590343 195253735 195511265 196232510 196875916 196824207 197588806 198663330 199345665 200015678 200253143
3457.3 200253143 200294075 200713615 201543503 201793709 202173252 202357140 202175598 203373451 204179535 204295635
3466.9 204295635 204973297 205675983 206416645 207100906 207708588 208234711 208971195 209791546 210067272 209961967
3476.6 209961967 210450783 211840057 212895164 213517570 214223461 214491596 214701977 215534687 216186390
3485.2 216186390 217007599 218529358 219322166 219450054 219974766 220957909 221983681 222808456 223491573
3493.9 223491573 224026203 224684944 225192261 225602512 226361027 227470284 228255367 228940678 229911251
3502.6 229911251 230332413 231004963 231868210 232514820 233301334 234543591 235445843 235332966 236289864
3511.3 236289864 237559853 238826981 239820862 239957409 241147690 242776928 244012241 244626865 245108395
$$ packed form
3447.6A95590343l36608K57530P21245O43406n1709P64599J074524O82335O70013K37465
3457.3B00253143M0932M19540Q29888K50206L79543J83888j81542J197853Q06084J16100
3466.9B04295635O77662P02686P40662O84261O07682N26123P36484Q20351K75726j05305
3476.6B09961967M88816J389274J055107O22406P05891K68135K10381Q32710O51703
3485.2B16186390Q21209J521759P92808J27888N24712R83143J025772Q24775O83117
3493.9B23491573N34630O58741N07317M10251P58515J109257P85083O85311R70573
3502.6B29911251M21162O72550Q63247O46610P86514J242257R02252j12877R56898
3511.3B36289864J269989J267128R93881J36547J190281J629238J235313O14624M81530
$$ plain form
3520 245108395 246239586 247378521 248286896 249019852 250205307 251057091 251647091 252141609 252639294
3528.6 252639294 253911057 255134411 256102619 256910591 258001957 259365749 261496487 262889271 262906265
3537.3 262906265 264149551 264931030 265871162 267507534 268953037 270333862 271466103 272911434 274330254
3546 274330254 276399956 276620846 276806011 278599606 280481873 282737808 282786961 283544655 285000763
3554.7 285000763 286274319 287945366 288735771 290976200 292807598 293917904 295025311 297019367
3562.4 297019367 299089336 299657879 303191509 305984688 306831474 306795444 305830517 308595982 310633736
3571.1 310633736 312519646 314744110 316330872 317152138 318784618 321613083 322330780 324264793 326265945
3579.7 326265945 327056923 328831100 331065826 333513832 335066109 338626289 341423416 342060127 344173660
$$ packed form
3520B45108395J131191J138935R08375P32956J185455Q51784N90000M94518M97685
3528.6B52639294J271763J223354R68208Q07972J091366J363792K130738J392784J6994
3537.3B62906265J243286P81479R40132J636372J445503J380825J132241J445331J418820
3546B74330254K069702K20890J85165J793595J882267K255935M9153P57694J456108
3554.7B85000763J273556J671047P90405K240429J831398J110306J107407J994056
3562.4B97019367K069969N68543L533630K793179Q46786l6030r64927K765465K037754
3571.1C10633736J885910K224464J586762Q21266J632480K828465P17697J934013K001152
3579.7C26265945P90978J774177K234726K448006J552277L560180K797127O36711K113533
$$ plain form
3588.4 344173660 343257599 345484161 348693008 351277237 353814125 355274696 357604904 357325478 359349556
3597.1 359349556 363739700 365198975 367394829 369288139 370413170 372769814 374602737 376995506
3604.8 376995506 380766716 383527412 383703880 387445107 388412704 387470055 394109650 397455177 396049118
3613.5 396049118 399777184 400331001 403391380 407685814 409491768 412457047 413199425 414388466 417159157
3622.2 417159157 420367546 423082581 426224785 429860840 432343445 438620186 443113174 435253906
3629.9 435253906 437085304 441372108 446998444 450280647 449851799 451912804 455738373 459307785
3637.6 459307785 460987167 462825584 465535278 469028931 471613998 473404846 476743011 480885353
3645.3 480885353 487196426 488362007 486626854 492652435 494040565 492296410 490863838 495435295
$$ packed form
3588.4C44173660r16061K226562L208847K584229K536888J460571K330208k79426K024078
3597.1C59349556M390144J459275K195854J893310J125031K356644J832923K392769
3604.8C76995506L771210K760696J76468L741227R67597r42649O639595L345527j406059
3613.5C96049118L728066N53817L060379M294434J805954K965279P42378J189041K770691
3622.2D17159157L208389K715035L142204L636055K482605O276741M492988p859268
3629.9D35253906J831398M286804N626336L282203m28848K061005L825569L569412
3637.6D59307785J679382J838417K709694L493653K585067J790848L338165M142342
3645.3D80885353O311073J165581j735153O025581J388130j744155j432572M571457
$$ plain form
3653 495435295 500301399 504820595 510970497 504817886 505629539 511663780 514308281 516448059 517590065
3661.7 517590065 520008354 521801147 523931389 526413040 528003998 532766075 535839691 536264992
3669.4 536264992 537538223 531859894 533027000 541062622 550948219 552402763 537044106 538580475
3677.1 538580475 546263466 551111984 548964462 549292107 552291679 554714279 556555939 557093887 557516823
3685.8 557516823 561492310 569658623 563562889 558414726 567559395 562903709 560138283 565146866
3693.5 565146866 566792297 568978157 569859314 569540176 570199280 570491676 573274155 576682396 572526627
3702.2 572526627 569499130 573842201 575932236 576044502 576856117 580255928 585814590 578956299 581188431
3710.9 581188431 587715416 573920479 576199493 581451797 581560173 581450233 584238243 587164955
$$ packed form
3653D95435295M866104M519196O149902o152611Q11653O034241K644501K139778J142006
3661.7E17590065K418289J792793K130242K481651J590958M762077L073616M25301
3669.4E36264992J273231n678329J167106Q035622R885597J454544j5358657J536369
3677.1E38580475P682991M848518k147522L27645K999572K422600J841660N37948M22936
3685.8E57516823L975487Q166313o095734n148163R144669m655686k765426N008583
3693.5E65146866J645431K185860Q81157l19138O59104K92396K782479L408241m155769
3702.2E72526627l027497M343071K090035J12266Q11615L399811N558662o858291K232132
3710.9E81188431O526985j3794937K279014N252304J08376j09940K788010K926712
$$ plain form
3718.6 587164955 584351997 584217224 590408287 589203415 583520393 587919197 589846611 589828186 587441559
3727.3 587441559 585728683 588713493 589789200 596508751 596809425 587782593 596146965 599046478
3735 599046478 589908524 588647003 590483894 590319939 591821823 595374146 591856956 594465904 607716408
3743.7 607716408 603263016 582233543 589472046 595229378 601497650 600165787 589902306 601402550
3751.4 601402550 599530907 588471489 592775993 596973724 599946899 594227028 595167198 601925392
3759.1 601925392 596627426 593620186 597053986 598473549 598423920 602228737 601250687 595836334 597859383
3767.8 597859383 603079414 605857964 597907715 597576103 599993858 600363007 601864967 601408272 601474495
3776.5 601474495 601855507 605329514 606564865 597367554 598440628 601552505 603051186 605779190
$$ packed form
3718.6E87164955k812958j34773O191063j204872n683022M398804J927414j8425k386627
3727.3E87441559j712876K984810J075707O719551L00674r026832Q364372K899513
3735E99046478r137954j261521J836891j63955J501884L552323l517190K608948J3250504
3743.7F07716408m453392k1029473P238503N757332O268272j331863j0263481J1500244
3751.4F01402550j871643j1059418M304504M197731K973175n719871R40170O758194
3759.1F01925392n297966l007240L433800J419563m9629L804817r78050n414353K023049
3767.8E97859383N220031K778550p950249l31612K417755L69149J501960m56695O6223
3776.5F01474495L81012L474007J235351r197311J073074L111877J498681K728004
$$ plain form
3784.2 605779190 603378563 601487083 602282524 603098030 603600502 602892075 603444214 603679314 603305893
3792.9 603305893 603165016 604948654 609398766 606308174 601034508 602721786 606844711 614329262
3800.6 614329262 610875931 599167442 600875130 602313957 606837578 613686752 606144371 599904060
3808.3 599904060 603359985 605381966 605841751 606418648 606255302 606968498 612793274 613130150 598517685
3817 598517685 602574081 608351364 613230057 618741264 601380043 599436035 604543419 606416016
3824.7 606416016 609333839 610592766 606235046 604572182 605812645 609268913 612354736 604241791
3832.4 604241791 605050697 612850151 607793541 606235542 614938202 608609810 603191032 610668335
3840.1 610668335 605963326 603917732 610067787 607749786 603916283 606633415 608191948 608225861 609751091
$$ packed form
3784.2F05779190k400627j891480P95441Q15506N02472p08427N52139K35100l73421
3792.9F03305893j40877J783638M450112l090592n273666J687278M122925P484551
3800.6F14329262l453331j1708489J707688J438827M523621O849174p542381o240311
3808.3E99904060L455925K021981M59785N76897j63346P13196N824776L36876j4612465
3817E98517685M056396N777283M878693N511207j7361221j944008N107384J872597
3824.7F06416016K917823J258927m357720j662864J240463L456268L085823q112945
3832.4F04241791Q08906P799454n056610j557999Q702660o328392n418778P477303
3840.1F10668335m705009k045594O150055k318001l833503K717132J558533L3913J525230
$$ plain form
3848.8 609751091 608869553 610037804 616032486 613071938 617225266 603272362 598296890 607960205
3856.5 607960205 607459946 605236931 607528343 609847183 613066025 607645760 606576462 614423599
3864.2 614423599 610538559 602608681 605013237 609561958 616607246 611859779 600383072 603191032
3871.9 603191032 608708611 613621902 605942993 603519478 606679039 607139626 610086632 614917946
3879.7 614917946 610059624 601678429 606337471 608814125 609669914 615145111 604613609 602810974
3887.4 602810974 606170654 607359657 612105217 611900406 604124870 604365921 607319565 606316757 607070122
3896.1 607070122 608417664 610326118 613334160 604629021 607518730 611016579 606341858 610775871
3903.8 610775871 606967735 604061966 605242653 605256577 606850395 606639709 606651649 606104546 606036720
$$ packed form
3848.8F09751091q81538J168251N994682k960548M153328j3952904m975472R663315
3856.5F07960205n00259k223015K291412K318840L218842n420265j069298P847137
3864.2F14423599l885040p929878K404556M548721P045288m747467j1476707K807960
3871.9F03191032N517579M913291p678909k423515L159561M60587K947006M831314
3879.7F14917946m858322q381195M659042K476654Q55789N475197j0531502j802635
3887.4F02810974L359680J189003M745560k04811p775536K41051K953644j002808P53365
3896.1F07070122J347542J908454L008042q705139K889709L497849m674721M434013
3903.8F10775871l808136k905769J180687J3924J593818k10686J1940n47103o7826
$$ plain form
3912.5 606036720 606804123 606588669 607751694 609961205 607006340 602539825 606386719 607866707 604403610
3921.1 604403610 605981483 607336578 608874016 608442192 604803619 604539909 605427322 607603874 607411041
3929.8 607411041 605884438 607492599 605345612 603263550 604636307 605052109 605541458 606453209 606599350
3938.5 606599350 606062164 605705490 607335320 608901787 604686279 603100281 604874077 604773674 605710068
3947.2 605710068 604462128 604573784 606057091 603501968 604574661 605685120 604489670 604438324 604730835
3955.8 604730835 605045395 604654694 605229836 605114136 605236702 605843239 604461327 603963547 603929596 604014206
3965.5 604014206 604407616 604774017 605033569 604290047 603574829 604375267 605512428 604733620 603891182
3974.2 603891182 604191780 604735489 604629135 603954811 603646240 603644371 604476395 605208969 604815903 603733749
$$ packed form
3912.5F06036720P67403k15454J163025K209511k954865m466515L846894J479988l463097
3921.1F04403610J577873J355095J537438m31824l638573k63710Q87413K176552j92833
3929.8F07411041j526603J608161k146987k082062J372757M15802M89349R11751J46141
3938.5F06599350n37186l56674J629830J566467m215508j585998J773796j00403R36394
3947.2F05710068j247940J11656J483307k555123J072693J110459j195450n1346K92511
3955.8F04730835L14560l90701N75142j15700J22566O06537j381912m97780l3951Q4610
3965.5F04014206L93410L66401K59552p43522p15218Q00438J137161p78808q42438
3974.2F03891182L00598N43709j06354o74324l08571j869Q32024P32574l93066j082154
$$ plain form
3983.8 603733749 604169312 605149231 604144974 603524361 603573723 604123154 604109192 603778381 604411240 604137573
3993.5 604137573 604477654 604421768 603698196 604064255 604054756 603778229 603598289
4000.2 603598289
$$ packed form
3983.8F03733749M35563R79919j004257o20613M9362N49431j3962l30811O32859k73667
3993.5F04137573L40081n5886p23572L66059r499k76527j79940
4000.2F03598289
##END=$$ End of the data block
