##TITLE=$$ Begin of the data block
##JCAMP-DX=5.00 $$ ACD/SpecManager v 10.08
##SPECTROMETER/DATA SYSTEM=Varian
##DATE=15 Jan 2013 09:53:42
##DATA TYPE=INFRARED SPECTRUM
##DATA CLASS=XYDATA
##ORIGIN=
##OWNER=
##NPOINTS=3735
##FIRSTX=399.26403809
##LASTX=4000.35498047
##MAXX=4000.35498047
##MINX=399.26403809
##MAXY=69.18926239
##MINY=17.86300087
##XFACTOR=1.0000000000
##YFACTOR=0.000000100000000
##FIRSTY=35.82524490
##DELTAX=0.96440572
##XUNITS=1/CM
##YUNITS=TRANSMITTANCE
##XYDATA=(X++(Y..Y))
399.3 358252449 364913597 365552254 362619514 364419556 370993538 373292961 369605026 362328873 358148079
407.9 358148079 360356598 365117760 363431969 364526367 369876518 366143875 365980110 368731499 369210930
416.6 369210930 369430389 363583145 360600891 362764740 368507843 369920921 363915100 359572983 356170044
425.3 356170044 358385277 360819359 361676407 363488770 367257004 369499817 364331093 361264420 363748398
434 363748398 363003273 358603134 357521744 357925110 358572311 360525856 362390556 362970047 361867981
442.7 361867981 360600204 359255409 359130402 358801880 361992874 364392128 362085190 363204727 365875893
451.3 365875893 367974739 365176926 358376350 357981758 360625648 362619476 364471397 364442368 362648354
460 362648354 360611382 359206772 358754883 358256798 353539963 351620903 354088058 356319389 355647812
468.7 355647812 353422050 354247284 356228828 356981163 353907280 350349274 347500076 347569122 348749733
477.4 348749733 348035431 348718491 350225792 350936317 348871574 345729904 342823143 343551483 347198486
486.1 347198486 346767998 347849464 350668182 349377785 346895523 345681152 345094261 345217323 346502609
494.7 346502609 344006882 342365417 345373459 347991447 348728180 347184143 346904449 345949783 342153091
503.4 342153091 340499916 340166206 339325218 340240059 342676582 342937584 342829819 343064232 343489380
512.1 343489380 342058563 338356285 337871361 337393532 335381660 335751495 336492958 337708817 337406616
520.8 337406616 335096054 334658432 335158577 334676323 333211594 331938324 333920403 335205345 334273338
529.5 334273338 334297752 335805969 336107025 332570648 330175285 330018997 328804398 330042801 332228966
538.1 332228966 332140503 332095604 332125587 330431557 328925285 328861275 328140564 326211472 325487442 325051384
547.8 325051384 324256897 325783577 326119843 325610466 325890617 324283524 322819748 322594566 323446693
556.5 323446693 321993599 319533157 319615822 319634457 321257706 322709923 321784821 320613480 319917393
565.1 319917393 320606461 321831627 322343330 323582153 324853897 323829956 323166084 323611412 323343124
573.8 323343124 322068176 320661430 320582047 320053253 320124702 320714531 320881157 322246628 322672539 320889549
583.5 320889549 319064503 318624916 318365116 319637032 321229362 321693649 322928276 323590660 324195557
592.1 324195557 324154701 323917274 324051590 323200645 323390350 324274521 324642601 325106659 324423294 322353287
601.8 322353287 321824989 321457863 320968361 322503891 322606125 322291756 321945457 320666389 320099716
610.5 320099716 319509907 318357124 316604633 316550674 316733818 316799946 317311401 316698437 317260647 317055588
620.1 317055588 316545963 317089939 317373810 318502426 319482231 319829216 320941544 321884308 321898842 323626633
629.8 323626633 325606651 326441383 328143044 329361610 329510307 329959793 331909981 334112358 335414772
638.4 335414772 336072960 336629982 337358627 338413391 340222206 341176186 341814499 342102852 342596092
647.1 342596092 344633408 345685043 346792297 348089790 348412933 348796463 349578819 350052948 349390144
655.8 349390144 349267159 349085579 348730621 348875618 348664360 349001236 348392181 347465630 347173195 347273254
665.4 347273254 348442917 349125671 351746597 352446365 350768852 349480782 349513931 351196136 353003082
674.1 353003082 353514023 353696136 354653969 355832100 356928177 358165131 358597412 359203911 360698776
682.8 360698776 361835937 362796326 363820496 364681664 365207138 365486374 365607986 366076851 367254295
691.5 367254295 368384972 369367218 369902420 370461502 371050415 371061401 371746979 372372169 372588921 372741890
701.1 372741890 372213707 372610397 373988419 375262299 376403236 376519737 376381989 377327423 378393402
709.8 378393402 378616447 378904381 380333023 381571159 381752968 382191772 382927704 383226280 383422890
718.5 383422890 384097824 384179573 384304924 385261192 385699844 387173309 388859711 389637947 390795479
727.2 390795479 391411133 392555008 393894844 394009972 394376068 395663223 396481476 396651878 397688484
735.8 397688484 399179687 400155792 399854279 399332008 399052696 398668556 399152298 399585381 400427589 401813393
745.5 401813393 403360748 405015984 405894814 406469307 406538925 406991463 407558403 407196465 407673454 409886627
755.1 409886627 411832695 413074265 414696693 415165253 415717354 417102318 417984619 418527603 418860512
763.8 418860512 420177460 421391373 422153168 422919693 423145790 423324432 423445969 423656654 423897591
772.5 423897591 423936043 423346825 423379974 424735451 425970192 425428047 424500084 426170082 427355499
781.2 427355499 427156677 426915550 426212730 427012215 428709030 429463844 429442482 429765549 430413132 430855217
790.8 430855217 430933151 431021156 431104622 430546761 430245972 429483528 429132347 429631729 429390259 428670769
800.5 428670769 428026085 427898712 426919441 425104599 422941551 421188164 420271645 419371719 418910484
809.1 418910484 417698326 415948677 414075394 412194099 410818901 409045868 407417068 406639977 406575127
817.8 406575127 407152863 408356628 408644180 408237495 409092979 410195770 411397285 413167114 415456467
826.5 415456467 418413200 421962357 425522461 428504677 431453400 434190903 437278633 440072708
834.2 440072708 442706299 445223351 446635933 448611412 451148911 453729401 455228615 456818085
841.9 456818085 459006538 460869255 462715836 463494797 465053139 466785049 468420830 469822807 470643158
850.6 470643158 472546234 474114075 475055847 475700035 477398071 478750496 479570465 481178436 482613831
859.3 482613831 484556198 485732613 487000198 488367920 489455223 488881645 487616615 487911377 486919594
868 486919594 486240273 484583359 483374443 483631325 482441826 481694069 480055923 477780914 475868073
876.7 475868073 474338913 472534561 471454010 471204948 470310631 470352249 469868660 469521065 468749390
885.3 468749390 467262497 466025124 464938469 464943237 464166031 464267998 464668236 465296860 466695404
894 466695404 467202797 467928658 467805748 468217278 468523521 467710762 467008057 467313805 468059578 467963219
903.7 467963219 469351349 470905342 473102341 475339546 476241455 477897110 479902420 482290344 483256187
912.3 483256187 484020462 484392700 483775902 482661667 479838295 477293396 474300003 471540527 469080544
921 469080544 466523819 464011536 461113663 458525200 454783516 451207123 447661705 442903099 438492508
929.7 438492508 435419197 433013878 430989799 429622726 427910919 426514778 425341873 423980484
937.4 423980484 422351227 420922775 419802589 418180351 417800064 416971474 416068077 416353378 416034966
946.1 416034966 415961494 415358620 414985809 414940300 414640160 414992409 415143738 415510750 415888748 415630569
955.7 415630569 414388847 412430496 409906082 407078629 404562569 402266121 400475960 398945312
963.4 398945312 397891159 396775780 395216827 393205566 390728416 388660393 386346817 383918610
971.2 383918610 381593132 378957901 376289825 373741608 371139641 367982292 364133034 359573364
978.9 359573364 354793434 350302811 345727654 340768852 336271477 331803589 326482849 321283569
986.6 321283569 317172985 313331604 308570156 303634205 299719105 296618690 293276958 290718441
994.3 290718441 288769932 286595440 284140205 280509033 276755028 273784122 271586189 268854160
1002 268854160 266231232 264318733 262585258 261752548 259677219 257294712 255755348 254069557 252004738
1010.7 252004738 249980335 248359737 246327457 245190029 244032898 242475567 240433311 237952728
1018.4 237952728 235735359 232713509 229958363 227484474 225885792 223961029 222600117 222415791
1026.1 222415791 221197453 220187607 218186855 217226009 217044125 216390724 215257988 213522472 214479771
1034.8 214479771 215391827 215715752 216778297 218598518 220175915 221244869 222975197 223786449 224367008
1043.5 224367008 224224300 224280796 224468765 224395561 224959755 224773655 224022770 222446632 221140785 219176941
1053.1 219176941 217969017 217802925 216752720 216333427 215442181 215818748 216533661 217658157 219491997
1061.8 219491997 220876427 222155781 223392067 226408119 227464542 228512955 230421791 231410618
1069.5 231410618 233012447 233319016 233441963 233162212 233936596 234688663 234390907 234654751 234728050 235986824
1079.2 235986824 236297646 236345501 236529293 236515789 237244015 237990704 239141369 240428257 243309078
1087.9 243309078 245387192 245433846 245596485 247479420 249924278 250925846 252449532 253683968 254666042
1096.5 254666042 255557480 256623421 258014469 259357147 261239758 262373772 263907776 265222893
1104.2 265222893 266836109 269012089 270253639 271460056 272475681 273288670 273671513 274852257 276209946
1112.9 276209946 277121258 277838726 278672428 280477314 280859299 280792141 280619335 280193119 280364838 280227261
1122.6 280227261 280140934 280203915 281226749 282175903 283415623 284791126 285747929 287493000 289243660
1131.2 289243660 291225567 293049335 295644627 298165550 300103798 302620964 304992828 307218552
1139 307218552 309012356 311243095 312542496 313043194 313984661 314719391 316265087 317843742 318638153
1147.6 318638153 318664913 318844948 319105854 318972340 318621159 317686214 317900829 318354568 318261108 318427753
1157.3 318427753 317889309 316814213 315887089 315076180 313803825 313397465 313957653 314936504 317452736
1166 317452736 320343323 322460060 324587097 327178574 329336433 331690178 334341927 337199287 340169411
1174.6 340169411 342933578 346288033 349461098 352117424 354632111 357117310 358920441 360287209
1182.4 360287209 361672821 363191605 364923019 366486664 368628502 370249443 370678749 370697632 370654602
1191 370654602 370172768 369602089 369334908 368692513 368733139 368315582 367249336 366903305 366095352 364362640
1200.7 364362640 362157745 360684853 359606743 358898239 358322945 356891785 356525421 356745949 356490173
1209.4 356490173 356224327 355746574 355028534 354254379 354047508 353734512 353610229 353735924 353698120 354000664
1219 354000664 353786774 353323097 352694473 351568298 350236893 349186974 349101067 348994522 348769264 348698158
1228.6 348698158 348063164 347048912 345951042 344675407 343584785 342779274 341933708 341653481 341515656
1237.3 341515656 341272545 341757355 342042999 341553040 340762291 339965706 339335518 338740387 337951889 337499504
1247 337499504 337517052 337455864 337383423 337040672 336509743 335733147 335149002 334901390 334517136 334661484
1256.6 334661484 334862709 334975967 335060616 335355453 335621605 335384598 335428162 335401230 335762329 335951385
1266.3 335951385 335989037 336896324 337840881 338812714 339365387 340012779 341155777 342031555 342311897 342712097
1275.9 342712097 343913116 345067253 346178246 347051582 347849693 348871002 349821091 351040916 352573280
1284.6 352573280 353829765 354586868 355581627 356974525 358561172 359837532 361043663 362204590 362750740
1293.3 362750740 363067360 363362007 363856621 364457092 365307884 366037598 366551056 366906090 366838799 366848221
1302.9 366848221 366854057 366894150 366484528 366324348 366510277 366085854 365687332 365257339 364966393 364552155
1312.5 364552155 363940010 363191109 362487640 362303047 362241783 362794876 363415298 364264412 365469437 366313286
1322.2 366313286 367402344 368314819 369078178 369730682 370075912 370109520 370166626 370162659 369786568 369294052
1331.8 369294052 368732185 368688164 368337250 367702217 367498741 367517662 367949753 367896271 368150406 369158630
1341.5 369158630 370200882 371238060 371924133 372429428 373034668 373930359 374345207 374642410 374822884
1350.2 374822884 374764442 374540596 374112968 373904495 373439598 373203392 373152847 373228416 372952347 372665405
1359.8 372665405 372297668 371033211 370527420 369812469 369618263 369677505 369322433 369065514 368358269 367766304
1369.4 367766304 366889229 366380692 366236534 365949402 365768166 365852203 366626053 366628227 366146851 365221100
1379.1 365221100 364904175 364504776 363206329 362158318 360445709 359311790 358472519 357262001 354931602
1387.8 354931602 353263092 352771378 350752869 348599854 346645164 344827156 342750587 339788933
1395.5 339788933 338216324 336446381 334842377 332197456 329365997 327705917 325606384 323615417
1403.2 323615417 321616325 319047527 316953773 315799160 314446049 312693100 311162796 309191799
1410.9 309191799 307832260 306432915 305133076 304434605 303310032 302815590 302278118 302227688 300674191
1419.6 300674191 300229511 301283817 301066551 301595211 301560383 301856136 302480087 303219852 305046921
1428.3 305046921 305654430 306648445 307665520 309304543 310891685 312438450 314870739 316468906 318285789
1437 318285789 319464226 322280579 324618988 326478767 328482742 329824028 332071838 333390770 335311432
1445.6 335311432 336821327 338073120 339610062 341171303 343701897 344774284 346544571 347954521
1453.3 347954521 349666443 351795921 353255653 355109367 353890457 357245636 359170647 361758957
1461.1 361758957 363886032 365298157 367912178 368354988 370182266 372060699 374738388 377391014
1468.8 377391014 379831123 383429985 385801811 388509750 390855522 394431992 397702103 399564323
1476.5 399564323 401692162 404023972 406553612 408890457 411204987 413023758 414838142 416420097
1484.2 416420097 417860107 419798889 420354347 420575562 422587051 423947067 423680916 424154434 424813690
1492.9 424813690 424536896 424197922 423763313 419766693 419833450 418793869 415780144 415453796 414561844
1501.6 414561844 413727722 413179893 413450165 413074722 409648018 405730782 405886345 406986504 406365509
1510.2 406365509 407253265 406720657 405242233 405249062 404804840 404555893 402006569 399291153 400813408
1518.9 400813408 402770424 401291885 399475708 400551834 400915833 402322311 401869202 402417870 403225975
1527.6 403225975 402924652 403512421 404458389 405504036 406364861 407168655 405324554 406193733 406912766
1536.3 406912766 407253227 408706169 407063637 405285416 405635185 407095871 406792374 407322388 407742195
1545 407742195 406609612 408093872 408310928 408877487 407849350 406390915 407443810 407487946 408284683
1553.6 408284683 405415039 405014610 406184502 406471329 400338593 390787811 396361389 395577927 395995712
1562.3 395995712 394564095 392898560 389287109 385826607 384794006 382326279 380567627 372208824
1570 372208824 370121803 368108444 364363632 361219025 358082619 357392616 345795898 343506393 340297127
1578.7 340297127 336416359 332803841 327525635 323954010 318261852 315116768 310290203 306083107
1586.4 306083107 301840038 297081203 294467602 289287548 286600819 281459827 278617134 275196018
1594.1 275196018 270746479 268481731 264065876 262653294 258733482 256744881 253665600 251082420
1601.9 251082420 249549046 245507755 244756184 242048664 241528587 238702469 237428131 236837482 234517059
1610.5 234517059 234713707 231925392 232102032 230660152 231229515 231829567 227326508 228573895 227297802
1619.2 227297802 228915176 227776737 228504677 228561878 227481022 229404659 228892651 230588589 229374752
1627.9 229374752 230928726 231669579 232781887 234296169 234235554 236525688 236874866 239207306 237513638
1636.6 237513638 239911861 241435204 242652187 245279045 245761871 248468933 248916225 251166210 252696114
1645.3 252696114 252251110 255401707 255475159 259353008 259755116 262616463 265536575 267331429 266666298
1653.9 266666298 266251335 270241585 270823097 273059902 274386768 276406326 279051151 280967846 283943958
1662.6 283943958 284156780 287609634 289593029 292181149 294816780 297594013 301641598 302394772 307008514
1671.3 307008514 309602337 313592625 317050915 319672089 322561035 325366058 329675484 332398720
1679 332398720 336700706 340149841 344868126 349675827 349813042 356205025 359775505 365642509 369779549
1687.7 369779549 373697128 377962837 382049713 387314034 391660233 396973457 401901703 406110001
1695.4 406110001 408161507 414076729 420006561 425250702 429928589 429134026 436226692 441728706
1703.1 441728706 446300735 449774246 453037109 455885315 458252144 462112465 464709015 466995811
1710.8 466995811 469840927 472735786 476295815 478083000 478985901 481837082 483893433 480746269
1718.5 480746269 483644867 487358780 489730186 491850281 493254128 494368935 496273880 498171730
1726.3 498171730 499470825 500806198 502497597 502273750 502924538 507053566 511352158 510248833 507371407
1734.9 507371407 512079811 516022491 518039246 520908432 521954460 521282730 525810165 529965401
1742.7 529965401 532232399 534628296 538538322 542597809 545761185 549238625 551295586 555347862
1750.4 555347862 557234688 559236603 565196686 569544296 573930817 578222427 579883881 582157402
1758.1 582157402 585070381 588012085 591349525 591064415 592138138 596320915 599034119 601495476
1765.8 601495476 604199944 606544991 605690460 608063202 612458382 612825737 611112213 609981575 614555511
1774.5 614555511 617906151 618313408 620737991 621660156 623467255 624284592 623371239 624484138 626554947
1783.2 626554947 628836975 628830605 629645348 631824875 633289261 633919220 635181389 636190720 637479782
1791.8 637479782 636277504 634769478 638565178 640518341 640873184 642615356 644766769 645476151 644166946
1800.5 644166946 646123505 646095123 646483688 648145523 648789215 650249100 651273651 652443237 653914719
1809.2 653914719 655375137 654296341 654373703 655455627 655626907 656755295 657115097 658504486 658960266
1817.9 658960266 659934464 661527405 661370163 662203598 662036743 663328476 664672241 662174454 662291794
1826.5 662291794 664704361 667375259 667719116 664606171 665415421 668058090 668427124 668509979 668857651
1835.2 668857651 669215927 669504852 668866043 670542679 672060242 673339996 673774261 674529037 675272980
1843.9 675272980 669808502 671585846 673959198 674207306 674431305 675456085 677136688 677292633 677710571
1852.6 677710571 677503281 677518539 677478333 677406540 677641678 677311859 678558350 679500656 680632477 681118927
1862.2 681118927 681309357 681490479 681108475 681501160 680904770 681808090 681091003 679665833 681336899
1870.9 681336899 682839584 683914871 683934097 684082413 683595581 683426971 683267517 683149414 683767548
1879.6 683767548 683994751 685166473 685802765 686520538 686349030 685776672 685864105 685383453 686285172 685897522
1889.2 685897522 684813004 685858231 687122803 687615814 688010254 687898560 686784363 687210693 686830902
1897.9 686830902 686735764 687179031 687330399 688140106 688615875 689435654 689375916 689469833 689344101 688633804
1907.6 688633804 688300705 688078079 688101120 688140640 689866867 690506363 690701370 690967484 690741730 691447296
1917.2 691447296 688892288 688172531 689499283 689858704 690437927 690658417 690994110 691231079 691260376
1925.9 691260376 690564880 690455627 690190277 689826279 690129013 690271378 690878754 690935974 691721497 691865692
1935.5 691865692 691220169 690917511 690435028 690519485 690046616 690782700 690662842 689217224 690381317
1944.2 690381317 691692505 691892624 691210251 690804977 690104218 689642258 689435501 689498825 689946976 690174408
1953.8 690174408 690743408 690719452 691005707 690663223 689910278 689417038 688855515 689082184 688884964 689152908
1963.5 689152908 689236450 689782791 690474701 689833450 689637909 689522476 689648590 689109802 688834000 688817978
1973.1 688817978 688770828 689266739 689212570 689672623 689493256 689139862 688998718 688570175 688256454 688152084
1982.8 688152084 688671188 688470230 688584595 688800659 688852463 688730087 688291931 688501816 687895126 686746597
1992.4 686746597 686374512 687060089 687276840 687330093 687810211 687762451 687943420 687188950 686758041 686561661
2002.1 686561661 686047974 685621033 685316238 685885468 685759048 685884933 685984268 685976028 685779190 684972534
2011.7 684972534 684864731 684551468 684474716 684345398 684545288 684512482 684134827 684251022 684007034 684025650
2021.3 684025650 683380203 683085251 682765274 682390518 682347031 681733551 682077942 682259521 682416229 682089310
2031 682089310 681509399 681418762 681059494 680806732 680228348 680210495 680088425 680419312 680646973 680325012
2040.6 680325012 680400620 679879990 679668198 679049988 679096909 678937454 678403320 678592148 678117676 678460693
2050.3 678460693 678292236 678064117 678113022 677999802 677963562 677287369 677190552 676838455 677100220 677276382
2059.9 677276382 677137146 677429199 677405396 677662811 676972656 676302338 675950546 675941467 675988159 675650864
2069.6 675650864 675841751 676007309 676374130 676249619 676466217 676458588 675900116 675360565 674526367 674721680
2079.2 674721680 674802704 675053177 675278549 675500336 675446396 674598007 674526291 674268570 673992233 673245850
2088.9 673245850 672817535 672957764 673113403 673694153 673600082 673745880 673363037 673037720 672522202 671765747
2098.5 671765747 671794357 671423950 671781311 671897049 671939316 671954041 671814041 671887817 671095657 670239410
2108.1 670239410 669244461 669267273 669461899 669321365 669558945 669880219 670270386 669659729 669324188 668772354
2117.8 668772354 668253403 668111725 668006516 668089371 667591782 668183670 668741074 668788757 668580399 667959595
2127.4 667959595 667488174 667112656 667424164 667240448 667387619 667597504 667758484 668276062 668247833 668323822
2137.1 668323822 668029633 667647095 666698761 666289825 666490860 666650696 667445374 667641373 668004532 667970810
2146.7 667970810 667884750 667754974 667294617 667066574 666388245 666509018 666676636 667051392 667613754 668232956
2156.4 668232956 668702927 667962799 667368927 666720123 666625061 666640396 666548538 666745071 667115173 667766876
2166 667766876 667552261 667624130 667670822 667661591 667346191 666902466 667120895 667047272 667572327 667841415 668351517
2176.6 668351517 668580551 668232803 668376923 667984695 667873535 667606201 667652664 667788696 668099747 668684235
2186.3 668684235 668650665 668776016 668285675 668373337 668403320 668012695 668052292 668135681 668611450 668483963
2195.9 668483963 668642807 668755798 668656693 668584824 668636856 669286118 669314194 669278717 669222870 669291000 668956070
2206.5 668956070 668681946 668962326 668894043 669122162 669099731 669297180 669200287 669067841 669313507 669343872
2216.1 669343872 669572678 669419479 669599457 669447556 669398804 669413986 669185867 669524155 669408035 669540100
2225.8 669540100 669477844 669501953 669473190 669084549 669046402 669044418 669243317 669022217 669347534 669409943 669204102
2236.4 669204102 669539108 669558945 669491806 669132767 669249115 669080963 669146729 669446716 669646378 669974518
2246 669974518 669281006 669140930 669049911 669064789 668899536 668619843 669051514 669257278 669925003 669697342
2255.7 669697342 669583435 669723053 669407578 669200058 668827820 669154587 668947906 669127121 669338684 669376907
2265.3 669376907 669584732 669228592 669375000 669119873 669239578 669110107 668820190 668987045 669113617 669487000
2275 669487000 669439468 669816895 669298859 668882370 668554459 667793732 667898865 667512817 667803574 668024063
2284.6 668024063 668165894 668190994 668229675 668889771 668426590 668338852 668115234 668326111 668672638 668575363
2294.3 668575363 669285049 669310150 669771805 670075684 669932709 669753723 669474335 669975433 670310211 670412979
2303.9 670412979 670359726 671002426 671693497 672420120 673169098 673005905 672961349 672648163 673119583 673484116
2313.5 673484116 673533936 674295197 674662247 675684814 676844788 677442398 677345505 676872025 677101593 677805557
2323.2 677805557 678908615 679584503 679723969 680495911 681825104 683323441 684001694 682068710 680216827
2331.9 680216827 679300232 678772354 679959106 681817551 683528061 683383408 683410645 683404312 682493896 682301559
2341.5 682301559 681289597 680056763 679104156 678431778 677295990 675161362 672803116 673233337 676044693
2350.2 676044693 677100754 678777390 680175781 680946198 683069458 684325714 686432419 686845474 689045639
2358.9 689045639 689337387 688124771 688184814 686603928 686172791 684456329 683877716 682063751 680263748
2367.6 680263748 678744354 675677414 674207153 672254868 670558395 668350143 666417084 665051498
2375.3 665051498 663982620 663303299 661803284 660908585 659395142 657529678 655735931 654253769 653470383
2383.9 653470383 652448044 652063980 651913300 651867218 651712265 651770172 651943817 651490097 650691147 649467010
2393.6 649467010 648963776 648468246 648248978 648191605 648239517 648813553 648274155 647936325 647478027 646987381
2403.2 646987381 646354904 645328674 645289536 645256195 645419769 645278244 645372467 645434113 644935455 644735184
2412.9 644735184 643903427 643063736 642265320 641968079 642167358 642349472 642300034 641842728 641657486 641129913
2422.5 641129913 640566406 639672775 638931885 638480988 637922821 637913704 638049393 638360214 637972183 637590675
2432.2 637590675 637162590 636597900 636300354 635493813 634982033 634214134 634277420 634616051 634314919 634258842
2441.8 634258842 633745079 633376160 632453423 631380997 630840950 630724716 630736961 630587158 630584984 629903450
2451.5 629903450 629579430 629337616 628978424 628300972 627108116 626837082 626509438 626119423 625794067
2460.1 625794067 625734558 625782089 625337601 624930534 624530869 624108849 623172417 622284203 621533699 621398544
2469.8 621398544 621686630 621417885 620995216 620245094 619977608 619526138 618715172 617691956 616742363
2478.5 616742363 616762772 616453476 616030388 615673828 615598412 615228882 614690399 614255676 613129807 612787437
2488.1 612787437 612144852 611430893 611338081 611250534 611122971 610321808 609989166 609484138 608718529 607885437
2497.7 607885437 607071190 606828842 606266441 605781517 605339203 605139160 604923668 604511871 603874626 602863808
2507.4 602863808 602185440 601318970 600738640 600447998 600056229 599667892 599330330 599125443 598664436 598108406
2517 598108406 597528381 597054939 596253662 595802460 595641441 595371208 595447197 594778900 594210320 593957901
2526.7 593957901 593255234 592164307 591441193 591259613 590821342 590605621 590005798 589617424 589424744
2535.4 589424744 588990479 588554268 587701035 587364082 586836624 586431236 586088753 585379639 585086288 584866371
2545 584866371 584702225 583895645 583243408 582953491 582451630 581917381 581280975 580861855 580539703 580525627
2554.6 580525627 580148697 579715538 579318619 578785973 578362389 577534828 576839447 576012878 575703354 575575409
2564.3 575575409 575343704 575177231 574478874 574302559 573910027 573590393 573183746 572254715 571659851 570942764
2573.9 570942764 570497665 570213585 570043411 569806824 569656219 569223557 568410149 567816200 567008629 566776009
2583.6 566776009 566267014 565765305 565697708 565269432 565009804 564516029 564157181 563618164 562852554 562267075
2593.2 562267075 561938438 561474991 560687256 560420761 559940529 559555435 559134903 558593788 557883911 556837654
2602.9 556837654 556467667 556146622 555861092 555141296 554814186 554940796 554262543 553691673 552853546 552269402
2612.5 552269402 551895714 551362534 550647354 549780693 549545250 549121819 548582344 548332596 548040619 547142601
2622.1 547142601 546269455 545530128 544698372 544462585 543895226 543224792 542566223 542470970 542432022 541506615
2631.8 541506615 540811806 539773369 539256477 538955154 538198471 537737274 537159653 536744690 536338158
2640.5 536338158 535993462 535467186 534964523 534522667 533624420 532495193 531770210 531696815 531212234 530928917
2650.1 530928917 530553665 529798088 529294891 528602943 527977257 527152824 526576729 526181145 525975342 525793419
2659.8 525793419 525144691 524759827 524433746 524111252 523371620 522649460 522173309 521758690 521318016 520676308
2669.4 520676308 520909958 520839386 520229187 519696884 519252548 518985558 518363495 517855797 517275772 516966019
2679 516966019 516391792 515595284 515365906 515011292 514817047 514607430 514191742 513452797 512973022 512537270
2688.7 512537270 511927567 511948166 511668701 511114044 510570717 510305557 510011024 509528923 509035149 508452263
2698.3 508452263 508349915 507786331 507438469 507449951 507185135 506700706 505934410 505759010 505351944 504935074
2708 504935074 504547272 504079933 503646202 502936172 502711182 502258606 501942253 501824608 501756935 501463242
2717.6 501463242 500448380 499901962 499490929 499242706 499297218 499517059 499475517 499030838 498618202 498205566 498177147
2728.2 498177147 497523651 496763420 496300507 495972900 495944176 495515404 495657692 495682449 495279121 494990578
2737.9 494990578 494716072 494601593 494164658 493707695 493221436 493214264 493481102 493415260 493402252 493337708
2747.5 493337708 493101082 492487297 491754570 491105156 490905037 490791435 490545502 490715370 490810509 490399208
2757.2 490399208 489767342 489506645 489057617 488534775 488163834 487715759 487322960 486954002 487099419 487071152
2766.8 487071152 487214890 487019768 486219978 485950012 485336189 484906006 484462662 484118500 483875389 483355484
2776.4 483355484 483525429 483386726 482945976 482156601 481262093 480828285 480363693 480092010 479695091 479235764
2786.1 479235764 478912315 478873253 478398857 477671967 477165833 476041679 475258255 474901886 474447632 473781433
2795.7 473781433 473175507 473020706 472683105 472290802 471859055 471120567 469828148 468534355 467821999
2804.4 467821999 467329521 466863670 466511955 466300926 465703049 465077286 464262505 463015633 461842804
2813.1 461842804 460600929 459667358 459145164 458795242 458401413 458032417 457438927 456550026 455724258
2821.8 455724258 454646988 453549271 452373276 451399841 450690384 449905968 449221458 448563347 448226395
2830.4 448226395 447566719 445996857 444411697 443675919 442794533 441520157 440690727 439640884 438534851
2839.1 438534851 437184792 435726700 434119835 432030373 430274277 428164482 426098442 424484673
2846.8 424484673 422734222 420760460 418999519 417701225 415837631 414194641 413362541 412956123 412495041
2855.5 412495041 411581650 411105118 411079903 411160660 410914841 410446091 410226059 410204659 409790611 408773384
2865.2 408773384 408059807 407209091 406063805 404932632 403907280 403383636 403029099 402618523 401771278
2873.8 401771278 400711441 399926262 399205627 398246498 397472610 397487068 397206497 396281281 395682678 394947205
2883.5 394947205 394021492 393587990 392453194 390683060 389328461 388245125 387771912 387136078 386198883
2892.2 386198883 385733528 385394897 384562721 383269882 382399750 381715126 381003227 380283279 379259109
2900.8 379259109 378106003 377765121 378181686 377649918 376479149 375228615 374572334 374329453 373211823
2909.5 373211823 372208176 371253166 370148468 369297180 368453407 367353172 366004257 364743347 363357887
2918.2 363357887 361977348 360633316 359795341 358886223 357800255 357474365 357201157 357047997 356641808
2926.9 356641808 356368675 356408577 356295204 356296921 356142197 356667557 356968651 356793213 357319908 357968330
2936.5 357968330 358320389 358734398 359510765 359786224 360078201 360987701 361863174 362537537 363410683 364697571
2946.2 364697571 365290413 365490456 365794983 366250229 366926842 367351875 367647247 367847099 368534927 369295959
2955.8 369295959 369744339 370093384 370338364 371100426 371896896 372216301 372281456 372770576 373730278 374525757
2965.5 374525757 374868050 375181503 375964508 376435814 376647568 376995125 377422791 377928810 378655853 379325562
2975.1 379325562 379699364 380635147 381388054 381527596 381768341 382433777 383017464 382986221 383316422 383746490
2984.7 383746490 383915443 383774376 383943253 384754105 385062561 385350342 385409317 385342636 385535812 385208626
2994.4 385208626 384642677 384650917 385109901 384754219 384111366 383951530 383427086 382393990 381836243 381759148
3004 381759148 381057930 380201988 379696922 379342842 379085999 379061089 378905182 378253860 377520103 376861725
3013.7 376861725 376475182 375671539 374939384 374599953 373936234 373379974 372667465 372244225 371693039 370702629
3023.3 370702629 370019569 369357452 368830605 368145065 367415619 366856422 366362419 365509682 364479065
3032 364479065 363953209 363142166 362142677 361291962 360663948 360039673 359168167 358404007 357913170 357570343
3041.6 357570343 356805534 355940742 354838791 353814240 353060379 352231903 351698685 350660744 349891624
3050.3 349891624 349327774 348496170 348148193 347355270 346432304 345751419 344915085 344075928 343530235 342899933
3060 342899933 341821289 341245880 340982437 340204811 339270744 338905220 338247337 336939354 336006470 335442123
3069.6 335442123 334949570 334295120 333873901 333337746 332694359 332366753 331654625 330901146 329962769 328966370
3079.2 328966370 328481178 328234749 327874947 327056236 326338387 325789337 325074081 324144096 323142471
3087.9 323142471 322663078 322480469 321930046 321500168 321204681 320315132 319534168 319029350 318330841 317413597
3097.6 317413597 316516476 316001377 315584927 314905434 313842125 313240604 312815170 312016563 311421814
3106.2 311421814 310898914 310445576 309663086 308834019 308127270 307471523 307115822 306498184 305650940 304625015
3115.9 304625015 304189358 304136562 303447952 302267437 301336861 301107368 300589046 299881554 299131947 298545322
3125.5 298545322 298126087 297112732 296228485 295388393 294730110 294183826 293684978 293112946 291995678
3134.2 291995678 291406975 290805130 290005360 289559269 289138603 288681850 288046360 287064743 286069450 285648880
3143.9 285648880 284991360 284236851 283585320 282837219 282344799 281625156 281087589 280340919 279409924 278824997
3153.5 278824997 278195152 277532463 276801910 276236420 275466537 274838600 274292736 273464260 272667084 271727505
3163.1 271727505 271242619 270821838 270228615 269610157 269075356 268786507 268093529 267275085 266235275
3171.8 266235275 265224342 264561081 263975372 263586216 263289394 262959957 262236023 261535778 260613804
3180.5 260613804 259353905 258682690 258163567 257681942 257452354 257003498 256423721 255891018 255168743
3189.2 255168743 254582443 253987427 253023453 252207184 251603336 250978813 250403500 250336361 250159187 249403362
3198.8 249403362 248674145 248016186 247369461 246245365 245451317 245365009 245083275 244656506 244193993 243721085
3208.5 243721085 242893543 242405167 242045040 241236324 240841293 240311642 239762897 239580898 239308529 238809566
3218.1 238809566 238139000 237282410 236353741 235972328 235876923 235446854 234293518 233283768 233157139
3226.8 233157139 233040485 232775688 232219677 231486969 231209717 231326065 230972919 230141068 229354038 228374958
3236.4 228374958 227672501 227316704 227476158 227589455 226978264 226490593 225948048 225622120 225273457 224736423
3246.1 224736423 224519405 223871479 223217487 222826862 222455444 222318363 222103767 221560993 221091690 220866222
3255.7 220866222 220149536 219404659 219264565 218995953 218566399 218436165 218248177 217410030 216630287 216850147
3265.4 216850147 216940231 216245060 215816593 215565262 215140858 214733009 214312744 213813171 213549480 213861904
3275 213861904 213561611 212716579 212487946 212208385 211736641 211405640 211129074 210987148 210839996 210530357
3284.7 210530357 210499973 210765171 210272121 209443474 209277515 208736935 208069420 208573532 208690014 207931175
3294.3 207931175 207674370 207559261 207042847 206393452 206450520 206599693 205743046 205197392 205393600 205234165
3303.9 205234165 204814491 204361286 203805485 203817101 203983192 203632050 203043098 202374573 202316399 202288113
3313.6 202288113 201762886 201328449 201004353 200740051 200384407 200072708 199515209 199378738 199760628 199216061
3323.2 199216061 198418503 197866840 197396603 197206707 196911678 196206055 195422268 195022488 194761372 194428463
3332.9 194428463 193780079 193098335 192780323 192493134 191995773 191559334 191285610 190769215 190543289 190046005
3342.5 190046005 189206848 189110546 188979340 188924484 188516293 187517891 187348251 187489529 187152405 186748161
3352.2 186748161 186394749 186039448 185944099 185733395 185580769 185480175 184920521 184789028 184750900 184472256
3361.8 184472256 184404583 184279575 184017258 183624077 183474007 183228874 182924919 183122501 183060780 182437229
3371.4 182437229 182093353 181942215 181420689 181107388 181224003 181593132 181754417 181610527 181386528 180752392
3381.1 180752392 180553188 180537891 180582867 180902214 180304356 180027599 180341148 180244408 180108662 179763374
3390.7 179763374 179591141 179846554 180136738 179981289 179485378 179637623 179971085 179662533 179269562 179293194
3400.4 179293194 179485321 179303360 179269123 179224567 178630009 178655987 178891315 178673325 178945751 179168129
3410 179168129 178901367 178755951 179041061 179485950 179538879 179489784 179572277 179607010 179725094 180138512 180532093
3420.6 180532093 180454235 180668964 181250362 181351986 181304169 181167812 180795765 180895233 181746960 182656574
3430.3 182656574 182971725 183172836 183015099 182745686 183186169 183192329 183275852 183685188 183802700 184298477
3439.9 184298477 184711208 184891624 184704952 184835320 185515442 185985317 186652966 186814365 187042923 187557774
3449.6 187557774 187587547 187682266 188030262 189112320 190286140 190829391 190885525 190903378 191401482 191716633
3459.2 191716633 191983166 192669849 193527584 193901501 194225063 194917793 195430222 195996113 196181316 196524467
3468.8 196524467 197112522 197430859 198356075 199228745 199858608 200305061 200471344 201160297 201656799 201732349
3478.5 201732349 202597637 204028225 204791126 204924793 204958649 205553360 206489792 207293282 208261585 208893585
3488.1 208893585 209303398 209758453 210400753 211256523 211796017 212724495 213706417 214042339 214443283 215179539
3497.8 215179539 215947876 216584625 217066917 217599392 218242817 218394108 219047165 220632877 221647320
3506.5 221647320 222389603 223481884 223753757 223609848 224994621 226696796 227389793 227743130 228263340
3515.1 228263340 229291859 230533085 231254845 231903534 232824345 233571949 234773483 235982857 236462154
3523.8 236462154 237303181 238139057 239112244 240376930 241152439 241490650 242220383 243080349 243813305
3532.5 243813305 245326939 246613312 247608547 248278694 248804207 250335274 251684475 252734337 253310280
3541.2 253310280 254597740 256552010 257643547 258547401 259123001 260225582 261318893 263192005 265124779
3549.9 265124779 266288986 267389145 267062473 268338718 270086899 271667576 273426266 274211502 275826283
3558.5 275826283 277177258 278647118 279843788 281601067 283523426 284085636 286616573 287701626
3566.2 287701626 287797508 288334980 289708118 293190384 294761353 296088543 297599983 299127884 300819893
3574.9 300819893 302572384 304439430 305283394 307827168 310085754 311248150 313131218 315395432
3582.6 315395432 317301102 318412361 321542702 323408585 323919487 325636444 325713158 328652916 331685677
3591.3 331685677 334126930 335606270 337136269 339669609 339274178 341813850 345387535 346958199
3599 346958199 350130272 352193413 353512039 356270142 358686142 360593834 363483200 366230202 366384048
3607.7 366384048 369296875 370867386 371762619 377821388 380401649 380013428 383380775 383865738 387748489
3616.4 387748489 392324982 393406105 395652618 396153107 398255081 401952324 404833603 407890930
3624.1 407890930 411428223 414513626 417364731 423344612 425319290 418982162 423144836 428273468
3631.8 428273468 434176636 437058449 436669159 439668159 443259697 446408997 448199654 450475960
3639.5 450475960 454105377 457697372 460415840 462348251 465390053 469327545 475623665 477772675
3647.3 477772675 475535431 480378494 481254654 480943565 482476540 487721825 492558212 497254333 502936592
3655.9 502936592 497698059 500560722 506821709 509520493 512493744 513560295 515714188 517564011
3663.6 517564011 520120201 523165932 524988899 529705162 532372894 533256607 534612350 529937820
3671.4 529937820 533033295 541705360 551454659 550249939 534174538 538244324 546506157 551624718
3679.1 551624718 550273285 551158066 554199753 556436424 558394547 559644737 560820007 565792046
3686.8 565792046 573660622 565165138 561264839 570163918 565207634 564515457 570211105 571751595
3694.5 571751595 573882904 574780693 574918442 576463661 577057037 579651260 582225380 577479782 575802612
3703.2 575802612 580670090 582844048 583049355 583961296 587263603 591819649 585521851 588360252 592874527
3711.9 592874527 579803925 582983894 587769547 588887367 589882774 592237968 593572083 590850945
3719.6 590850945 592760353 598596802 596274109 591380005 595339508 597086296 597251625 595483894
3727.3 595483894 595289421 599553299 601206436 606203613 603665657 595885963 605963326 608331871
3735 608331871 598131523 598194885 599464569 599316940 601630440 605041275 602349014 604997978 615414314
3743.7 615414314 604475250 589238777 599690742 605867729 612449799 610320053 599026604 609541397
3751.4 609541397 604484138 596929169 602735748 607038651 610615730 605632629 608079262 614086571
3759.1 614086571 605784912 603438644 607727585 609733429 610189819 613468933 611511536 606884003
3766.8 606884003 609759445 614910927 615863686 606774101 608362503 611909637 612212753 612901344 612420502
3775.5 612420502 613525314 614179764 616789093 616981888 610124855 612687645 615050087 615854073 617842102
3784.2 617842102 614549980 612197952 613613739 614997101 615723457 615699654 616023140 616915092 617622643
3792.9 617622643 616817665 617368317 620635834 617152023 612196083 614791718 620158463 627473907 622079735
3801.5 622079735 610064583 612925339 615997086 621211090 626202965 615915680 611451683 616292381
3809.3 616292381 618268852 618721962 619694366 619343452 621036911 627865372 626331215 611738129 616069221
3817.9 616069221 621341782 625547523 628026428 612385330 613595543 619132767 621092415 623358383
3825.7 623358383 623235817 618473930 618381958 620780945 623885460 625276985 616437836 619266014 627795486
3834.3 627795486 621652718 620281525 628432693 620249519 614879875 622412605 617733688 616048965
3842.1 616048965 622421761 620617638 617618637 620729942 622700882 623386879 624691391 623296356
3849.8 623296356 625458717 632125168 626930962 628058167 613989487 612996597 623047714 621680679
3857.5 621680679 620439377 622886620 624236870 625713425 619695168 620061264 626686325 621206818
3865.2 621206818 615898895 620213623 625434151 631024437 623946762 614082031 618452530 624714432
3872.9 624714432 627606316 618110771 618104286 622238579 622418556 624677315 628738403 624349709 617247543
3881.6 617247543 621969681 623465576 624493561 629230423 617919388 618954964 622847939 622968636
3889.3 622968636 626806030 625562668 617863197 619050636 622822113 621906509 622070885 623209190 626516571
3898 626516571 629052124 618657532 623024712 625284576 619120598 623683701 621053200 619590988
3905.7 619590988 620033646 620598717 622133789 621299438 621950951 621905861 621798744 621471481 620892220 622920723
3915.3 622920723 625603867 623121071 619411201 622911186 622821693 619180946 621534309 623121872 623735771
3924 623735771 621763649 618800659 620637016 622177925 622606812 621805687 621389961 623187332 620773888
3932.7 620773888 618556900 619668083 619534645 620088348 621137085 621309853 621187630 620615082 621673775
3941.4 621673775 622688484 619695816 619010506 619941139 620302811 621463165 619894524 620299416 621342430
3950.1 621342430 619318619 620534973 620831184 619941292 620225182 620554504 620901756 620001373 620223618
3958.7 620223618 619965096 619866219 620569077 619625587 619872780 620007095 619138069 618678856 618852806 620026855
3968.4 620026855 620561409 620048943 619788017 619564972 619654961 619843826 619503975 619699326 619303093 618915520
3978 618915520 619377823 619744453 620478783 620366325 619750481 619125328 619096069 619543571 619360886 619386253
3987.7 619386253 618807831 618665047 619093857 619089165 619030418 619594231 620637474 619817505 619206963 619534111
3997.3 619534111 619719048 620151749 620027351
4000.2 620027351
##END=$$ End of the data block
