##TITLE=$$ Begin of the data block
##JCAMP-DX=5.00 $$ ACD/SpecManager v 10.08
##SPECTROMETER/DATA SYSTEM=Varian
##DATE=15 Jan 2013 09:53:38
##DATA TYPE=INFRARED SPECTRUM
##DATA CLASS=XYDATA
##ORIGIN=
##OWNER=
##NPOINTS=3735
##FIRSTX=399.26403809
##LASTX=4000.35498047
##MAXX=4000.35498047
##MINX=399.26403809
##MAXY=69.31964874
##MINY=17.88022232
##XFACTOR=1.0000000000
##YFACTOR=0.000000100000000
##FIRSTY=39.04743958
##DELTAX=0.96440572
##XUNITS=1/CM
##YUNITS=TRANSMITTANCE
##XYDATA=(X++(Y..Y))
399.3C90474396j5213547q526268p243652M31633J2115516L38593J80626K06222p787628
407.9C64975891j971550J332817L022499K091446k285232l774453j253814J290931
415.7C63428535M30031l47099J040382Q064042J057510l611298m464035l999557O16722
424.3C62215233J366691q1253j414909J313820L723450K725944J964607j037063m101601
433C66674919p314834o013451P54433L416290J899490N1956K022515O357612L26767
441.7C68175697p282943k213517P06787J398888L525047L328820k03171l66669r16252
450.4C66152687m177742j991882P54699m38766m09355J787796J783027j746673j656036
459.1C60057755k410355j368637j83258L377762L129043p154198m651107M857979N264205
$$ y = [390474396, 375260849, 366734581, 359490929, 359922562, 372038078, 372376671, 372557297, 372763519, 364975891, 363004341, 364337158, 367359657, 369451103, 367165871, 363391418, 362137604, 363428535, 363858566, 363511467, 364551849, 372615891, 373673401, 370062103, 365598068, 361598511, 362215233, 363581924, 363500671, 362085762, 363399582, 367123032, 369848976, 371813583, 370776520, 366674919, 359360085, 353346634, 354101067, 357517357, 359416847, 359468803, 361491318, 367848930, 368175697, 360892754, 358679237, 359386024, 360784912, 364309959, 367638779, 367435608, 367068939, 366152687, 361974945, 359983063, 360737762, 360298996, 359889641, 361677437, 363460464, 361713791, 360057755, 357647400, 356278763, 356095505, 359473267, 362602310, 355448112, 350797005, 355654984, 360919189]
467.7C60919189j16119j752434k156295n762635k651481J744880Q99811K221947K647209
476.4C55994072j116295o134834m242630K121620L766174j535721r57641K200012P57065
485.1C50851822l73612k675819j182709l02124J770020K035789l815803m599838k077904
493.8C39629822M071960M407311k053414j692123j465683j386299r09081j641693R55658
502.5C39916458K415161J553536K60086k353363k439194O37512J723290K35862o70318
511.1C41279030r04923k299804p23534J173134l56598r22585o9274J3771M85191J305237
520.8C38979645k99797j785965k250061k427750m55933L86162M20265J131020J79176
529.5C33876762j2855J03187j459693p16591j16921j348610J08757p3242J57662J432571
$$ y = [360919189, 360803070, 359050636, 356894341, 351131706, 348480225, 350225105, 351124916, 353346863, 355994072, 354877777, 348742943, 344500313, 346621933, 350388107, 348852386, 347894745, 350094757, 350851822, 350478210, 347802391, 346619682, 346317558, 348087578, 350123367, 346307564, 341707726, 339629822, 343701782, 348109093, 346055679, 344363556, 342897873, 341511574, 340602493, 338960800, 339916458, 342331619, 343885155, 344145241, 341791878, 339352684, 339990196, 341713486, 341949348, 341279030, 340374107, 338074303, 337350769, 338523903, 338167305, 337244720, 337175446, 337189217, 337674408, 338979645, 338679848, 336893883, 334643822, 332216072, 331760139, 332146301, 332566566, 333697586, 333876762, 333863907, 333967094, 332507401, 331790810, 331673889, 330325279, 330434036, 330360794, 330518456, 331951027]
539.1C31951027m07066k21100k88468j799049j181793k08588j702118j180153J166878
547.8C26129570L17192J135559m6425r20067n86547k692070r59740L02505L82691k8839
557.4C23033829o09589o96068j323280N63507O28090M20532N90706p25174q10585N47333
567.1C21619301J503410L05634r16748j272469M86679P72095l54157k33001r90296
575.8C20920448Q49877J156311q54035m68216O57540j0948o13556j26801R4681Q52585
585.4C22457886k89154L8833J141548n7525J45378K11182J3771k19536l3302p24984
595C22684097n33714N70183k99759J146583Q14286q30040k25830L60946N61676r61570
604.7C23286858j619492p90291M59595o45866l66135J669464k50015j587563k115745
$$ y = [331951027, 331543961, 331322861, 331034393, 329235344, 328053551, 327844963, 326142845, 324962692, 326129570, 326446762, 327582321, 327535896, 326615829, 326029282, 323337212, 322377472, 322679977, 323062668, 323033829, 322424240, 321728172, 320404892, 320968399, 321596489, 322017021, 322607727, 321882553, 321071968, 321619301, 323122711, 323428345, 322511597, 321239128, 321725807, 322497902, 322143745, 321910744, 320920448, 321770325, 322926636, 322072601, 321604385, 322261925, 322250977, 321637421, 321510620, 321605301, 322457886, 322168732, 322207565, 323349113, 323291588, 323436966, 323648148, 323661919, 323442383, 323409081, 322684097, 322150383, 322720566, 322420807, 323567390, 324381676, 323551636, 323325806, 323686752, 324248428, 323286858, 321667366, 320877075, 321336670, 320690804, 320324669, 321994133, 321744118, 320156555, 318040810]
613.4C18040810q26035j57490n92632M84619o15444J84288M12350o581P89986L53794
623C18067665O32286M73690Q10394J100674J01090P3852R96514K201881K151985P91588
632.7C27401619J196670J423607P32651J847916J956711J567916O23589j74141R80797
641.3C37557335J445923K126999J182136j47285J207847J477433R39254J076165J145324
650C48011131J55030o24161J016998J292839k58064l16887n56030m77562P95860R24912
659.7C49964066l17307j183662q59452n42907p42455j35498J076317K250137L071709
668.3C52580948j308060r28116j32064L03688J306648K716560Q50601n38368r6779
677C54755058k67219J161842J987686J419182P57141Q28171K696304K174378l44811
$$ y = [318040810, 317214775, 317057285, 316464653, 316949272, 316333828, 316518116, 316930466, 316923885, 317713871, 318067665, 318699951, 319173641, 319984035, 321084709, 321185799, 321259651, 322256165, 324458046, 326610031, 327401619, 328598289, 330021896, 330754547, 332602463, 334559174, 336127090, 336750679, 336576538, 337557335, 339003258, 341130257, 342312393, 342165108, 343372955, 344850388, 345789642, 346865807, 348011131, 348166161, 347542000, 348558998, 349851837, 349593773, 349276886, 348720856, 348243294, 349039154, 349964066, 349646759, 348463097, 347603645, 347060738, 346318283, 346182785, 347259102, 349509239, 352580948, 351272888, 350344772, 350212708, 350516396, 351823044, 354539604, 355390205, 354851837, 354755058, 354487839, 355649681, 357637367, 359056549, 359813690, 360641861, 363338165, 365512543, 365167732]
685.7C65167732L22495Q80241k67M81949L86467M56734R07821Q68683R75037P65838
695.3C71212730Q25043M81262K22969J01319n3711M93393L03383p5646L10211J183815
705C75004768J093750O63376J256333Q06808Q9913k23160K3918J146812J366005J244774
714.6C82473297J094246K52762n34477O6833J090279P41195L37029K11983P73315J410370
724.3C87916832N06134K82669J140556K026215J931038R70497N24826L63426J154557
733C96816750O40068k73972J212158J306114P7k24877K85950K36397J04370N29938
742.6D00632973P26280Q68988J034927J157685O71653P41845N91697J02730O49490
751.3D07178268R0905M8446R97124J737213J714859J060715Q01239P86018J808930
$$ y = [365167732, 365490227, 366370468, 366370201, 366852150, 367238617, 367695351, 368603172, 369471855, 370446892, 371212730, 372037773, 372519035, 372742004, 372843323, 372789612, 373283005, 373586388, 373510742, 373820953, 375004768, 376098518, 376761894, 378018227, 378825035, 378914948, 378691788, 378715706, 379862518, 381228523, 382473297, 383567543, 383820305, 383285828, 383352661, 384442940, 385184135, 385521164, 385733147, 386506462, 387916832, 388422966, 388705635, 389846191, 391872406, 393803444, 394773941, 395298767, 395662193, 396816750, 397456818, 397182846, 398395004, 399701118, 399701195, 399476318, 399762268, 399998665, 400103035, 400632973, 401359253, 402228241, 403263168, 404420853, 405092506, 405834351, 406426048, 406528778, 407178268, 407269173, 407317619, 408314743, 410051956, 411766815, 412827530, 413628769, 414414787, 416223717]
760D16223717J733551J283111N74913k01721R62982J222229J520539J269226Q9340
768.6D24677887l45154j79863L36533O0997l50228m11148L0098K95220J273422Q23212
778.3D26210976r8954O27594n16815n72548m29802M78897J909638R67789Q37745Q6861
787.9D29501381L27110J106339M60624n28106n94864J74179R766M7531o79322P81250
797.6D30605888J324425m28390o31333j792755j147804n45426r22279j131859k112503
806.2D23217964k744407j521111K64435j107178j577873k177468k789573j000061n29785
814.9D10034943q37670j139526o47087j74942O47011Q79249r3269M20875J315499K382583
824.6D12787666J695175J614380L284951M010048L766861K191162K734832K620621
$$ y = [416223717, 417957268, 419240379, 419815292, 419613571, 420576553, 421798782, 423319321, 424588547, 424677887, 424332733, 424152870, 424489403, 424550400, 424200172, 423789024, 423819122, 424114342, 425387764, 426210976, 426112022, 426739616, 426222801, 425650253, 425220451, 425699348, 427608986, 428576775, 429414520, 429501381, 429828491, 430934830, 431395454, 430867348, 430272484, 430446663, 430456429, 430503960, 429824638, 430605888, 431930313, 431501923, 430870590, 429077835, 427930031, 427384605, 426462326, 425330467, 423217964, 420473557, 418952446, 419216881, 418109703, 416531830, 414354362, 411564789, 410564728, 410034943, 409197273, 408057747, 407410660, 407235718, 407882729, 408761978, 408668709, 409089584, 410405083, 412787666, 414482841, 416097221, 419382172, 423392220, 427159081, 429350243, 432085075, 434705696]
832.3D34705696K204170L096009K686920K978630L129883K077064J126747K199478
840D54204597K273331K111550K261810J221695P73124M47274J854477J808166J393738
848.7D68349762R32274P97729K155381J176681J596794J482086J334725J680069J338882
857.4D80844383J609802J407776J831017M66423P57255J193467R46731R57680p84836
866D89229698j138954j528015l98026j62162r97734j146889o66733p88498k922440
874.7D79480247j973342j662445j675454j434784j061706r0180m10919M88892p88307
883.4D70872002j081314j326714j494980J14212q76694o58836n31998P25403J495590
892.1D67236671J98746K79198N25741J070862k23007o01845k72674k87018O6299j11122
$$ y = [434705696, 436909866, 440005875, 442692795, 445671425, 448801308, 450878372, 452005119, 454204597, 456477928, 458589478, 460851288, 462072983, 462846107, 463293381, 465147858, 466956024, 468349762, 469282036, 470079765, 472235146, 473411827, 475008621, 476490707, 477825432, 479505501, 480844383, 482454185, 483861961, 485692978, 486159401, 486916656, 488110123, 489056854, 490014534, 489229698, 488090744, 486562729, 486164703, 486002541, 485004807, 483857918, 483191185, 482402687, 479480247, 477506905, 475844460, 474169006, 472734222, 471672516, 471582336, 471171417, 471660309, 470872002, 469790688, 468463974, 466968994, 467083206, 466206512, 465547676, 465015678, 465741081, 467236671, 467435417, 467714615, 468240356, 469311218, 469088211, 468486366, 468213692, 467926674, 467992973, 467881851]
901.7D67881851J88027J88026J088371J715088K675209K343025J149292J853905J772194
910.4D80854988J680184Q89358Q80432L69759l80211j103172l314209k978897k341195
919.1D74557037k252617k484626k913666l092957k525100k452202l894463l538971
926.8D51402435m069748m819870m412956l576622j926002j420212j677895j514969
934.5D27984161n11932p87964j906967k139015j943360j340522j078682r74961j254806
943.2D16045952n81703L41797L88374j37100j091233n98068k37389r2468K84577P66067
952.8D15088806Q29392o5766j5373o80428j994972l200149l365517k680359k226944
961.5D01688690j480179j504402j167030j159973j405678j430855k335281k668724
$$ y = [467881851, 468069878, 468257904, 469346275, 471061363, 473736572, 476079597, 477228889, 479082794, 480854988, 482535172, 483424530, 484304962, 484674721, 484294510, 483191338, 479877129, 476898232, 474557037, 472304420, 469819794, 466906128, 463813171, 461288071, 458835869, 454941406, 451402435, 447332687, 442512817, 438099861, 434523239, 432597237, 431177025, 429499130, 427984161, 427472229, 426684265, 424777298, 422638283, 420694923, 419354401, 418275719, 417300758, 416045952, 415464249, 415806046, 416194420, 416057320, 414966087, 414368019, 414130630, 414038162, 414322739, 415088806, 415918198, 415852432, 415837059, 415156631, 413161659, 409961510, 406595993, 403915634, 401688690, 400208511, 398704109, 397537079, 396377106, 394971428, 393540573, 391205292, 388536568]
969.2C88536568k509156k322235k542114k699432k406884k083549k390251l488465
976.9C68094482m075012m446907m959678n044785m772530m768219m328231m105797
984.7C31593323m856873n025673m171562m321270m689770m089965m326687l985806
992.4B96125717l246937k566242k444343k471447k510548l199253k600136l047466
1000.1B74039345k935047k222367k091045j648007k033634j485099j593915j689968
1007.8B58340263j936283k384128k449417k291680r05189j333332j687088j742440
1015.5B43610706j779308j839943k364654k383557k597618j683769k162151k487851
1023.2B26311855k022876j422635j152973j605549o10179j094857j053657j320668
$$ y = [388536568, 386027412, 383705177, 381163063, 378463631, 376056747, 373973198, 371582947, 368094482, 364019470, 359572563, 354612885, 349568100, 344795570, 340027351, 335699120, 331593323, 326736450, 321710777, 317539215, 313217945, 308528175, 304438210, 300111523, 296125717, 292878780, 290312538, 287868195, 285396748, 282886200, 279686947, 277086811, 274039345, 271104298, 268881931, 266790886, 265142879, 263109245, 261624146, 260030231, 258340263, 256403980, 254019852, 251570435, 249278755, 248373566, 247040234, 245353146, 243610706, 241831398, 239991455, 237626801, 235243244, 232645626, 230961857, 228799706, 226311855, 224288979, 222866344, 221713371, 220107822, 219497643, 218402786, 217349129, 216028461]
1031B16028461n69095o8646j558494j9703P74422J063861P86362J560803K169914J603775
1040.6B21771660J775246K22072N15347R22279P28302n84431r70020N40161p14855
1049.3B24205761r98993r11636q62561j056690j194820j180744p65877J19324q55751
1058B16498013L91483N77907P61700R92756Q37059J870861J763725K770214J340676
1066.6B27804394J595154J683788O78348J330319K66895P38487j23424M8733L25412
1075.3B34348106m081P01351L70655J057835o3134K6932M38366R55086R04503k87171
1085B38448448J128140J257610J435814R95064J288051J658459J235867K066040J700973
1093.6B51214466J620941R58424J211986J290074J537018K038326J058655Q42456M1600
$$ y = [216028461, 215459366, 215390720, 213832226, 213812523, 214586945, 215650806, 216437168, 217997971, 220167885, 221771660, 223546906, 223768978, 224284325, 225206604, 225934906, 225350475, 224380455, 224920616, 224205761, 223206768, 222295132, 221432571, 220375881, 219181061, 218000317, 217234440, 217353764, 216498013, 216889496, 217467403, 218229103, 219221859, 220058918, 221929779, 223693504, 226463718, 227804394, 229399548, 231083336, 231761684, 233092003, 233358898, 234097385, 233973961, 234022694, 234348106, 234344025, 235045376, 235416031, 236473866, 236410732, 236437664, 236876030, 237831116, 238735619, 238448448, 239576588, 240834198, 242270012, 243265076, 244553127, 246211586, 247447453, 249513493, 251214466, 252835407, 253793831, 255005817, 256295891, 257832909, 259871235, 260929890, 261772346, 261813946]
1102.3B61813946J508369K717209K047100J365891J007595J536979M72432K34851O77586
1111B73381958J274319J335296J075287J215267O66867J125602M99287J85661J59951
1119.7B80919495l22304n7030m09202k39468k50015L09734J390076J847248J142578
1128.4B84331112R39712J911831J807156J987438J989975K380867K689953K482986
1136.1C00521030K429924K490578K192230J218014J577873J327439R42363J208077
1143.8C13907528J324940J401996R26838Q78506K92034K60658M92287j91326n76153
1152.5C18717308j56517N6839n99804L45097L41549j080952j292877p95651o656q03547
1162.1C14724789q19664M17308J282311J671772J971607L065453K719612K133140K205353
$$ y = [261813946, 263322315, 266039524, 268086624, 269452515, 270460110, 271997089, 272469521, 272704372, 273381958, 274656277, 275991573, 277066860, 278282127, 278948994, 280074596, 280573883, 280759544, 280919495, 280597191, 280540161, 280130959, 279891491, 279641476, 279951210, 281341286, 283188534, 284331112, 285270824, 287182655, 288989811, 290977249, 292967224, 295348091, 298038044, 300521030, 302950954, 305441532, 307633762, 308851776, 310429649, 311757088, 312699451, 313907528, 315232468, 316634464, 317561302, 318439808, 318731842, 318992500, 319484787, 319293461, 318717308, 318560791, 318617630, 318017826, 318362923, 318704472, 317623520, 316330643, 315534992, 315528336, 314724789, 313905125, 314322433, 315604744, 317276516, 319248123, 322313576, 325033188, 327166328, 329371681]
1170.8C29371681K575379K664718K599716K893410K987518L156548L028755K844353
1178.5C52122078K560425K264671J922340K273407J683236R02824J581459J551628
1186.2C66862068J510887J168785R06258N09453L18336K8839j099891p50389l36342
1194.9C69118004p63l36151r55963p02668j622352j745796j331826j576919j082459
1203.6C59763107q57544r37156o79627j82419J28823j04103o86531q78525m52576k61078
1213.2C54852371k89268m46244o44836k23961O48842N49431j68228l81203q26569j210022
1222.9C51860313j357498j069793j44959J6899n03502o76040o53191j014481j253280
1231.5C45204468j133576p95974l85132n93109l72773L6927O2103L63579O8054o44798
$$ y = [329371681, 331947060, 334611778, 337211494, 340104904, 343092422, 346248970, 349277725, 352122078, 354682503, 356947174, 358869514, 361142921, 362826157, 363728981, 365310440, 366862068, 368372955, 369541740, 370447998, 370957451, 371275787, 371304626, 370204735, 369454346, 369118004, 369117241, 368781090, 367825127, 367122459, 365500107, 363754311, 362422485, 360845566, 359763107, 358905563, 357968407, 357288780, 357106361, 357235184, 357131081, 356444550, 355566025, 355113449, 354852371, 354563103, 354116859, 353472023, 353248062, 353896904, 354446335, 354278107, 353896904, 353070335, 351860313, 350502815, 349433022, 349288063, 349304962, 348801460, 348125420, 347472229, 346457748, 345204468, 344070892, 343274918, 342889786, 342296677, 341923904, 341960831, 342022934, 342386513, 342454567, 341809769]
1241.2C41809769r55963p08390l93905o59714r98001n23796K57454M23736M2229p14378
1250.8C37579041p18117n44434o29082l31573k00195j90506k35443K60086K17285m6120
1260.5C35160942J19057k21672R4299J77498K19192N56717P17240R94034P47947O51779
1270.1C39217033Q28514Q66585N96886N78155N95017M82750Q21228J090202J033020
1278.8C46109390R71108R95064J056976J525307J218338P14111R63211J263390J468467
1287.5C56285362J271782J371384J081772J287536J412201N26428J24436R5177M49256
1296.2C63905334L51983P77626J129074P10067M55323j41716p4425K62375P7324m33312
1305.8C67019653j06086K62069k75993o10886m55703q0681o84929r64165o26869n09720
$$ y = [341809769, 340853806, 340145416, 339751511, 339091797, 338093796, 337570000, 337827454, 338251190, 338293419, 337579041, 336860924, 336316490, 335687408, 335355835, 335155640, 334965134, 334729691, 334989777, 335207062, 335160942, 335279999, 335058327, 335152626, 335330124, 335549316, 336106033, 336823273, 337817307, 338565254, 339217033, 340045547, 340912132, 341509018, 342087173, 342682190, 343164940, 343986168, 345076370, 346109390, 347080498, 348075562, 349132538, 350657845, 351876183, 352590294, 353553505, 354816895, 356285362, 357557144, 358928528, 360010300, 361297836, 362710037, 363236465, 363360901, 363456078, 363905334, 364257317, 365034943, 366164017, 366874084, 367329407, 367187691, 367113266, 367375641, 367452965, 367019653, 366913567, 367175636, 366899643, 366288757, 365833054, 365752373, 365067444, 364103279, 363476410, 362966690]
1315.4C62966690l42865r1934N87044P21550J092758J126289O96526P56187O95114
1324.1C68207359P31621N15213M87328L78303M64936k1096o64673k59094l28407n75218
1333.8C68936272o64940j04103n2719o8131L05901j13869O32553P23534Q16803Q76007
1343.4C71287308P09800Q71544L73497O94008O19164M11873J08604J32637P3433o04248
1353.1C74677620k97470k74468j27945j44386k39715p71523l48930J38397q13141m57611
1362.7C71340828j584320k90108O32057j98784j33438p26928q03681j061020o41784
1371.4C66532822j02654k78168J19935k49024K7275j21078p0038l46222m19617l61023
1381C64732208q91418j355248j850395q95119q52394j264419k228890j673317p96432
$$ y = [362966690, 362623825, 362531891, 363118935, 363840485, 364933243, 366059532, 366756058, 367512245, 368207359, 368938980, 369454193, 369941521, 370319824, 370784760, 370763664, 370098991, 369839897, 369511490, 368936272, 368271332, 368167229, 368114510, 368046379, 368352280, 368238411, 368870964, 369594498, 370411301, 371287308, 371997108, 372868652, 373242149, 373936157, 374555321, 374967194, 375075798, 375208435, 375281868, 374677620, 374380150, 374105682, 373977737, 373833351, 373593636, 372822113, 372473183, 372611580, 371798439, 371340828, 369756508, 369466400, 370098457, 369899673, 369766235, 369039307, 368235626, 367174606, 366532822, 366430168, 366152000, 366271935, 366022911, 366050186, 365929108, 365859070, 365512848, 365093231, 364732208, 363840790, 362485542, 360635147, 359740028, 358887634, 357623215, 355394325, 353721008, 352924576]
1389.7C52924576j690293j705207k177697j737022k215462l398094j666374j725426
1397.4C36609001j456871l156433k667656j412468k172470j592445j710205k685337
1405.1C19755116k478314j488972j392192j630955j138687j451989j407184j583710
1412.8C07183113j207409j039257j491070m94327k04258N45444k046623r01031J190414
1421.5C01534996M7913M98275p60936N64441J249333Q77132J615887N17769J411514
1430.2C07556324Q84590J220894J543922J597519K453461J452408K012005J599846
1437.9C20320969K708625K120324J612892J911545J394958K493172J503067J604614
1445.6C35670166J399918J335258J352997J432228K545090J438751K042389J311111
$$ y = [352924576, 351234283, 349529076, 347351379, 345614357, 343398895, 340000801, 338334427, 336609001, 335152130, 331995697, 329328041, 327915573, 325743103, 324150658, 322440453, 319755116, 317276802, 315787830, 314395638, 312764683, 311625996, 310174007, 308766823, 307183113, 305975704, 304936447, 303445377, 302951050, 302746792, 303292236, 301245613, 300344582, 301534996, 301582909, 302081184, 301320248, 301884689, 303134022, 304011154, 305627041, 306144810, 307556324, 308440914, 309661808, 311205730, 312803249, 315256710, 316709118, 318721123, 320320969, 323029594, 325149918, 326762810, 328674355, 330069313, 332562485, 334065552, 335670166, 337070084, 338405342, 339758339, 341190567, 343735657, 345174408, 347216797, 348527908]
1453.3C48527908J317520J257210K44255J995621L30391L586693K378387K680359J937599
1462C64255943J521111K663231R63707J989250J442871K324638K598763K558212L274918
1470.7C83592644K236519L632660K291107L119239L171769K171936K239418K399635
1478.4D04854927K455368J978760K029686J695404K096863K046318J529617J738052
1486.1D20424995M52385K37923J428947O02227N26924Q55675N93109k53449k51922
1494.8D24616814m08783l892060L98980o65131l108139l23258p70835j208001q28743
1503.5D13810844M16069l54881m269409m651871Q02574J503067n41381J076660o59752
1512.2D07131920j783104j22337n88532n29213k409401j321678R49440J318207q65097
$$ y = [348527908, 349845428, 351102638, 351346893, 353342514, 353672905, 357259598, 359637985, 362318344, 364255943, 365777054, 368440285, 369403992, 371393242, 372836113, 375160751, 377759514, 380317726, 383592644, 385829163, 389461823, 391752930, 394872169, 398043938, 400215874, 402455292, 404854927, 407310295, 409289055, 411318741, 413014145, 415111008, 417157326, 418686943, 420424995, 420877380, 421115303, 422544250, 423146477, 423673401, 424529076, 425122185, 424868736, 424616814, 424208031, 420315971, 420714951, 420049820, 416941681, 416618423, 415847588, 414639587, 413810844, 414226913, 413872032, 409602623, 404950752, 405753326, 407256393, 406715012, 407791672, 407131920, 405348816, 405226479, 404637947, 404108734, 401699333, 400377655, 401327095, 402645302, 401780205]
1520.8D01780205k684098P44935Q88176J651039n39246N14984J469917J79978N14145
1529.5D04520035R02786Q00743P20291P08847k288627J184807P09686O6452J894684
1538.2D09219704r53865j640244M85497M37469m21791J231003J050873j392060J081887
1546.9D09098473L2959N34248p76787j536713O56510m8981J335259k715760j497230
1555.6D05081978O48498J063919j604003j3923722L330651J042747J060829j674156
1563.3C95026741j784477k872849l140869j345749k818908j707268q732605k221680
1571C70402336j995468l539581k705384l605537j515312j1296234j952172l207473
1578.7C40585175m116288l461914n073585l252106n672836l839569n108910l535213
$$ y = [401780205, 399096107, 399841042, 400729218, 402380257, 401841011, 402355995, 403825912, 404005890, 404520035, 405422821, 406223564, 406943855, 407652702, 405364075, 406548882, 407258568, 407325020, 409219704, 408265839, 406625595, 407111092, 407548561, 407126770, 408357773, 409408646, 408016586, 409098473, 409131432, 409665680, 408888893, 407352180, 408008690, 407959709, 409294968, 406579208, 405081978, 405730476, 406794395, 405190392, 391266670, 394597321, 395640068, 396700897, 395026741, 393242264, 390369415, 387228546, 385882797, 383063889, 381356621, 372624016, 370402336, 368406868, 364867287, 362161903, 358556366, 357041054, 345744820, 343792648, 340585175, 336468887, 333006973, 327933388, 324681282, 319008446, 315168877, 310059967, 306524754]
1586.4C06524754l593674n343666l007927n037403k679768m722690k657681l235092
1594.1B76246853m443760k712040m963131j788578l617191j711617l134670k758350
1601.9B51117516j535378l851471p35512k653465p06615k971707j314239p58744k078113
1610.5B34512272M74472k701759J5926j494503O70643J09596m631481J796570j111241
1619.2B27640495J461182j411018P94658K61364j120472J563034o16359K035980j321278
1627.9B29287586J451206R76201J082744J431580J77955K500801l5457K745685j513614
1636.6B38104687J977424J728745J073494K561855O41003K973919N88855K167035J912803
1645.3B53729820j024303K082691j6518M191227J397953L387719K653446J668720r72710
$$ y = [306524754, 302931080, 297587414, 294579487, 289542084, 286862316, 282139626, 279481945, 276246853, 271803093, 269091053, 264127922, 262339344, 258722153, 257010536, 253875866, 251117516, 249582138, 245730667, 244995155, 242341690, 241635075, 238663368, 237349129, 236590385, 234512272, 234986744, 232284985, 232300911, 230806408, 231477051, 231586647, 226955166, 228751736, 227640495, 229101677, 227690659, 228485317, 228746681, 227626209, 229189243, 228572884, 230608864, 229287586, 230738792, 231714993, 232797737, 234229317, 234407272, 236908073, 236872616, 239618301, 238104687, 240082111, 241810856, 242884350, 245446205, 246087208, 249061127, 249649982, 251817017, 253729820, 252705517, 254788208, 254771690, 258962917, 260360870, 263748589, 266402035, 268070755, 267098045]
1653.9B67098045j336631M246425J255779K406807J270848J971664K304096J685334
1661.6B80902367L423252O76937L296566J976433K941742K900524K238483L514233
1669.4C01870537J210270M411735K416382L860684L101997J762257L215389L612289
1677.1C25461540M810791K867203M082336L401947M729386N583725L616943N355797
1684.8C59909668R62448N517883M075318L959389M591865M035759N000496M628982
1692.5C92681808N414391M914436M560166J158981N486565O688614O017341L635636
1700.2D30557938q22869P496109N362015M484863L547135L028335K600289K495498
1707.9D58749313L724938K539291K459374L257599L418197L418427J291999J012192
$$ y = [267098045, 265761414, 270007839, 271263618, 273670425, 274941273, 276912937, 279217033, 280902367, 284325619, 285002556, 288299122, 290275555, 293217297, 296117821, 298356304, 301870537, 303080807, 307492542, 309908924, 313769608, 316871605, 318633862, 321849251, 325461540, 330272331, 333139534, 337221870, 340623817, 345353203, 350936928, 354553871, 359909668, 360872116, 366389999, 370465317, 374424706, 379016571, 383052330, 388052826, 392681808, 398096199, 403010635, 407570801, 408729782, 414216347, 420904961, 426922302, 430557938, 429735069, 437231178, 442593193, 447078056, 450625191, 453653526, 456253815, 458749313, 462474251, 465013542, 467472916, 470730515, 474148712, 477567139, 478859138, 479871330]
1715.6D79871330L202248J452598l868522L680839L730660K089157J967087J829643
1723.4D93955040J623497J854935J724243J151543J387977J536446m26827R28726M120369
1732E07855949M283066n50308k923470M380150L978997K163696K787170Q52318n06439
1740.7E22321129M349022L720588K470665K892037L999977L746834K861519L367653
1748.4E49729424J968040M811859K765465J424217N487023M240798M477463M447479
1756.2E79351768J653901K031631L013878K878265L064385j82381J187782M336968
1763.9E97336197K734489K593613K747307K012787p65992K365914M532051J91956k731820
1772.5F11016502l69796N081443L232918J02196K792740J428795J576118M33540q23555
$$ y = [479871330, 483073578, 484526176, 480657654, 484338493, 488069153, 490158310, 492125397, 493955040, 495578537, 497433472, 499157715, 500309258, 501697235, 503233681, 502806854, 503735580, 507855949, 512139015, 511588707, 508665237, 513045387, 517024384, 519188080, 521975250, 522827568, 522321129, 526670151, 530390739, 532861404, 535753441, 539753418, 543500252, 546361771, 549729424, 551697464, 556509323, 559274788, 560699005, 566186028, 570426826, 574904289, 579351768, 581005669, 583037300, 586051178, 588929443, 591993828, 591811447, 592999229, 597336197, 600070686, 602664299, 605411606, 607424393, 606658401, 609024315, 613556366, 613748322, 611016502, 610646706, 615728149, 618961067, 619063263, 621856003, 623284798, 624860916, 625294456, 624470901]
1781.2F24470901J358071J986427K145386j10931Q16459K269249J446648Q49418J414566
1789.9F36646194J049004R85107j667022j105576L657875J684494O54373K198410K304612
1798.6F46407471L68042j332856K147980j61133J50299J748353Q17947J407928J001511
1807.3F52555542Q99277J141357J503906q79211K20871J371078K42768Q58688L43399
1815.9F58257675J528702N70602P98111J404953J11695R91134k00271J020431J189423
1824.6F65672455k126465j6708K043914K521592Q43734k603302N71061K619400K99377
1833.3F69825058j81503K60391M19540M20456k59247J454621P77969J247559R06219
1842F74871063R44672M18701n379333J997680K316437L81012K00424J030426J651001
$$ y = [624470901, 625828972, 627815399, 629960785, 629849854, 630666313, 632935562, 634382210, 635231628, 636646194, 637695198, 638680305, 637013283, 635907707, 639565582, 641250076, 641904449, 644102859, 646407471, 646775513, 645442657, 647590637, 647429504, 647579803, 649328156, 650146103, 651554031, 652555542, 653454819, 654596176, 656100082, 655220871, 655441742, 656812820, 657055588, 657914276, 658257675, 659786377, 660356979, 661155090, 662560043, 662671738, 663662872, 663462601, 664483032, 665672455, 663545990, 663529282, 665573196, 668094788, 668938522, 666335220, 666906281, 669525681, 669825058, 669643555, 669903946, 670323486, 670743942, 670484695, 671939316, 672717285, 673964844, 674871063, 675815735, 676234436, 670855103, 672852783, 675169220, 675550232, 675750656, 676781082, 678432083]
1850.7F78432083n4092M10537j79367J51825R0103j00173N46188n5161P45774N57098
1860.3F80544815J222687M51431K45819L23715l09295L26309q47397N70526o35910
1869F81892700o56967J657105J298904J401215J10015l43475r24072L4790K19498j84327
1878.6F84505386O06919M92172J032104L4333M10156K08282k28500l738m06571J109543
1888.3F87760086j93176j424561P96662J582641M38233L37448p2632j377487N28412
1896.9F88375626k7466J63803M31671R6207N74493J15357Q41751J86309J50834m43421
1906.6F90465164o08215j4267l60184p0801n8136J746216O85806L7003J36871p171
1916.2F91952286R77249k902298q71811J527329O25839P86361k86331j07650P34710
$$ y = [678432083, 678377991, 678788528, 678609161, 678760986, 678851089, 678750916, 679297104, 679241943, 679987717, 680544815, 681767502, 682218933, 682464752, 682788467, 682479172, 682805481, 681958084, 682528610, 681892700, 681235733, 682892838, 684191742, 685592957, 685702972, 685359497, 684435425, 684470215, 684689713, 684505386, 685112305, 685604477, 686636581, 686670914, 687081070, 687289352, 687060852, 687057114, 686650543, 687760086, 687566910, 686142349, 686939011, 688521652, 688959885, 689297333, 689224701, 687847214, 688375626, 688348160, 688511963, 688943634, 689039841, 689614334, 689729691, 690571442, 690757751, 690908585, 690465164, 689856949, 689842682, 689482498, 689411697, 689353561, 691099777, 691785583, 691822586, 691959457, 691952286, 692929535, 690027237, 689155426, 690682755, 691308594, 692094955, 691808624, 691700974, 692435684]
1924.9F92435684P60803n92727m57535m56696m60586m1275k49787O37513L86123R75724
1934.6F92937241K19726l81698l17078q40149O9122l80172N66330m43116j254730J247406
1944.2F91422882R17282M40216m02069n19028k92816j37558m23736p6523L77579N3405
1953.8F91359634O77109K87094J50910p48368o89392o5765n06134J1291k91519J80512
1963.5F90365372J35956O81228P43027o31409m01687l13340R6360m70124j74484O6910
1973.1F90097809j9531M61196J76926O10047k30027k18734l39127o68030l19137k99073
1982.8F89252319L29743l13263K45056O79474L59573k72674n99900K85721n77469j224594
1992.4F88163986n32150P12128L74298n036L60184k23312L5400n84183k63366k12937
$$ y = [692435684, 693196487, 692603760, 692146225, 691689529, 691228943, 691187668, 690937881, 691575394, 691961517, 692937241, 693156967, 692775269, 692458191, 691618042, 691687164, 691306992, 691873322, 691430206, 690175476, 691422882, 692340164, 692780380, 692378311, 691859283, 691566467, 691428909, 691005173, 690928650, 691306229, 691359634, 692036743, 692323837, 692474747, 691726379, 691036987, 690971222, 690465088, 690476379, 690184860, 690365372, 690501328, 691182556, 691925583, 691294174, 690892487, 690579147, 690675507, 690205383, 690030899, 690097809, 690078278, 690539474, 690716400, 691326447, 691096420, 690877686, 690538559, 689870529, 689551392, 689252319, 689582062, 689268799, 689513855, 690193329, 690552902, 690280228, 689680328, 689966049, 689388580, 688163986, 687631836, 688343964, 688718262, 688713226, 689073410, 688850098, 688885498, 688301315, 688037949, 687825012]
2002.1F87825012k35595j34354n98526M34875J25733Q4152j4496k47269m70352n15976
2011.7F86253204J05210m79737j97677j22071J11771j67007m5090J01700n26734J72119
2021.3F85205688n68008j16119l47672n92346J64719k99683L43704k23007K289k92282
2031F83277283m54331J37100m27627r4223n82733k77252j84937J21155K74124j97983
2040.6F81590576j8310l67737P934o42547k76413l51181l71704M72946j22757L39432
2050.3F80260239k62299J7777K0828m41742k13471p15637l77044m22974O20117J44348
2059.9F78630142m2496M47541l65677Q8043m95834l56522m12216k12326J16119j53732
2069.6F77243042K90375J25351M94079k48337p6980l2806o68717o53534r50470L4790
$$ y = [687825012, 687589417, 687455063, 686856537, 687291412, 687417145, 687501297, 687486801, 687239532, 686769180, 686253204, 686358414, 685878677, 685681000, 685558929, 685670700, 685503693, 685458603, 685560303, 685033569, 685205688, 684637680, 684521561, 684173889, 683581543, 683746262, 683446579, 683790283, 683567276, 683569565, 683277283, 682822952, 682960052, 682532425, 682438202, 681855469, 681578217, 681393280, 681514435, 681788559, 681590576, 681572266, 681204529, 681212463, 680569916, 680293503, 679942322, 679570618, 680043564, 679920807, 680260239, 679997940, 680015717, 680036545, 679594803, 679381332, 678665695, 678288651, 677865677, 678485794, 678630142, 678587646, 679035187, 678669510, 678757553, 678261719, 677905197, 677492981, 677280655, 677396774, 677243042, 677533417, 677658768, 678152847, 677904510, 677827530, 677794724, 677126007, 676472473, 675522003, 675556793]
2079.2F75556793J15814N80979M06418J25274J97449p20596m79584k87247Q0262p21055
2088.9F74854507l91311K05383M1962N18188k45437J56173l70865m73861l54462m32281
2098.5F73507996Q2321p85904k6398R5978K47192J63880l36228r3002o48651l36151
2108.1F71871033p60346m04205R4452l128J49460M25872O45523n12466l48816n69305
2117.8F70588074n73044k18201j28631R2697m66767N54657L11585j85547k13394k73819
2127.4F69487610j23139p09304q1787j65253J09253J37634Q0643N61065K48795J36337
2137.1F69681854n60531k16217m76609o12182R9640L30505M00696P4844O61698J03607
2146.7F69487305j19095k07901m62341l17383l43933M98504q1939J99050K13547K38342
$$ y = [675556793, 675672607, 676253586, 676660004, 676785278, 676982727, 676262131, 675782547, 675495300, 675575562, 674854507, 674463196, 674668579, 674710541, 675228729, 674983292, 675139465, 674768600, 674294739, 673940277, 673507996, 673590317, 672804413, 672778015, 672873993, 673121185, 673285065, 672948837, 672855835, 672207184, 671871033, 671110687, 670706482, 670800934, 670797806, 670947266, 671373138, 672018661, 671506195, 671157379, 670588074, 670015030, 669796829, 669668198, 669760895, 669294128, 669848785, 670160370, 669974823, 669761429, 669487610, 669364471, 668655167, 668573380, 668408127, 668517380, 668655014, 668735657, 669296722, 669545517, 669681854, 669121323, 668905106, 668428497, 667816315, 667915955, 668246460, 668647156, 668722000, 669383698, 669487305, 669368210, 669160309, 668697968, 668380585, 668036652, 668535156, 668453217, 668652267, 668865814, 669104156]
2156.4F69104156O53992m18014l57437o54526k05231j88675k76794M18472M40750O58951
2166F69175644K17972L07235k02713j73339j86234m06799K12936k09503L93143N73730
2175.6F69702072L41950j62659m06418o943J33972K50626n75256R5062J15051J96076
2185.3F69683533L83224j87835K02331n17502J02158J14517j61819m2801k78473L81317
2194.9F69678650J8845M51736J81503j15814r0408K4414M54330k10418Q7280j15051
2204.6F70365067K44293O3324k78244K22778r2010J31988j55640N45426J54648n41993
2214.2F70659637j4953J5716K63062r2239K81906j16120j21765p9422j88522N61905
2223.9F71169205j67923r8114r7428J59760J97449n7297j99585m25873M57459l17688
$$ y = [669104156, 669758148, 669340134, 668982697, 668328171, 668122940, 667934265, 667657471, 668075943, 668516693, 669175644, 669393616, 669700851, 669498138, 669324799, 669138565, 668731766, 668944702, 668735199, 669128342, 669702072, 670044022, 669881363, 669474945, 669468002, 669601974, 669852600, 669277344, 669372406, 669487457, 669683533, 670066757, 669878922, 670081253, 669563751, 669665909, 669780426, 669618607, 669575806, 669297333, 669678650, 669697495, 670149231, 670330734, 670214920, 670124512, 670148926, 670603256, 670392838, 670480118, 670365067, 670609360, 670672684, 670394440, 670617218, 670525208, 670657196, 670501556, 671046982, 671201630, 670659637, 670644684, 670660400, 670923462, 670831223, 671113129, 670997009, 670875244, 670795822, 670607300, 671169205, 671001282, 670903168, 670805740, 670965500, 671162949, 671105652, 670906067, 670480194, 670937653, 670619965]
2233.5F70619965r1629M39300K65885l5096l47061K51084l62626J61133q5602N8060
2243.2F70873413M09393m14199K08053k02637r4070l32489n1346K98767j83258K39563
2252.8F70751190j21460L80020O791p7210J45493j84632Q087k42385Q7585k11182K85340
2263.4F70827637J54724J9455K09732l72162K05307k43073k60086m45633J31913N66330
2273F70794144j15280J70516k22625M15497j19477m88662m49067p58895j70060k38495
2282.7F68817596O51093J42899L81927N74799k93885j06887m23737L57819l46604l7002
2292.3F69718018M92401Q3847P53708j05362K61230J06964j67618l8299k27890L62701
2302F71239700J54801M47769K26059O06537R11102O48346L49655o76346O1493J05133
$$ y = [670619965, 670528336, 670967636, 671233521, 671198425, 670851364, 671102448, 670739822, 670900955, 670815353, 670873413, 671282806, 670868607, 671076660, 670874023, 670779953, 670447464, 670396118, 670694885, 670511627, 670751190, 670629730, 671009750, 671016541, 670939331, 671084824, 670900192, 670908279, 670665894, 670753479, 670542297, 670827637, 670982361, 671001816, 671211548, 670839386, 671044693, 670801620, 670541534, 670095901, 670227814, 670794144, 670678864, 670849380, 670626755, 671042252, 670922775, 670434113, 669985046, 669226151, 669056091, 668817596, 669468689, 669611588, 669993515, 670568314, 670274429, 670167542, 669743805, 670101624, 669755020, 669718018, 670210419, 670294266, 671047974, 670942612, 671203842, 671310806, 671143188, 671104889, 670876999, 671239700, 671394501, 671842270, 672068329, 672674866, 673585968, 674234314, 674583969, 673907623, 673969116, 674074249]
2311.6F74074249k060L34778L20282P64923N97916Q25653J253662Q63495K20413o0959
2321.3F79192352m60128J00097Q40454Q77991Q00323Q53806J347580P85599N71136
2329.9F84909210j202545k071381l75442K56271R25598J183167J611328L19214m6616
2338.6F85508804k3269o08597m48837j494523j138381p65915q7967j268997l241120
2347.3F76431198k401733M75082K649460J130142K430802K452468q03985K93579K193527
2356F84850540M124375R6206j44043O14472q16422j33514j271363q57696j483231K10877
2365.6F85190201j853028k509841n84641j693573j602249k143478j652375k679367
2373.3F70471649k566223j586227j307297q28934j152344n66177j696167j881790j460571
$$ y = [674074249, 674072189, 674406967, 674727249, 675492172, 676090088, 676915741, 678169403, 679032898, 679253311, 679192352, 678732224, 678832321, 679672775, 680550766, 681351089, 682204895, 683552475, 684338074, 684909210, 683706665, 681635284, 681259842, 681516113, 682441711, 683624878, 685236206, 685555420, 685508804, 685485535, 684876938, 684428101, 682933578, 681795197, 681029282, 680941315, 679672318, 676431198, 674029465, 674504547, 677154007, 678284149, 680714951, 683167419, 682363434, 682657013, 684850540, 688974915, 689071121, 688927078, 689541550, 688725128, 688591614, 687320251, 686462555, 684979324, 685190201, 683337173, 680827332, 680242691, 678549118, 676946869, 674803391, 673151016, 670471649, 667905426, 666319199, 665011902, 664182968, 663030624, 662464447, 660768280, 658886490, 657425919]
2382F57425919j541596q30994j191635p86590j25885J77917R232P0419j2054o05698
2391.7F52589035n14984j028290o09207n54047m43878K08359J84631K82669k47497
2400.3F49866791l2501o17753r78012p03506o72684R7885K0142L00980J24740j95618
2410F47210464m84008o73371l31649o90384o29197q55484k42996K92130P9498J10397
2419.6F43785400l23333l56751m10004m84848j178665q60977j11236k30217Q6021l3607
2429.3F39881783n5047l74794j17187k16560p50771o59180r14764m63257n12581k46010
2438.9F35571632q4953j11046K05498l45345n80024r89952q00209n22156q5755J65749
2448.6F32423439m76074m44565l33138q0032l86696k41585n39207j218224m69207l82195
$$ y = [657425919, 655884323, 655053329, 653861694, 653075104, 652949219, 653127136, 653136368, 653206787, 653194733, 652589035, 652074051, 651045761, 650436554, 649882507, 649438629, 649646988, 649831619, 650114288, 649866791, 649834290, 649216537, 648238525, 647535019, 646862335, 646960220, 646980362, 647281342, 647406082, 647210464, 646726456, 646053085, 645721436, 645031052, 644401855, 643546371, 643303375, 643595505, 643675003, 643785400, 643462067, 643105316, 642695312, 642210464, 641031799, 640170822, 640059586, 639829369, 639915390, 639881783, 639826736, 639451942, 639334755, 639118195, 638367424, 637708244, 636793480, 636330223, 635817642, 635571632, 635486679, 635375633, 635581131, 635235786, 634655762, 633665810, 632865601, 632343445, 632257690, 632423439, 631947365, 631502800, 631169662, 631089630, 630702934, 630461349, 629922142, 628703918, 628234711, 627852516]
2458.2F27852516l93753j59073K09198l2730k99721o74095j068764j61781o27136r76753
2467.8F23667908o03066j25541J36299l48740k97203n08881l00102n38139q45032r60960
2477.5F19276543q17757N9814j60522o01845q36715P9307K21977o35452q95996j090050
2487.1F14599304l91159o67343o32973m26216j52244J98097p61032m81262m74434r48677
2496.8F09862061j150017p97959k59132l88260m8294j60065j58805l72620m22783p08160
2506.4F05395966j194840p19833p95861l84559k01607l17039m06037o63795n90020
2515.1F00122375n46035j47019m00161n35317p43866p87125k68631R232M3449o19125
2524.7E96127777m99115o07262p30590n92423r36241n55115m8599j31111p27997j72234
$$ y = [627852516, 627458763, 627299690, 627508888, 627476158, 627176437, 626502342, 625433578, 625271797, 624644661, 623667908, 623064842, 622939301, 623075600, 622726860, 622429657, 621920776, 621620674, 621082535, 620237503, 619276543, 618458786, 618518600, 618358078, 617756233, 616919518, 616998825, 617220802, 616585350, 615689354, 614599304, 614208145, 613540802, 612907829, 612481613, 612329369, 612527466, 611766434, 611285172, 610810738, 609862061, 608712044, 607914085, 607654953, 607266693, 607218399, 607058334, 606899529, 606526909, 606104126, 605395966, 604201126, 603481293, 602685432, 602300873, 602099266, 601782227, 601376190, 600712395, 600122375, 599576340, 599429321, 599029160, 598493843, 597749977, 596962852, 596694221, 596703453, 596746902, 596127777, 595628662, 595021400, 594290810, 593698387, 592762146, 592207031, 592158432, 592027321, 591299324, 591127090]
2534.4E91127090m3335o20498p21169p32765j50566m95148n71937n32532k91328j82381
2544E86785431p77702k32277l86200l81546m18473r45739p90596l34244j74866p63702
2553.7E81580086m17023o3515J78528k12936q68416p05605p71103l43971n40085l97110
2563.3E77438850l27301l89557j25694o01425l06053l25890k67715o81343p72553l03497
2573E73337822r20525n51071m45747l85170j14594j42212n00145q57238k88468m38308
2582.6E68694344m19770m69818n75638m45137m02565j96571m27094k08549o20766r76562
2592.2E63951874p04460m58756k92587o89736n43022r8686m0474o00090n01938n04493
2601.9E59517632q13141m43383q00209p40432k78321Q6136l23753p11289m56695q04634
$$ y = [591127090, 591083755, 590463257, 589742088, 589009323, 588858757, 588363609, 587791672, 587259140, 586967812, 586785431, 586007729, 585775452, 585389252, 585007706, 584589233, 583643494, 582852898, 582518654, 582343788, 581580086, 581163063, 581099548, 581278076, 581065140, 580196724, 579491119, 578720016, 578376045, 577835960, 577438850, 577111549, 576721992, 576596298, 575994873, 575688820, 575362930, 575095215, 574413872, 573641319, 573337822, 572417297, 571866226, 571420479, 571035309, 570920715, 570778503, 570278358, 569421120, 569132652, 568694344, 568274574, 567804756, 567229118, 566783981, 566381416, 566184845, 565757751, 565549202, 564928436, 563951874, 563247414, 562788658, 562496071, 561806335, 561263313, 561164627, 561124153, 560524063, 560022125, 559517632, 558704491, 558261108, 557460899, 556720467, 556442146, 556528282, 556204529, 555493240, 555036545, 554231911]
2611.5E54231911q81577q42094k62909n30319p36924k04391m19502l21503n96352n29594
2621.2E48906746p76825o27365n46570r02595j15014o80580n88798j17607k38038m46701
2630.8E43866653r33418o21643j059837q00934o31218q17375m23165m68673k29798
2639.5E37880592l47900m04053n01671o35948p86361o85158m56162n21812m81873p13653
2649.1E32346001j04218m30412p92465l98369n57518k30179p71484q63114p73392n84907
2658.8E26839943k1744m57420m99039m66423m74281m75540j97373m57077p02782m20837
2668.4E22667427o50406k2125o9885m35677m59366n82008n64537o01463k23427m86641
2678.1E18571892l25279m22402n64232j55678k63977p1411n26237o61545p45735q28972
$$ y = [554231911, 553350334, 552508240, 552245331, 551715012, 550978088, 550773697, 550354195, 550032692, 549436340, 548906746, 548129921, 547502556, 546955986, 546053391, 545938377, 545257797, 544668999, 544551392, 544313354, 543866653, 542933235, 542311592, 541251755, 540450821, 539819603, 539002228, 538579063, 538110390, 537880592, 537532692, 537128639, 536626968, 535991020, 535204659, 534519501, 534063339, 533541527, 533059654, 532346001, 532241783, 531811371, 531018906, 530620537, 530063019, 529832840, 529061356, 528198242, 527424850, 526839943, 526818199, 526360779, 525861740, 525395317, 524921036, 524445496, 524248123, 523791046, 523088264, 522667427, 522017021, 521994896, 521925011, 521489334, 521029968, 520447960, 519883423, 519281960, 519058533, 518571892, 518246613, 517824211, 517259979, 517104301, 516840324, 516768913, 516242676, 515581131, 514835396, 514006424]
2687.7E14006424k30446k04086m86412n99861j04905j29394l68805n24979p19070p69272
2697.4E09869194o77795j29433l66249j99890J2741l75481m30450j69754j40801o90460
2707E06701622m79851n50270l30391l27949p98722m25300n43251r8305j53275l12118
2716.6E02682190o2256n95055q18901n03540J46027k61459l97072p0076o3095q1253
2726.3D99975510l10898l26500r10454n54466k23656l20206n1651j99966K2469k01569
2735.9D96898613j61133k67601o23512o49223n57137j21918l32031k55966R422L74031
2745.6D94313545M76723O5918n12123q10700l77502p47261m86260k50396k99073J21079
2755.2D91493950J42059M25263k10038o13632p77626q22487m44565k38418P3700m84696
$$ y = [514006424, 513775978, 513571892, 513085480, 512485619, 512380714, 512251320, 511882515, 511357536, 510638466, 509869194, 509191399, 509061966, 508695717, 508495827, 508508568, 508133087, 507702637, 507532883, 507392082, 506701622, 506221771, 505671501, 505341110, 505013161, 504214439, 503789139, 503245888, 503147583, 502994308, 502682190, 502619934, 502024879, 501205978, 500702438, 500848465, 500587006, 500189934, 500119858, 500056763, 499975510, 499664612, 499338112, 498427658, 497873192, 497649536, 497329330, 497277679, 497077713, 497100182, 496898613, 496737480, 496469879, 495846367, 495197144, 494640007, 494518089, 494186058, 493930092, 493939514, 494313545, 494790268, 494856186, 494344063, 493533363, 493155861, 492408600, 491922340, 491671944, 491372871, 491493950, 491636009, 492061272, 491851234, 491237602, 490459976, 489637489, 489192924, 488954506, 489028206, 488543510]
2764.9D88543510k13699N9471N9242k9640q91227p56569o72951n65834m37279J04714
2774.5D85199738M27436o30645p40281r9639q507m08745m86336o94542r02862o57921
2784.2D80997696l99666k97394n23529j00784k16370m28848l14827p73010j015091
2792.8D76928177j043320n61333n06248m01459j46789j94779o02836j134148o42281
2801.5D71694984r52186j051254o61927p54356o08292m07829K4681k84119o74667j207352
2811.2D65117683j220436o94427p84187o85616j090546r42306p76062p63054l36914
2819.8D57824135m74434o28281j013069j094131j124077r52225q92143r65119n16243
2828.5D50164413m85000j18447n68504j752090j610413q22296j089172j532669j014214
$$ y = [488543510, 488329811, 488389282, 488448524, 488418884, 487527657, 486771088, 486098137, 485532303, 485095024, 485199738, 485627174, 484996529, 484256248, 484156609, 484148102, 483739357, 483253021, 482558479, 481655617, 480997696, 480598030, 480300636, 479777107, 479676323, 479459953, 479031105, 478716278, 477943268, 476928177, 475884857, 475323524, 474817276, 474415817, 474269028, 474074249, 473471413, 472337265, 471694984, 470742798, 469691544, 469029617, 468275261, 467666969, 467259140, 467283821, 466999702, 466325035, 465117683, 463897247, 463202820, 462418633, 461733017, 460642471, 459700165, 458924103, 458161049, 457824135, 457349701, 456721420, 455708351, 454614220, 453490143, 452537918, 451645775, 450680656, 450164413, 449679413, 449560966, 448992462, 447240372, 445629959, 444807663, 443718491, 442185822, 441171608]
2837.2D41171608j014977r80720j018562j170998j546898k079925j807938k172127
2844.9D29379463k226753j782951j759720j942749k061768j708488j187172q47321
2852.6D15862541r84306o60896q04558q79593m72679j70212M94919j49040l03727j41830
2862.3D11790619k87705l32603j110382r84078j145362j155091r08012j028328m63028
2870.9D04376030k69089m38576q34121r34067r43489j115456p84301j34049m34112
2879.6C98488770j195908n66711l27759q17795j159439p81632o15120j354026r44672
2888.3C90725708p65076o89583q27941j331215o54717l71818n98679j112213j256905
2897C83117561r08470r09004r36813p16477k74887l27949l20435m25529r32999j188316
$$ y = [441171608, 440156631, 439175911, 438157349, 436986351, 435439453, 433359528, 431551590, 429379463, 427152710, 425369759, 423610039, 421667290, 419605522, 417897034, 416709862, 415862541, 414878235, 414217339, 413412781, 412533188, 412060509, 411890297, 412385216, 412236176, 411932449, 411790619, 411502914, 411170311, 410059929, 409075851, 407930489, 406775398, 405867386, 404839058, 404376030, 404106941, 403668365, 402834244, 401900177, 400956688, 399841232, 399056931, 398922882, 398488770, 397292862, 396726151, 396398392, 395580597, 394421158, 393639526, 393024406, 391670380, 390725708, 389960632, 389271049, 388443108, 387111893, 386457176, 386085358, 385486679, 384374466, 383117561, 382209091, 381300087, 380363274, 379646797, 379371910, 379043961, 378723526, 378297997, 377364998, 376176682]
2906.6C76176682o72875l33481j030235j058044j098252j270408r47800r44328j047173
2915.3C67774086j185570j322937j410980j240311j181030q74977p48749j062202m11759
2924C58335571m0474n79757n20020J19438P3090q8654n08079m02603O27250M88930
2933.6C57504692P22809N75752J49918K23770j66206Q15773R93919K10609M36860Q46672
2943.3C62314568P46002N31845J033592J037483Q06122L28179Q3961O09703Q24738
2952C68316193O74362R9678M01573R10263O21452J47591k7924K75765O10580P89032
2961.6C72818565L78266K77824L32718O99844Q45719K79655N98717O12335L72505M22326
2971.2C77638474Q83674J062393N10445K81601o5308O37017J099166O64025P22503
$$ y = [376176682, 375503807, 375170326, 374140091, 373082047, 371983795, 370713387, 369765587, 368821259, 367774086, 366588516, 365265579, 363854599, 362614288, 361433258, 360558281, 359809532, 358747330, 358335571, 358295097, 357715340, 357195320, 357314758, 357387848, 357299194, 356791115, 356388512, 357015762, 357504692, 358227501, 358803253, 358953171, 359176941, 359010735, 359826508, 360820427, 361031036, 361467896, 362314568, 363060570, 363592415, 364626007, 365663490, 366469612, 366797791, 366881752, 367491455, 368316193, 368990555, 369090233, 369491806, 370402069, 371023521, 371171112, 371143188, 371418953, 372029533, 372818565, 373196831, 373474655, 373807373, 374507217, 375352936, 375632591, 376231308, 376843643, 377216148, 377638474, 378522148, 379584541, 380094986, 380376587, 380311279, 380948296, 382047462, 382711487, 383433990]
2979.9C83433990N16434L28827P820n4588K76871K78129J83563N55611M20380j6327
2989.6C85930710N37758L47748r7123j99356n00679l57284j54343N3635J8081m03862
2999.2C85175285l25012J41754n29060q68034m85344q45108r01604o31065j10283j90621
3008.8C80430908j61056k4033q63724j056747p56798j73340l92303q44383r99108j016044
3018.5C74143372j04828l03612l86772n27268j335106r61837l95661n72929q45070
3027.2C68710289k44446m48952q82949p91817q31986l05137n89256j347237j339035
3035.9C61929474o54030o82411o73332k15683o64902p54891r30595q75778o54526o63681
3045.5C55159645p58095j243744q86268n95436k72980l75023j013908q53844o46248
$$ y = [383433990, 383950424, 384279251, 384287071, 384232483, 384509354, 384787483, 384971046, 385526657, 385947037, 385930710, 386468468, 386816216, 386719093, 386519737, 386019058, 385661774, 385507431, 385561066, 385579147, 385175285, 384850273, 384992027, 384462967, 383594933, 383109589, 382264481, 381362877, 380731812, 380621529, 380430908, 380269852, 380245819, 379382095, 378325348, 377568550, 377395210, 377002907, 376158524, 375159416, 374143372, 374038544, 373734932, 373348160, 372820892, 371485786, 370523949, 370128288, 369555359, 368710289, 368465843, 368016891, 367133942, 366342125, 365510139, 365205002, 364615746, 363268509, 361929474, 361275444, 360593033, 359919701, 359704018, 359039116, 358284225, 357353630, 356477852, 355823326, 355159645, 354401550, 353157806, 352271538, 351676102, 351403122, 351028099, 350014191, 349160347, 348514099]
3054.2C48514099p15713j158142j116562q42247n57022n59082p78199k95562m55246
3062.9C42036324r30024j098137o54563l69339o64940p15714q19473o41785o48193
3071.5C35494156n05486o07414o38428l27415q09975q57582j040306p84149k15302
3080.2C29708099m41093l54996n15175o24618p21741q81767q00781q08106q39157p39250
3089.9C22981415l79067m66728p31583m87632k39487p29637j067944p40604o33469
3098.5C17505264o36406o88438o97327p21779l49922k13527p26471q48179p13616m66575
3108.2C11443024q73223j265430o94523j93653l67756m67529m39911j064320q43525
3116.9C05233154n39970p08141n77851q25786p10221o07814o02875n74818n63640p30896
$$ y = [348514099, 347798386, 346640244, 345523682, 344681435, 344124413, 343565331, 342787132, 342491570, 342036324, 341106300, 340008163, 339353600, 338984261, 338319321, 337603607, 336784134, 336142349, 335494156, 334988670, 334381256, 333742828, 333415413, 332605438, 331747856, 330707550, 329923401, 329708099, 329267006, 328912010, 328396835, 327772217, 327050476, 326168709, 325367928, 324559822, 323720665, 322981415, 322602348, 322135620, 321404037, 320916405, 320676918, 319947281, 318879337, 318138733, 317505264, 316868858, 316180420, 315483093, 314761314, 314411392, 314197865, 313471394, 312623215, 311909599, 311443024, 310569801, 309304371, 308609848, 308416195, 308048439, 307580910, 307140999, 306076679, 305233154, 304693184, 303985043, 303407192, 302581406, 301871185, 301263371, 300660496, 300085678, 299522038, 298791142]
3126.5B98791142r32904n83191p16171p53479o33087n48687n60246p63473o66275p07703
3136.1B91925926o24332p43618n79052o30055p87944n38025q17204o25000q06007r76315
3145.8B84798374p22160o10867l30143m32357m99764q81786p90234n54581n82180o35147
3155.4B78759155r40208n67017r39617j144924p87411p74860n44529p55196p54585
3164.1B71550808m50020k02484m74587p50980n76496p35149r55735r07840n79625p26909
3173.8B65190983p86171n04151N9700j23500j241799q59413n87921n21431o04630j099777
3183.4B58921890o61316p95803q43487j67732Q0395m79145r21955q83522o83632m59404
3193B53106289p25556k46620l12519j026115p22733k34337l50608j105118p51400k40956
$$ y = [298791142, 297858238, 297275047, 296558876, 295805397, 295172310, 294623623, 294063377, 293299904, 292633629, 291925926, 291301594, 290557976, 289978924, 289348869, 288560925, 288022900, 287205696, 286580696, 285774689, 284798374, 284076214, 283465347, 283135204, 282702847, 282203083, 281321297, 280531063, 279976482, 279394302, 278759155, 277818947, 277251930, 276312313, 275167389, 274379978, 273605118, 273060589, 272305393, 271550808, 271100788, 270898304, 270423717, 269672737, 269096241, 268361092, 267405357, 266497517, 265917892, 265190983, 264404812, 263900661, 263960361, 263836861, 262595062, 261735649, 261147728, 260626297, 260021667, 258921890, 258260574, 257464771, 256621284, 256453552, 256533947, 256054802, 255132847, 254249325, 253565693, 253106289, 252380733, 252134113, 251821594, 250795479, 250072746, 249838409, 249487801, 248382683, 247631283, 247390327]
3202.7B47390327l63521o35281q31814k88295l96538n65434n30567m75521n70602q04272
3212.3B41928482m95319p37496o25877l43418m56810l88623n12847o89393m13970j4725
3222B37250004o41136o84548m27189p18383n31350p12890n02377k40650l55568l19481
3231.6B32116432n16472l56121m54960j038570q39005k34603l88775n99690m86870
3240.3B27201366k22034J33476J22967m85420j385231q14438J38149k33784q98037
3249B23557014o99539J37635j18294o82183p12223l95584j05552n34859m45309l53393
3258.6B19647713m74091r1209l9692k07100n84755q94623l20701J29261l56598o72875
3268.3B16135330m50973l09353m80766l52879j5812j68381k45266j86329j95026n89676
$$ y = [247390327, 247026806, 246391525, 245559711, 245271416, 244874878, 244309444, 243778877, 243303356, 242732754, 241928482, 241433163, 240695667, 240069790, 239726372, 239269562, 238880939, 238368092, 237678699, 237264729, 237250004, 236608868, 235924320, 235497131, 234778748, 234247398, 233534508, 233032131, 232791481, 232435913, 232116432, 231599960, 231243839, 230788879, 229750309, 228911304, 228676701, 228287926, 227688236, 227201366, 226979332, 227112808, 227235775, 226750355, 225365124, 224550686, 224688835, 224455051, 223557014, 222857475, 222995110, 222876816, 222194633, 221482410, 221086826, 220981274, 220446415, 220001106, 219647713, 219173622, 219082413, 219042721, 218835621, 218250866, 217356243, 217035542, 217164803, 216808205, 216135330, 215684357, 215375004, 214894238, 214541359, 214525547, 214357166, 214111900, 213925571, 213730545, 213140869]
3277.9B13140869o51531L8948j89667n23948k00959m24690p22504k41031R5844k43034
3287.5B10078297m30813k86942k31762k40478P9517l36513o25630K07882Q7547p05413
3297.2B07595692r68819j29833L05061l04184k58922l18604j48296j74656q02860n02797
3306.8B04291782n0449k31762l93658j88388m02623m38041k68727n34591O4849L06893
3316.5B02155285o38580o89850l48091m96941j68667k26860k65484l6506o14682n36823
3326.1A98132801n38616p41749m24919p07626o53973k29034l18356p22408m41227m9763
3335.8A93305130n20840m45881J2665j83754p05032n82352p9632m04758r81293n66711
3345.4A88847542j60084n08747k36244L7842k02923l09944j02902j34411o84089j95904
$$ y = [213140869, 212489338, 212528286, 212338619, 211814671, 211613712, 211189022, 210466518, 210225487, 210321331, 210078297, 209647484, 209360542, 209128780, 208888302, 208967819, 208631306, 208005676, 208213558, 208301105, 207595692, 206626873, 206497040, 206802101, 206497917, 206238995, 205920391, 205772095, 205597439, 204794579, 204291782, 204241333, 204009571, 203615913, 203427525, 203024902, 202586861, 202318134, 201783543, 201848392, 202155285, 201516705, 200826855, 200478764, 199981823, 199813156, 199586296, 199320812, 199284306, 198669624, 198132801, 197594185, 196852436, 196427517, 195719891, 195065918, 194836884, 194518528, 193796120, 193354893, 193305130, 192784290, 192338409, 192351074, 192167320, 191462288, 190879936, 190800304, 190395546, 189414253, 188847542, 188687458, 188178711, 187942467, 187980309, 187777386, 187467442, 187364540, 187230129, 186546040, 186350136]
3355.1A86350136J2703n32437l00598K20165K85912m72412o24237m66995l95356j27792
3364.7A83949089l42312j50909j6060k01244k02446j00460k02446k39926M1790l75404
3374.3A82159672m03748k59075n99556j33343L06187K68154l3283l35541k15149p8125
3384A80676193o6738l13492l83758j04103k63768l16486K32601M64516O2828k99606
3393.6A79688187M5967j6690m21810j66855j71432K31724O28109k01626n08270j91422
3403.3A78915882p4596Q1310r7675k2698M49047J15567j40667J17549n7868k53354
3412.9A79032497j12648K6589m5014M41037M39415j10302M90951M96769O4964Q4629
3422.6A80808887J3371K88944J0033k32468J36223K68898J85528L20911O26145L72638
$$ y = [186350136, 186362839, 185830402, 185529804, 185749969, 186035881, 185563469, 184939232, 184472237, 184076881, 183949089, 183606777, 183455868, 183439808, 183238564, 183036118, 182935658, 182733212, 182493286, 182535076, 182159672, 181755924, 181496849, 180897293, 180763950, 181070137, 181338291, 181305008, 180969467, 180754318, 180676193, 180609455, 180295963, 179912205, 179808102, 179544334, 179227848, 179460449, 179924965, 179987793, 179688187, 179734154, 179717464, 179295654, 179128799, 178957367, 179189091, 179817200, 179615574, 179107304, 178915882, 178841286, 178922596, 178824921, 178802223, 179251270, 179366837, 179226170, 179343719, 179285851, 179032497, 178919849, 178946438, 178901424, 179342461, 179781876, 179671574, 180162525, 180659294, 180724258, 180808887, 180822258, 181111202, 181121235, 180888767, 181024990, 181293888, 181479416, 181800327, 182426472, 182799110]
3432.2A82799110k22110N8078O06709J96381J48773L25756j3371J63708O91643N87940
3441.8A85342617k65236K3785Q43086P17926J61591j53733N96028N61027J87149N09568
3451.5A88523808N01098M39377L47691K62451M57115M33731K54021N08022O23684P13901
3461.1A93064899N88513n0373M47082R10206Q35400N82752K51827L63331J52283O02379
3470.8A97748299P41195K67735K91405L56521P18041P40451Q71659P80659P20748J040516
3480.4B04277229N07965O733J87226J115284J225376L10230Q1596N97058J355972R45301
3490.1B10609970K61288M47349O71807N86147O73408N77660N61562J156292R22184
3498.7B16467667J72081J84745J253796J132698J81294Q81671P44744O89125Q68130
$$ y = [182799110, 182577000, 182635078, 183241787, 183438168, 183586941, 183912697, 183899326, 184063034, 184754677, 185342617, 185077381, 185101166, 185944252, 186662178, 186823769, 186670036, 187266064, 187827091, 188014240, 188523808, 189024906, 189464283, 189811974, 190074425, 190531540, 190965271, 191219292, 191727314, 192350998, 193064899, 193653412, 193603039, 194050121, 194960327, 195795727, 196378479, 196630306, 196993637, 197145920, 197748299, 198489494, 198757229, 199048634, 199405155, 200123196, 200863647, 201735306, 202515965, 203236713, 204277229, 204785194, 204791927, 204979153, 206094437, 207319813, 207630043, 207711639, 208308697, 209664669, 210609970, 210871258, 211318607, 211990414, 212576561, 213249969, 213827629, 214389191, 215545483, 216467667, 216639748, 216824493, 218078289, 219210987, 219392281, 220273952, 221018696, 221707821, 222575951]
3507.4B22575951R45301J089592K38723N68715J316909J303883L94154K51140J179867
3516.1B29864235J167202R17511M77695O15464J037101J158200Q38184L39832P81441
3524.8B37196865Q25539J234550J002560M96158P20406Q93154J363030J233329Q45280
3533.5B45810871N90077J467571J214142P12337J620846P89642J099606J268291P20406
3542.1B55293789R97887J282234J259136Q37135J874256R56498Q08010J219196J358337
3550.8B65886478K306405M21752J110859J737366R36184J200848J290931J852475J206131
3559.5B77949429J186676P44247J855164K164344Q00991L036652J378155O6871J103211
3568.2B90285740J105671K690792J661568K047748J925564J514645J361923Q50773
$$ y = [222575951, 223521252, 224610844, 224849567, 225418282, 226735191, 228039074, 228433228, 228684368, 229864235, 231031437, 231948948, 232426643, 233042107, 234079208, 235237408, 236075592, 236415424, 237196865, 238022404, 239256954, 240259514, 240755672, 241476078, 242369232, 243732262, 244965591, 245810871, 246400948, 247868519, 249082661, 249794998, 251415844, 252205486, 253305092, 254573383, 255293789, 256291676, 257573910, 258833046, 259670181, 261544437, 262500935, 263308945, 264528141, 265886478, 268192883, 268614635, 269725494, 271462860, 272399044, 273599892, 274890823, 276743298, 277949429, 279136105, 279880352, 281735516, 283899860, 284700851, 287737503, 289115658, 289182529, 290285740, 291391411, 294082203, 295743771, 297791519, 299717083, 301231728, 302593651, 303444424]
3575.9C03444424J340637J280136K599964K105484J274338J815376K057705J965675
3583.6C17883739J516095L254661J822968J08719J535034N03425L062401L422203K899971
3592.3C36009216R22203J088829L532410l1319J883774L363571J749039L168831J490974
3601C53177528J437569K728577K358017K377052K605972K467118N21621L879509J637764
3609.6C73190727n39589N791779L059311L15170L770256L81661L049049M058113J961136
3618.3C95037613K631493P81860K368240L687859K755928K937126L262596K296677
3626D15759392L004684O295243J825218n631256L892974M916420N406304K629928q9416
3634.7D38009491L158531M213181L694267J658478J713447L080712L375549K596550
$$ y = [303444424, 304785061, 306065197, 308665161, 310770645, 312044983, 313860359, 315918064, 317883739, 319399834, 322654495, 324477463, 324586182, 326121216, 326624641, 329687042, 333109245, 336009216, 336931419, 338020248, 341552658, 341521339, 343405113, 346768684, 348517723, 351686554, 353177528, 354615097, 357343674, 359701691, 362078743, 364684715, 367151833, 367673454, 371552963, 373190727, 372651138, 378442917, 381502228, 381817398, 385587654, 385969315, 389018364, 393076477, 395037613, 397669106, 398450966, 400819206, 404507065, 407262993, 410200119, 413462715, 415759392, 418764076, 425059319, 426884537, 421253281, 425146255, 430062675, 435468979, 438098907, 438009491, 441168022, 445381203, 449075470, 450733948, 452447395, 455528107, 458903656, 461500206]
3642.4D61500206J978950L751336M925537O685142P08847l562622N921860J666107
3650.1D83575363n03692J300849N597306N389747M424439N304642n404244L261719
3657.9E02946129O423454J847687K742004J649971K765541K048111K406311K838822
3665.6E25668030J347809M751587K538375N13306K456818m376412K579041Q351402
3673.3E43829956R515915j232643j6421852N118446Q940392M675331k032013P85637
3681E53179169L344536K165832J493645J972046J669120M044457P012100p816124l951530
3689.7E63113251Q099632l832970K1172N749206J454621J609039Q68034j67923J282692
3698.4E78196754R07937K884063L074990l964615j671639L800850J610184R25712J371422
$$ y = [461500206, 463479156, 467230492, 472156029, 478841171, 479550018, 475987396, 481909256, 483575363, 483071671, 484372520, 489969826, 495359573, 499784012, 505088654, 499684410, 502946129, 509369583, 511217270, 513959274, 515609245, 518374786, 520422897, 522829208, 525668030, 527015839, 531767426, 534305801, 534819107, 537275925, 532899513, 535478554, 543829956, 553345871, 552113228, 535691376, 540809822, 549750214, 554425545, 552393532, 553179169, 556523705, 558689537, 560183182, 562155228, 563824348, 567868805, 574880905, 567064781, 563113251, 571212883, 567379913, 567401085, 573150291, 574604912, 576213951, 577081985, 576914062, 578196754, 579104691, 581988754, 585063744, 581099129, 579427490, 583228340, 584838524, 585764236, 587135658]
3707E87135658L156014M182319o747627K320328M058151j2306557M327584M824180
3714.8E90950050M97780J536675K395134J098900k711983R77554N498505j951142l553199
3723.4E94738274M364090M51240l11394j452674K84004M288673J125183M522057l272057
3732.1F04737396o961899R748497J191216q765411n60341J005592Q27332L128509M157524
3740.8F08508415k948951K460441J1395607j0526466j7336693J0892754O060943M662209
3748.5F13168259k462349r036560J0491600m965706p815437O339340M328117K497063
3756.2F12544327n222435K766571O715927p165604k595329M095535J846848J7814L073006
3764.9F16076660k320556m945603L382454N313530O29501r244575J556854M211006
$$ y = [587135658, 590291672, 594473991, 587726364, 590046692, 594104843, 581798286, 586125870, 590950050, 591447830, 592984505, 595379639, 596478539, 593766556, 594744110, 600242615, 598291473, 594738274, 599102364, 599553604, 599242210, 597789536, 598073540, 602362213, 603487396, 608009453, 604737396, 597775497, 607523994, 608715210, 599949799, 599389458, 600395050, 601222382, 604350891, 608508415, 605559464, 608019905, 619415512, 608889046, 591552353, 602445107, 608506050, 613168259, 610705910, 601669350, 612160950, 607195244, 599379807, 605719147, 610047264, 612544327, 607321892, 610088463, 616804390, 609638786, 607043457, 611138992, 612985840, 613003654, 616076660, 613756104, 608810501, 612192955, 617506485, 618135986, 608891411, 610448265, 614659271]
3772.6F14659271O72837K25181p49817J452599J017036K444077N5122o917190K252159
3781.3F15111275K035522J047363K294388k878837j793557Q28248R79499M42353l30353
3790F17735901P71713L82919K66228j16463R97353L300362l025437m788818J342125
3798.7F16865883M424629P616959m917107j1871490L504181K809791M679680N483780
3806.4F28596306j0501747m462967N882568K021332o49300P53670L61099P65648N588799
3815.1F28355408k40059j3816719M337845N844230M404679K428360j6710205J390342
3822.8F15993881N777893J274567K237663J10474m866333J60789K471390L358116J477661
3831.4F27996101q535575K383041P744141n290452j375350Q342933q125954o682319
$$ y = [614659271, 615332108, 615557289, 614807472, 616260071, 617277107, 619721184, 619776306, 612859116, 615111275, 617146797, 618194160, 620488548, 617609711, 615816154, 616644402, 617623901, 618066254, 617735901, 618507614, 618890533, 619156761, 619040298, 620037651, 623338013, 620312576, 615523758, 616865883, 621290512, 628907471, 623990364, 612118874, 615623055, 618432846, 623112526, 628596306, 618094559, 613631592, 619514160, 621535492, 620886192, 621639862, 622000961, 622766609, 628355408, 628115349, 614298630, 618636475, 624480705, 628885384, 631313744, 614603539, 615993881, 621771774, 623046341, 625284004, 625394478, 620528145, 620688934, 623160324, 626518440, 627996101, 619460526, 621843567, 629587708, 624297256, 622921906, 631264839, 623138885, 616456566]
3839.2F16456566Q014335l569145p92732O875839j154976l410873J985550J088715
3846.9F25493279l20435J460190o40831J356544N155945n104675O71844j3905410P49473
3855.6F14915924R775086j293068j704369J935692K295227L082428m723702m50477
3863.3F23832741O031608n463523n439797M258232N017662N463982q670921q941918
3871F16088066N143395N630493K921295q567848O75544M074936O5956K237015L391228
3879.7F31660080n046120p093200N046157J703911R38607M706306j1040535M94575
3887.4F21369781L079300O38619N205498o34346q312149R20944K947616j418266J114388
3896.1F24911385J608581K989273K102356j0797996M262886K258186n886497M312400
$$ y = [616456566, 624470901, 620901756, 620109024, 626984863, 625829887, 622419014, 624404564, 625493279, 625172844, 626633034, 625992203, 627348747, 632504692, 627400017, 628071861, 614166451, 614915924, 624691010, 623397942, 621693573, 623629265, 625924492, 629006920, 624283218, 623832741, 629864349, 624400826, 618961029, 623219261, 628236923, 633700905, 625029984, 616088066, 621231461, 626861954, 629783249, 621215401, 621890945, 625965881, 626031837, 628268852, 631660080, 626613960, 619520760, 624566917, 626270828, 627209435, 631915741, 620875206, 621369781, 624449081, 625087700, 630293198, 629658852, 621346703, 622267647, 625215263, 623796997, 624911385, 626519966, 629509239, 631611595, 620813599, 625076485, 627334671, 621448174, 625760574]
3903.8F25760574l400039p34825J986351L50685J252975l73268N9776m35524L04413
3912.5F24771118J40228m30450J688499K455941k606316l841133L142281l88337l350486
3921.1F21581345K213859J407929J025505j528969k687721J279449R44824R54628m36210
3929.8F24754639Q2092K485275k969131k905083J362877K73514J33476O50673j27106
3938.5F23741226n20248m16527J631012J213112l952408l66821J769142P26280J474876
3947.2F25299644k187042K7733Q95729j973533J194763J92795m35143P9994P8201J14861
3956.8F23288002q83102O14967l86086R5978Q88672j179008j21308j35422o71920J58233
3966.5F21669006M87442O84815L81889R1362L40882m55399o57959L1853j27793J34354
$$ y = [625760574, 622360535, 621625710, 623612061, 623962746, 625215721, 624842453, 624902229, 624466705, 624771118, 624911346, 624480896, 626169395, 628625336, 626019020, 622177887, 625320168, 624931831, 621581345, 623795204, 625203133, 626228638, 624699669, 622011948, 623291397, 624236221, 625190849, 624754639, 624836731, 627322006, 624352875, 621447792, 622810669, 623084183, 623217659, 623868332, 623741226, 623220978, 622804451, 624435463, 625648575, 621696167, 621329346, 623098488, 623824768, 625299644, 623112602, 623140335, 624036064, 622062531, 623257294, 623450089, 623014946, 623094940, 623173141, 623288002, 622404900, 623019867, 622633781, 622729759, 623618431, 622439423, 622318115, 622182693, 621510773, 621669006, 622156448, 622841263, 623223152, 623314514, 623655396, 623199997, 622542038, 622573891, 622446098, 622580452]
3976.1F22580452m95186m7340M83665m2114O39496M17900m76570j151810J93749R72442
3985.7F23074684p8468o87676p41424N95436k32315k67067N99556J02234N96580k71034
3995.4F22690506m22745j75667j65252K70691L14483
4000.2F22512016
$$ y = [622580452, 622085266, 622037926, 622521591, 622479477, 623118973, 623536873, 623060303, 621908493, 622102242, 623074684, 622996216, 622308540, 621567116, 622162552, 621930237, 621663170, 622262726, 622364960, 622961540, 622690506, 622267761, 622092094, 621926842, 622197533, 622512016]
##END=$$ End of the data block
