##TITLE=$$ Begin of the data block
##JCAMP-DX=5.00 $$ ACD/SpecManager v 10.08
##SPECTROMETER/DATA SYSTEM=Varian
##DATE=15 Jan 2013 09:53:34
##DATA TYPE=INFRARED SPECTRUM
##DATA CLASS=XYDATA
##ORIGIN=
##OWNER=
##NPOINTS=3735
##FIRSTX=399.26403809
##LASTX=4000.35498047
##MAXX=4000.35498047
##MINX=399.26403809
##MAXY=69.45274353
##MINY=17.86885452
##XFACTOR=1.0000000000
##YFACTOR=0.000000100000000
##FIRSTY=37.69833755
##DELTAX=0.96440572
##XUNITS=1/CM
##YUNITS=TRANSMITTANCE
##XYDATA=(X++(Y..Y))
399.3C76983376l137932p781983k695808P139473J591034l796044L077317n503807
407C65875626l085785J284637m60472l197441k985573J779289j477623N371628K286873
415.7C65391159n23300P222786p3662K061691m989090n776291j64833K038002J806717
424.3C66993179k804107r66263j8425j279450J479149l79562J20163P059593J461334
433C71665611o594963k005844K661133J653175l502693m299393J92299J441384q04787
441.7C60405922j117783K877579J60217j991462j67084j71814M14123J210938L367805
450.4C64988441J147614o388206n255471N595169N900498R92660k396393p174491M122734
459.1C61532555N201797n25894k147636j798821j486931l953094j660843L973465M273147
$$ plain form
399.3 376983376 373845444 366063461 363367653 370507126 372098160 368302116 371379433 365875626
407 365875626 362789841 364074478 363614006 360416565 357430992 359210281 357732658 363104286 365391159
415.7 365391159 364867859 372090645 372016983 374078674 369089584 363313293 363148460 365186462 366993179
424.3 366993179 364189072 363222809 363204384 361924934 363404083 363024521 363144684 370204277 371665611
433 371665611 365070648 363064804 365725937 367379112 363876419 359577026 359769325 361210709 360405922
441.7 360405922 359288139 362165718 362325935 360334473 360167389 359995575 360409698 361620636 364988441
450.4 364988441 366136055 359747849 354492378 360087547 365988045 366980705 364584312 357409821 361532555
459.1 361532555 366734352 366208458 364060822 362262001 360775070 356821976 355161133 359134598 363407745
467.7C63407745j31797l742600n001030j428299M134865k271500j424141L84636j795196
476.4C52132683l858757l203202M987488K368813k845268M26673j657867l528557Q11768
485.1C45633774J498337j393128m27093M01230J300048J993218j980362k085381J567993
493.8C46508636N36843k539673j982079R63326K798233m40865j553382J722831j620559
502.5C44393311k066155L32680k556000k760010K20452J293869J850090J342468r73587
511.1C41077118K49290J211090O57387k781219n406075j830063J672402K594795p55806
519.8C36688919k500954M99421J472396O2714j978416j038018r68170j6479K45514
528.5C32466927l57056P74269q52776o72111o14510M39606J703339p25174q19397Q1939
$$ plain form
467.7 363407745 363275948 359533348 354532318 353104019 357238884 354967384 353543243 353927879 352132683
476.4 352132683 348273926 345070724 350058212 352427025 349581757 350008430 348350563 344822006 345633774
485.1 345633774 347132111 345738983 345311890 345713120 347013168 349006386 347026024 344940643 346508636
493.8 346508636 347045479 344505806 342523727 343487053 346285286 345844421 344291039 346013870 344393311
502.5 344393311 342327156 342659836 340103836 337343826 337564278 338858147 340708237 342050705 341077118
511.1 341077118 341326408 342537498 343194885 340413666 335007591 333177528 334849930 337444725 336688919
519.8 336688919 334187965 334687386 336159782 336222496 334244080 333206062 332237892 332221413 332466927
528.5 332466927 332109871 332884140 332031364 331359253 330744743 331184349 332887688 332162514 331343117 331425056
538.1C31425056J736908P89795k385292k269745o98318K58865o17180j063575j540871
546.8C25635643m02756J715279J002579p94449r39446j040802k131805J4763P66792
555.5C23825798j554794j283264J067466J645279o05430q50296O53419J050224o99806
564.2C23248596j597671M79431J465530K54860j908264j147308J691742J962509r46617
572.9C23502808k805863l27492R09958n12199r95751P81136J812172M05884N77659
581.5C23348312N76287j554833k379303m63924R00059M86793J92833M13055L00293
590.2C21819572L04261Q08296l357o17943k81524J328468J136818n41687N2681q15049
599.9C23190536p57598Q99887Q11805j43585j227951j217918j281586k7199J151314
$$ plain form
538.1 331425056 333161964 333951759 331566467 329296722 328598404 328857269 328240089 327176514 325635643
546.8 325635643 325232887 326948166 327950745 327156296 326216850 325176048 323044243 323059006 323825798
555.5 323825798 322271004 320987740 322055206 323700485 323095055 322244759 322898178 323948402 323248596
564.2 323248596 321650925 322130356 323595886 323850746 321942482 320795174 322486916 324449425 323502808
572.9 323502808 320696945 320369453 321279411 320767212 319771461 320552597 322364769 322770653 323348312
581.5 323348312 323924599 322369766 319990463 319526539 320426598 320913391 321106224 321519279 321819572
590.2 321819572 322123833 322932129 322928772 322310829 322029305 323357773 324494591 323952904 324005585 323190536
599.9 323190536 322432938 323332825 324144630 324001045 322773094 321555176 320273590 320246391 321397705
608.5C21397705P06711o46477j755428j051235j230355p88116K72579J089706m3945
617.2C17951145j456871L78227P59716J107293N75847k36683P14722L25699n50633
625.9C19568462m43191J326008K068176J746712J770935J081924O60095J894150J745415
634.6C31418686n46341N74455J223183J274872K160072J230812J596069J235695J135865
643.3C41303368R03549n67551N46150J363144Q65097J104622J864357R78127L36914
651.9C48697777J498794Q65059p30476p51114K18277j82648r85412j70212M38614O19926
661.6C49518585p5722j206970j207809L18680J299362J648102L434753k116013j828231
670.3C49784737r70230J12609J306420J741256J756783J151886Q90160J26686m65889
$$ plain form
608.5 321397705 322104416 321457939 319702511 318651276 317420921 316632805 316905384 317995090 317951145
617.2 317951145 316494274 316872501 317632217 318739510 319315357 319078674 319793396 320119095 319568462
625.9 319568462 319125271 320451279 322519455 324266167 326037102 327119026 327779121 329673271 331418686
634.6 331418686 330872345 331446800 332669983 333944855 336104927 337335739 338931808 340167503 341303368
643.3 341303368 342206917 341639366 342185516 343548660 344413757 345518379 347382736 348360863 348697777
651.9 348697777 350196571 351061630 350331154 349580040 349798317 349615669 348630257 348460045 348898659 349518585
661.6 349518585 349442863 348235893 347028084 347346764 348646126 350294228 353728981 351612968 349784737
670.3 349784737 348814507 348927116 350233536 351974792 353731575 354883461 355773621 355900307 355434418
678.9C55434418N12085J917839K606468J482811J304703J778793J050491J53923L8262
687.6C66279793J010856M20189O9962N67665M16069J011124R81712M41666L71780O23512
697.3C72194328M04320L1090L42941M24996L39202P6066K25028P93419J694565J508217
706.9C78034172M05502O84853J32141l44810P04498J559906J202927K10647K96936
715.6C82886772Q81500J245613J49651j13983R14230K13890o74553L12577K627220
724.3C88442917J601486J56517R73473Q41560J353722J285629j83678q36296J361504
733C94996834K679024J268920R58939P91779l5477j033516K27814R16061J120262J634941
742.6D03525581j066856m88625J431237J090278P97768R00383J037292J90812O70051
$$ plain form
678.9 355434418 355946503 357864342 360470810 361953621 363258324 365037117 366087608 366241531 366279793
687.6 366279793 367290649 367710838 367780800 368348465 368764534 369775658 370757370 371199036 371570816 372194328
697.3 372194328 372598648 372629738 372972679 373397675 373736877 373812943 374037971 374831390 376525955 378034172
706.9 378034172 378439674 379124527 379256668 378911858 379616356 381176262 382379189 382589836 382886772
715.6 382886772 383768272 385013885 385163536 385049553 385963783 386177673 385503120 385815697 388442917
724.3 388442917 390044403 390200920 391174393 392015953 393369675 394655304 394471626 393635330 394996834
733 394996834 397675858 398944778 399903717 400695496 400660019 399626503 399854317 400770378 401890640 403525581
742.6 403525581 402458725 401970100 403401337 404491615 405289383 406189766 407227058 407417870 408087921
751.3D08087921m33502m66080J745606K108802J755028M81758M21906J080589K073555
760D16855583J579972P0381L49540O95496J426964P85408J273384J792030L36762l357
769.6D25162163q5068M959m64706J61094N82886K21062N06973M42124N21087n82847
779.2D26469727n44053M75007R6130k79427P61948J465569K66990K40669Q56171J053658
788.9D30862389J005859L87573n01671k42843J8043p76100o9122k83280J22490N86930
798.5D31110268m04587n04570j009407r48563j612358j417618j012611j735039j148987
807.2D21316528n65033m34990j486549k051926k482223k278519j029968j317139j107826
815.9D08562355n27191l15018k31705J09482R83620J218300O10123M62875J707420
$$ plain form
751.3 408087921 407654419 407188339 408933945 411042747 412797775 413279533 413701439 414782028 416855583
760 416855583 418435555 418505936 418855476 419550972 420977936 421763344 423036728 424828758 425165520 425162163
769.6 425162163 425077095 425082054 424617348 424778442 425361328 425582390 426089363 426531487 427052574 426469727
779.2 426469727 425925674 426400681 426496811 426217384 426979332 428444901 428711891 428952560 429808731 430862389
788.9 430862389 431868248 432255821 431754150 431511307 431529350 430753250 430684128 430400848 430523338 431110268
798.5 431110268 430705681 430201111 429191704 428243141 426630783 425213165 424200554 422465515 421316528
807.2 421316528 420751495 420316505 418829956 416778030 414295807 412017288 410987320 409670181 408562355
815.9 408562355 408035164 407720146 407488441 407597923 408581543 409799843 410409966 410872841 412580261
824.6D12580261K189026K334633K713356L893929M185142K335510K328263K378845
832.3D34938965K679787K683448K883911L122597J836128K230492J463890K230759
840D54069977L049660J826629J831970J533432J502953R89990J750221J765099Q86269
848.7D69206200P46727J426086K461357J030731J036530J504669J671066J022187N27305
857.4D80632858J340599J484986K593994J376419Q38890J120415M75692j9302j291733
866D88552818r10492k63862J98135q24928j212464j261367j085663o86760k454910
874.7D80050507j990014j480445j068993j293907j094780k55776j369552j74256k28195
883.4D71094589j253891j448707o05164j39313j737289j180840q9950J047401J224251
$$ plain form
824.6 412580261 414769287 417103920 419817276 423711205 427896347 430231857 432560120 434938965
832.3 434938965 437618752 440302200 443186111 446308708 448144836 450375328 451839218 454069977
840 454069977 457119637 458946266 460778236 462311668 463814621 464804611 466554832 468319931 469206200
848.7 469206200 469952927 471379013 473840370 474871101 475907631 477412300 479083366 480105553 480632858
857.4 480632858 481973457 483458443 486052437 487428856 488267746 489388161 489863853 489844551 488552818
866 488552818 487642326 487378464 487576599 486751671 485539207 484277840 483192177 482505417 480050507
874.7 480050507 478060493 476580048 475511055 474217148 473122368 472866592 471497040 471322784 471094589
883.4 471094589 469840698 468391991 467786827 467647514 465910225 464729385 464639435 465686836 466911087
892.1D66911087J087914M69932J45340N39551j053505K63557K32964m08669O07605
900.8D68795776j21917N11703N48477O82221J375389K038956K225494J640968J539002
909.4D79236069J704902J987420J158485R62028J4306m03824j362267k890434k374649
918.1D78032036l334160l047752k565728k399406k200584k041131k243309m104538
925.8D56095428m364242m863777m654465m123802l219376j909065j784515j019288
933.6D30156898j384429q39997r41086k204475j917610j405754q90045j688843j274224
942.2D17610435p64541l35274O42777j58005o48499j204033m78134M12026K51808J35422
951.9D15463982k13356L23028l8l76167r53408j782531k021065k855682l277932k833480
$$ plain form
892.1 466911087 467999001 468468933 468614273 469153824 468100319 468363876 468596840 468188171 468795776
900.8 468795776 468673859 469185562 469734039 470416260 471791649 473830605 476056099 477697067 479236069
909.4 479236069 480940971 482928391 484086876 485048904 485063210 484659386 483297119 480406685 478032036
918.1 478032036 474697876 471650124 469084396 466684990 464484406 462443275 460199966 456095428
925.8 456095428 451731186 446867409 442212944 438089142 434869766 432960701 431176186 430156898
933.6 430156898 428772469 427932472 426991386 424786911 422869301 421463547 420573502 418884659 417610435
942.2 417610435 416845894 416510620 417153397 416995392 416346893 415142860 414664726 415076752 415328560 415463982
951.9 415463982 415250626 415573654 415573616 415197449 414244041 412461510 410440445 407584763 404306831 401473351
961.5D01473351j530724p42073j022530j266784j594048j851959k056389k601089k659569
970.2C86148186k271538k488632k655106k639389k168350k353935l621636m122467
977.9C63827133m227562m454307m939423n247879m932747m529915m484482m303436
985.6C26707382m520607m694938m582272m600315m358463m363079l397084k715549
993.3B93475075k623272k552509k464009k875156l690090k432633k279320l180084
1001.1B71378002k953377j937084j773910k006855r76887j683197k055493j753044
1008.8B56238155j690998k264290k374115j457996k086372j243248j244316k003060
1016.5B41873760k306461k247658j783733k863884k562294k166462j265221j508446
$$ plain form
961.5 401473351 399942627 399200554 398178024 396911240 395317192 393465233 391408844 388807755 386148186
970.2 386148186 383876648 381388016 378732910 376093521 373925171 371571236 367949600 363827133
977.9 363827133 359599571 355145264 350205841 344957962 340025215 335495300 331010818 326707382
985.6 326707382 322186775 317491837 312909565 308309250 303950787 299587708 296190624 293475075
993.3 293475075 290851803 288299294 285835285 282960129 279270039 276837406 274558086 271378002
1001.1 271378002 268424625 266487541 264713631 262706776 261729889 260046692 257991199 256238155
1008.8 256238155 254547157 252282867 249908752 248450756 246364384 245121136 243876820 241873760
1016.5 241873760 239567299 237319641 235535908 232672024 230109730 227943268 226678047 225169601
1024.2B25169601j719360j146736j466637o73485j431121l02334r02806k170562j229573
1032.9B14126987q35418J068516R49459J437759J057205Q40454J416912J249562J590881
1041.6B22902317M30698J206265N28450M60300J17512j405525O3152k90813p09114
1050.2B23303242j424637q60787o23207j607227j034660o18401J56613r84402l04852
1058.9B16001682Q44384J334819J566754J457748J963711J048450K064000J609764
1066.6B27891312J824913J885776K41146R51939N51853L99799L62435P36046L93543
1075.3B35238762L9272L58086J65996O45409p3280M87785K88868N46799N24845k85874
1085B37936668J562214K213707K177658N76096N30338J041680J054725K203388J248265
$$ plain form
1024.2 225169601 223450241 222303505 220836868 220163383 218732262 218429928 217527122 215356560 214126987
1032.9 214126987 213291569 214360085 215309544 216747303 217804508 218644962 220061874 221311436 222902317
1041.6 222902317 223333015 224539280 225067730 225528030 225645542 224240017 224303169 224012356 223303242
1050.2 223303242 221878605 221017818 220394611 218787384 217752724 217134323 217290936 216306534 216001682
1058.9 216001682 216846066 218180885 219747639 221205387 223169098 224217548 226281548 227891312
1066.6 227891312 229716225 231602001 231843147 232795086 233346939 233746738 234109173 234845219 235238762
1075.3 235238762 235278034 235636120 235802116 236447525 236374245 236862030 237150898 237697697 238222542 237936668
1085 237936668 239498882 241712589 243890247 244466343 244996681 246038361 247093086 249296474 250544739
1093.6B50544739R59034J460113K404251J744404J337395R52701L69549J644287Q96836
1102.3B62313309J852302J440544P80049K481861J942425J373100J55296J76716J232872
1111B73748474J369915Q03757Q65707J625633J143914J106777N34878K35157m96331
1119.7B80937881o90612J39980n98469M8542M44985K85530J014576K022552K006359
1128.4B85611324J176224J274643J399918J864242K210522K673187K437897K318134
1136.1C00966091K195206J886864K494144J693802J084270R88579J366692J684189
1143.8C14359837J353283J488838O91356K67144K69203L06568K99244k84596k82516
1152.5C18468361L37219M49410l75252k17419j11503n75734o98680q15697p35073r24015
$$ plain form
1093.6 250544739 251503773 252963886 255368137 257112541 258449936 259402637 259772186 261416473 262313309
1102.3 262313309 264165611 265606155 266386204 268868065 270810490 272183590 272338886 272515602 273748474
1111 273748474 275118389 275922146 276787853 278413486 279557400 280664177 281199055 281434212 280937881
1119.7 280937881 280247269 280387249 279788780 279837322 280282307 280567837 281582413 283604965 285611324
1128.4 285611324 286787548 288062191 289462109 291326351 293536873 296210060 298647957 300966091
1136.1 300966091 303161297 305048161 307542305 309236107 310320377 311308956 312675648 314359837
1143.8 314359837 315713120 317201958 317893314 318160458 318429661 318736229 319035473 318750877 318468361
1152.5 318468361 318805580 319254990 318879738 318662319 318550816 317975082 317276402 316460705 315725632 314801617
1162.1C14801617m06399J2092J238442K101612J518002K518425K698936K306099K328224
1170.8C29117050K580528K680436K664871L329353L221970K951317L239593K974854
1178.5C52759972K024116J874275J697541J771927J871185J421699J838761K007293
1186.2C67266769J384278P63778Q57583N44967J564l29551o57082n45502l91655l5667
1195.9C68859482m44718o52084n81551j311454j544838j331558j210976j508293j273880
1204.5C59000130n07355o66351o88515j50986r9411m10270o87829p48825n27458l95126
1214.2C54118004k28844J00517M80576L43742m33349k86026l81050j054955q19816
1222.9C51838799o90194p85255r66835n32723P5112l00713n24673q75321j314850j412811
$$ plain form
1162.1 314801617 314395218 314407310 315645752 317747364 319265366 321783791 324482727 326788826 329117050
1170.8 329117050 331697578 334378014 337042885 340372238 343594208 346545525 349785118 352759972
1178.5 352759972 354784088 356658363 358355904 360127831 361999016 363420715 365259476 367266769
1186.2 367266769 368651047 369414825 370272408 370817375 370818939 370489388 369832306 369286804 368895149 368859482
1195.9 368859482 368414764 367762680 367181129 365869675 364324837 362993279 361782303 360274010 359000130
1204.5 359000130 358492775 357826424 357137909 356986923 356887512 356477242 355789413 355040588 354513130 354118004
1214.2 354118004 353889160 353989677 354470253 354813995 354380646 354094620 353713570 352658615 351838799
1222.9 351838799 351148605 350363350 349396515 348863792 348938904 348638191 348113518 347238197 345923347 344510536
1232.5C44510536j266823p90557l85972K3194k3155R1629L61251Q9798k30369p95212
1242.2C41584320r89151q56018o51932n05943o20956k17972J93557P2861n21660r44328
1251.8C36542778o88248n7182j58844p49969k07978L22304L81699M57382L32603k00958
1261.4C35973587l77006P972q316J83678K69317N95284R32159R03168J067658P43408
1271.1C40290909Q90999N96237J74446O90994Q11997Q26683J221313R67407P09649
1279.8C47180634J318512J019020P18383J151886J415406J285209J208039J316833
1287.5C56613922J007004J320496J092300J120758J294746O11573M32205J62010N09262
1296.2C64164276P71637O03867P26623Q22334M44108J21383K67716J5754O0311m39797
$$ plain form
1232.5 344510536 343243713 342453156 342067184 342090378 342067223 342158852 342520103 342609901 342379532 341584320
1242.2 341584320 340595169 339739151 339087219 338581276 337960320 337742348 337935905 338008766 337487106 336542778
1251.8 336542778 335854530 335797348 335638504 334888535 334680557 335002861 335384560 335841942 336174545 335973587
1261.4 335973587 335596581 335604553 335596237 335779915 336049232 336644516 337576675 338479843 339547501 340290909
1271.1 340290909 341181908 341778145 341952591 342643585 343455582 344282265 345503578 346470985 347180634
1279.8 347180634 348499146 349518166 350236549 351388435 352803841 354089050 355297089 356613922
1287.5 356613922 357620926 358941422 360033722 361154480 362449226 363060799 363493004 363655014 364164276
1296.2 364164276 364935913 365539780 366266403 367088737 367532845 367654228 367921944 367937698 367998009 367558212
1305.8C67558212l33328N1231m94155m63295m06723k69814o10886n70793m56047o56319
1315.4C63348083j38626j08375J27678N67894J175995J141090P70607J030884P85141
1324.1C68700371O78406L35426L40233N07316L04871J53m56734n58624m57688l87497
1333.8C69006233q42895k85263K24800m8027M39872M48990L91350L45039P61071O88553
1343.4C71129723R19532J521683N62782N43862M57001K14462O7482N874k0637m50592
1353.1C74951172r8877l10211k28577k05917m65355m67720j91460j16653o14968n31425
1362.7C71720009j238976k74925j75133l21769Q8691r41391q27675m88433j28136k88277
1372.3C67123985n57747m2533k45667K52724k12021j77574j06736l40118p93724j310043
$$ plain form
1305.8 367558212 367224884 367276115 366781960 366318665 365911942 365642128 365031242 364460449 364004402 363348083
1315.4 363348083 363209457 363101082 363228760 363796654 364972649 366113739 366884346 367915230 368700371
1324.1 368700371 369378777 369714203 370054436 370561752 370866623 370866776 370410042 369851418 369393730 369006233
1333.8 369006233 368163338 367878075 368102875 368054848 368494720 368943710 369335060 369680099 370441170 371129723
1343.4 371129723 372049255 373570938 374133720 374677582 375134583 375349045 375416527 375422401 375401764 374951172
1353.1 374951172 374852295 374542084 374313507 374107590 373642235 373174515 372983055 372866402 372251434 371720009
1362.7 371720009 370481033 370206108 370030975 369709206 369797897 368856506 368028831 367540398 367412262 367123985
1372.3 367123985 366566238 366523705 366278038 366530762 366318741 366141167 366034431 365694313 364900589 363590546
1382C63590546j118889j641350j043701p69882j133767j896553j648559j164169j907044
1390.7C51266632j922531k169075j464539j863479l135567j992569k011414j348571
1398.4C35358887k660446k298546j395493k336311j946869k098236k935753k285461
1406.1C17401772j096802j369267k034931j278706j386432j555901j749630j347084
1413.8C05583019j043663j130409o8588l97549Q8253j561909p33909R60045L5419R65080
1423.4C02695789k01206J77632J000919Q31737J112957J32103J499386J570721K133121
1432.1C10953159J441918Q25348K320442J901073K637215R31854K223435J939354J625251
1440.8C26799049K172165J478272K048645J244240J726303J381988J642380K058067
$$ plain form
1382 363590546 362471657 360830307 359786606 359016724 357882957 355986404 354337845 353173676 351266632
1390.7 351266632 349344101 347175026 345710487 343847008 340711441 338718872 336707458 335358887
1398.4 335358887 332698441 330399895 329004402 326668091 324721222 322622986 319687233 317401772
1406.1 317401772 316304970 314935703 312900772 311622066 310235634 308679733 306930103 305583019
1413.8 305583019 304539356 303408947 303340359 302942810 303031063 301469154 300735245 301695290 301730709 302695789
1423.4 302695789 302494583 302672215 303673134 304504871 305617828 305749931 307249317 308820038 310953159
1432.1 310953159 312395077 313220425 315540867 317441940 320079155 321011009 323234444 325173798 326799049
1440.8 326799049 328971214 330449486 332498131 333742371 335468674 336850662 338493042 340551109
1448.5C40551109J566277K206764R22203J889267J591950K114944J928291J09635J253929
1457.2C54134369N8861M367866K027016K288780J898193J337891K719307M39758K066765
1465.9C71338806J890602K322274K728042K507820L428345K650413L061104K079354
1473.6C92006760L382759L076133J661263K311821K572479K680550K291450J962357
1481.3D11945572J748695K286721J798591J122818J750832O06804K11792J984596J012649
1490D24469070n56221Q37937R38186l43742k11716M6921m317131k99568q72726k693863
1499.6D16997147l45116j059227j013069o75507J86043m76837k221718k805023r9487
1508.3D08487206P52754j475182J84822r97810j171723J27297q91228l40385j486054
$$ plain form
1448.5 340551109 342117386 344324150 345246353 347135620 348727570 350842514 352770805 352880440 354134369
1457.2 354134369 354193230 358561096 360588112 362876892 364775085 366112976 368832283 369272041 371338806
1465.9 371338806 373229408 375551682 378279724 380787544 384215889 386866302 389927406 392006760
1473.6 392006760 395389519 398465652 400126915 402438736 405011215 407691765 409983215 411945572
1481.3 411945572 413694267 415980988 417779579 418902397 420653229 421260033 421471825 423456421 424469070
1490 424469070 423912849 424750786 425688972 425345230 425133514 425180435 420863304 420563736 419691010 416997147
1499.6 416997147 416652031 415592804 414579735 413904228 414090271 413613434 411391716 408586693 408487206
1508.3 408487206 409239960 407764778 407949600 406951790 405780067 405907364 405016136 404675751 403189697
1517D03189697k565155J60828J585922Q9150k131615J097412Q93860J535950r03130
1525.7D02952919J18141J120568M54711O11802L21464N95436M64668N29938j030960
1534.3D06138687J065445R00574M37927J325684k667084j104431K116165Q11348r10301
1543D08114014J092415N12771j462936J387329j48544N8059r41353q52661J264649
1551.7D09023743K60048N54046l466759j56250P11747o53878m357414j0948753M937858
1560.4C95904388Q47741J022873j783982k144928l415260l433876j082115k197304
1568.1C83717537j361046q643722k211380k135544l929901l126336l753852j960564
1575.8C56595192j1161461j313705l065110m066696l539848n009079l306198n562401
$$ plain form
1517 403189697 400624542 400785370 402371292 402460442 400328827 401426239 402320099 403856049 402952919
1525.7 402952919 403071060 404191628 404646339 405258141 405579605 406175041 406639709 407169647 406138687
1534.3 406138687 407204132 408104706 408542633 409868317 407201233 406096802 408212967 409024315 408114014
1543 408114014 409206429 409719200 408256264 409643593 409495049 409553108 408611755 407759094 409023743
1551.7 409023743 409283791 409837837 406371078 406214828 406926575 406272697 401915283 390966530 395904388
1560.4 395904388 396752129 397775002 395991020 393846092 390430832 386996956 385914841 383717537
1568.1 383717537 382356491 373712769 371501389 369365845 365435944 362309608 358555756 356595192
1575.8 356595192 345433731 344120026 341054916 336988220 333448372 328439293 325133095 319570694
1583.5C19570694l446388n465527m158306l721523n028668k764358m898148k353782
1591.2B87733994n099030l483524l552590l981743k161579m825439j794796l849220
1599B58986073j802197k977676k576561j442509l883648p90672l180332q10452k476807
1607.6B39045219j320018j028061k602291M93755k244873K34489j711292J79405N66082
1616.3B31612415m181041J318531j128998J417274j190948J096878N51166j631889
1624B27863388J114636m99287K112827j116123J606331Q68130Q41274J173420O7539
1632.7B34032135K741432L92990K012654q87642K513923J146431Q37059K584267O87866
1641.4B46061115K883702N49144J975861J476879M76875L785820r19227L416519P20673
$$ plain form
1583.5 319570694 316124306 310658779 306500473 302778950 297750282 294985924 290087776 287733994
1591.2 287733994 282634964 279151440 275598850 271617107 269455528 264630089 262835293 258986073
1599 258986073 257183876 254206200 251629639 250187130 246303482 245512810 242332478 241522026 239045219
1607.6 239045219 237725201 236697140 234094849 234588604 232343731 232578220 230866928 231046333 231612415
1616.3 231612415 227431374 228749905 227620907 229038181 227847233 228944111 229495277 227863388
1624 227863388 228978024 228478737 230591564 229475441 231081772 231949902 232791176 233964596 234032135
1632.7 234032135 236773567 237166557 239179211 238291569 240805492 241951923 242788982 245373249 246061115
1641.4 246061115 248944817 249493961 251469822 252946701 253423576 257209396 256290169 259706688 260427361
1650.1B60427361K486991K128563Q54779O27098M6882M122677J158276K469768J052265
1658.8B75374660J715489K342815J870613L309441O43578L210659K074546L152047
1666.5B93693848K789936K088165K508869J702194N539685K120895L678551L717422
1674.2C17839565K749958K554093K994537M441414K793961M389991L297692M811935
1681.9C45873146N518799J025963M905624L730469N845108L948288M016647M801178
1689.6C79665222M312554M869537M131164N195046N103531M536056R55468N841293
1697.3D14609871O262550N099640L193588R17740P622643N366630M544907L635521
1705D51253090L023338K461777K600136L960495K669716K327995K989769L399391L488236
$$ plain form
1650.1 260427361 262914352 265042915 265897694 266524792 266571674 270694351 271852627 274322395 275374660
1658.8 275374660 277090149 279432964 281303577 284613018 285256596 288467255 290541801 293693848
1666.5 293693848 296483784 298571949 301080818 302783012 308322697 310443592 314122143 317839565
1674.2 317839565 320589523 323143616 326138153 330579567 333373528 337763519 341061211 345873146
1681.9 345873146 351391945 352417908 357323532 361054001 366899109 370847397 374864044 379665222
1689.6 379665222 383977776 388847313 392978477 398173523 403277054 407813110 408768578 414609871
1697.3 414609871 420872421 425972061 429165649 430083389 437706032 443072662 447617569 451253090
1705 451253090 454276428 456738205 459338341 463298836 465968552 468296547 471286316 474685707 478173943
1713.7D78173943J341285J031418L265648K046852m126053L254357L393516J976891
1721.4D90357857K298431J909828J671639J810837J821251J271400J267242J879845
1729.1E04288330k86369O57081M103852M365463J95312l729209L979148M182473K336197
1737.8E20092278K726287P49207l62854M356689L833428K400856K559662M099235L972359
1746.5E44427147K585602K999305K488785N052681K442017J381721N644150M351196
1754.2E71372604M380074M364738J518059K132645L417282L066215L354760J7280O68602
1762.9E94292259M153977K796325K692185K960319K235642j312256J923141M319725
1770.6F14061317M12713j527215p57141M414406K878227M45672L161773J312332J758156
$$ plain form
1713.7 478173943 479515228 480546646 483812294 485859146 481733093 484987450 488380966 490357857
1721.4 490357857 492656288 494566116 496237755 498048592 499869843 501141243 502408485 504288330
1729.1 504288330 504001961 504659042 508762894 513128357 513323669 509594460 513573608 517756081 520092278
1737.8 520092278 522818565 523567772 523204918 527561607 531395035 533795891 536355553 540454788 544427147
1746.5 544427147 547012749 550012054 552500839 557553520 559995537 561377258 567021408 571372604
1754.2 571372604 575752678 580117416 581635475 583768120 587185402 590251617 593606377 593623657 594292259
1762.9 594292259 598446236 601242561 603934746 606895065 609130707 607818451 609741592 614061317
1770.6 614061317 614474030 612946815 612189674 616604080 619482307 619927979 623089752 624402084 626160240
1779.3F26160240P59163q24165J086731J652603K019806q4038Q85391K357750J665344
1788F35678825R79615J352234P17391R24416j281509j314316L812866J785812L38440
1796.7F42993774K071305K331772Q10089j154175J915893k63290P4463J644897Q29773
1805.3F51254501J427155Q60901J107254J393814J386948r58558K51313R79614Q0490
1814F57783432J402969L34778J164093O89850J103592J402817k68326Q76846k62069
1822.7F64227982J130065J437836k023697K54975K212295K718735N81512l066024Q25119
1831.4F68298798K509460J21307m7912M41971M23965M09927j55105J645660P96662
1840.1F74444733Q99810P11976J117858N24445n965576K068558K679214M59137K88162
$$ plain form
1779.3 626160240 626919403 626095238 627181969 628834572 630854378 630770340 631655731 634013481 635678825
1788 635678825 636658440 638010674 638728065 639652481 638370972 637056656 640869522 642655334 642993774
1796.7 642993774 645065079 647396851 648206940 647052765 648968658 648705368 648779831 650424728 651254501
1805.3 651254501 652681656 653542557 654649811 656043625 657430573 656472015 656723328 657702942 657783432
1814 657783432 659186401 659521179 660685272 661375122 662478714 663881531 663613205 664490051 664227982
1822.7 664227982 665358047 666795883 664772186 665027161 667239456 669958191 670539703 667473679 668298798
1831.4 668298798 670808258 670929565 670881653 671323624 671747589 672157516 672002411 673648071 674444733
1840.1 674444733 675344543 676056519 677174377 677698822 671733246 673801804 676481018 676940155 677228317
1848.7F77228317R29947J525116J16654O00662l23639j60294k03399l32947Q46634
1857.4F80227051L09524J023331O16302Q71735M29993K66723L53165l19137J93481
1866.1F83972168p36008J027985l23944j605149J546708J564636R55810K66648K41165
1874.8F86910019r28879k78778J28250q5602Q12607O73371J035232K98462O40793j6556
1884.4F89188919p95364j82572q3084Q30841n78689r77249R65423J571884O26068L74451
1894.1F90940628j39999j533585M6768k02789L13797M78210L99857P31583Q7051R48334
1903.7F92069855N569L8223k52380p08618k27890k4262K41318k63214J722565Q08563
1913.3F93409729N4779j8921m85992Q59298k352752p49588J511154Q66318P23495o34155
$$ plain form
1848.7 677228317 678158264 679683380 679800034 680400696 680077057 679916763 679713364 679380417 680227051
1857.4 680227051 680536575 681559906 682176208 683047943 683477936 683744659 684097824 683778687 683972168
1866.1 683972168 683236160 684264145 683940201 682335052 683881760 685446396 686402206 686668854 686910019
1874.8 686910019 685981140 685702362 685830612 685745010 686557617 687230988 688266220 688564682 689205475 689188919
1884.4 689188919 688393555 688210983 688127899 688958740 688380051 687402802 688368225 689940109 690566177 690940628
1894.1 690940628 690800629 689267044 689313812 689111023 689424820 689903030 690302887 691034470 691121521 692069855
1903.7 692069855 692075424 692113647 691861267 691152649 690924759 690900497 691141815 690878601 692601166 693409729
1913.3 693409729 693464508 693445587 692959595 693818893 691466141 690716553 692227707 693094025 693817520 693183365
1923F93183365l25241N15136P51801j92413j76087o17218n28412J64795j9531Q02078
1932.6F93558273K11182P57980k1667p41120k12936o98471j74561l09829J273422K33459
1942.3F93875732j512680Q51517Q70667K62832n82580j81504k08053n83801m83933
1951F92308197N6305M30832M7302M66156k1133J63345l04642q50982m86603j06049
1960.6F91702728L38517l26386M70428N33524O63147L33252p90863l00675k85873N4474
1970.2F92392273o89316j73569J20011o9504O64444J1597J59607l97263j95923k18429
1979.9F91603928n40467j67007j86844N80978j61132K5482N06592M26406n0811p98111
1989.5F91239014k12555p25251r72518j50757Q80584J58310j00555O38351k61840o5537
$$ plain form
1923 693183365 692858124 693373260 694125061 693932648 693756561 693139343 692610931 692775726 692756195 693558273
1932.6 693558273 693769455 694527435 694505768 693764648 693551712 692853241 692678680 692368851 693642273 693875732
1942.3 693875732 692363052 693214569 694085236 694348068 693765488 693583984 693375931 692792130 692308197
1951 692308197 692364502 692795334 692842636 693308792 693287659 693451004 693146362 692295380 691808777 691702728
1960.6 691702728 692041245 691714859 692185287 692718811 693381958 693715210 692924347 692623672 692337799 692392273
1970.2 692392273 691702957 691529388 691649399 691579895 692244339 692255936 692415543 692018280 691822357 691603928
1979.9 691603928 691063461 690896454 690709610 691290588 691129456 691154938 691661530 692087936 692037125 691239014
1989.5 691239014 691026459 690301208 689328690 689177933 690058517 690216827 690116272 690754623 690492783 690427246
1999.2F90427246m37317l09067k86254l52097j42441n28259L39355K46582K92054j87912
2008.8F89061890l73841m7378m10462k91061o33621k61917j65940L26386J62735q6823
2018.5F87279968M4174l94287K62757o38657o65741m66156k35443J77307l81241J50528
2028.1F85133209j74789K60315j12229m46701k91824o69937K5329k60315k4566l78647
2037.7F83059845L81K60086k26898J3504m65545R92n18799j31379l08609m17327M95681
2048.4F81761932l09372K59552n9585k3651k0981l13416l48129p87964J55411k43912
2058F80069885Q9264L6469J66320N83115k21329J12534o13022p26395n50232n3634
2067.6F78892975j4038j56861M23737j58234M79813N4855j31454q7662m87595l76129
$$ plain form
1999.2 690427246 689989929 689680862 689394608 689042511 688900070 688371811 688711166 688957748 689249802 689061890
2008.8 689061890 688688049 688640671 688230209 687939148 687305527 687043610 686877670 687204056 687366791 687279968
2018.5 687279968 687324142 686929855 687192612 686553955 685888214 685422058 685186615 685363922 684982681 685133209
2028.1 685133209 684958420 685218735 685106506 684659805 684367981 683698044 683723373 683463058 683438492 683059845
2037.7 683059845 683060226 683320312 683093414 683106918 682641373 682642365 682123566 681992187 681683578 681266251 681761932
2048.4 681761932 681452560 681712112 681652527 681628876 681607895 681294479 680946350 680158386 680313797 680069885
2058 680069885 680159149 680195618 680361938 680945053 680723724 680836258 680223236 679496841 678946609 678892975
2067.6 678892975 678878937 678722076 679145813 678987579 679467392 679522247 679390793 679303131 678815536 678439407
2077.3F78439407q80050p4463K6016L79257K93732o87K60468k45896r0332l02658k11410
2087.9F77593384q12912n53055N5466J15585N57632J6480R9945n91812m93622n26657
2097.5F75460434m83627J36871m87518J13372o7367L30124K06070k90451j77231q72193
2107.2F73868484m25796o52771k9373n0202n23071O6147M53033N95093m55475k26516
2116.8F72619553m37394n95169l51944p0419J67389j89590P22351j55564j98898N0888
2126.5F71561203l73001M9286m43802j82724l84064J09635M501L1815P46078R5978
2136.1F71214905J54953m87366n58014m51736q0109K47879K12021N82046J04752N34363
2145.8F71473694j21002l22190k15072p34787l38974k9145N35508j26648L44696M56924
$$ plain form
2077.3 678439407 677559357 677484894 677510910 677890167 678183899 678183212 678443680 678197784 678107452 677804794 677593384
2087.9 677593384 676780472 676227417 676282883 676398468 676956100 676972580 677072525 676480713 675987091 675460434
2097.5 675460434 674976807 675113678 674626160 674739532 674672165 675002289 675208359 674917908 674740677 673868484
2107.2 673868484 673442688 672789917 672760544 672710342 672187271 672253418 672706451 673301544 672846069 672619553
2116.8 672619553 672182159 671586990 671235046 671164627 671332016 671142426 671864777 671709213 671510315 671561203
2126.5 671561203 671188202 671237488 670793686 670610962 670226898 670336533 670341034 670372849 671118927 671214905
2136.1 671214905 671369858 670882492 670324478 669872742 669792633 670040512 670252533 670834579 670939331 671473694
2145.8 671473694 671352692 671030502 670815430 670080643 669741669 669712524 670248032 670121384 670466080 670923004
2155.4F70923004R3613M84695k35672l91311o65284q9035j69830q5068L51410K69776
2165F70486298P36160j4343J11465k24075l16391k72217l47519M40750L1586M15192
2174.7F71046906K84805K77862j42898n07355J79138O7826J94549n20859L7308K74887
2184.3F71192169K31705M08935j38702M16718k75650o9123j9989k45743J07270Q2550
2194F71690140K41928n94940o4926L08761O97098L57742o00052k10952k60621M24653
2203.6F71988831K68554L28522m7073k45133O29883j3962j64261l99475p6751m7837
2213.3F72221298J67694K70844l28598K80075O5002L06168j10550k63062k8457j78375
2222.9F72402039M09011r91K35214j91651k64740Q316o6757J25046j43585K58789k52915
$$ plain form
2155.4 670923004 671016617 671501312 671265640 670874329 670209045 670120010 669950180 669865112 670216522 670486298
2165 670486298 671222458 671208115 671319580 671095505 670779114 670506897 670159378 670600128 670631714 671046906
2174.7 671046906 671331711 671609573 671466675 670959320 671138458 671206284 671400833 670879974 670917282 671192169
2184.3 671192169 671423874 671832809 671694107 672110825 671835175 671766052 671746063 671500320 671607590 671690140
2194 671690140 671932068 671337128 671272202 671580963 672278061 672635803 672035751 671824799 671564178 671988831
2203.6 671988831 672257385 672585907 672538834 672293701 672923584 672909622 672745361 672345886 672269135 672221298
2213.3 672221298 672388992 672659836 672331238 672611313 672676315 672982483 672871933 672608871 672580414 672402039
2222.9 672402039 672811050 672810059 673045273 672853622 672588882 672597198 672530441 672655487 672511902 672770691 672517776
2233.5F72517776K88773N29099P9650k70843o42700L27453j33438O4926j95007j42212
2243.2F72423477M15726j64414L30811k41318j72424j77765J28174M57153l07083J7929
2252.8F72710266P6981L21579l51334k2049K42081m28848O3095n6458J66016j984L57437
2263.4F73076782J70593j10702J21765l71017K1133l66363j42518q9035Q7433K15454
2273F72613525j47171K76795k56806K68174k20108m42734n7678m72794j50833n86319
2282.7F70824051K78320N30243L46375J86615j67389J06277m47311q0185l36609K80762
2292.3F71521149N48477J18179P56760J38321K71301l47671m83475N2185R7427O83212
2302F73355865J42365j35956M8523R59168Q33282O18973P76443m81338j32370L280
$$ plain form
2233.5 672517776 672806549 673335648 673415298 673144455 672501755 672829208 672695770 672760696 672565689 672423477
2243.2 672423477 672839203 672674789 673005600 672764282 672591858 672414093 672542267 672999420 672692337 672710266
2252.8 672710266 672787247 673108826 672757492 672735443 672977524 672548676 672611771 672555313 672721329 672719345 673076782
2263.4 673076782 673247375 673136673 673258438 672887421 672908554 672542191 672399673 672310638 672398071 672613525
2273 672613525 672466354 672743149 672486343 672754517 672534409 672091675 672033997 671561203 671410370 670824051
2282.7 670824051 671102371 671632614 671978989 672165604 671998215 672104492 671657181 671576996 671240387 671521149
2292.3 671521149 672069626 672187805 672944565 673082886 673354187 673006516 672523041 672575226 672672653 673355865
2302 673355865 673498230 673362274 673410797 674369965 675203247 675822220 676598663 676117325 675984955 675988235
2311.6F75988235K82135O24619m9362M23355R14764Q41523M35714M28849N48858K02027
2321.3F80640717J08795M06494O6833J13984J217651J467209J423034J496659o5155
2329.9F86876221k064896o68106n9967l39966N04379N48172J132279k7924J21460K91138
2339.6F86312790o84204q09174q13293K74658p19910j471786k136917k644654j934051
2348.3F75373459J069031L442535P14417J665649K370148M91027J699601P16476K841873
2356.9F90384216J607743R86709j15509j908874m40445j89057p55233l034363r63135
2365.6F85572052j253128n40695p39289k927246j897812k692413j829376k061081j684799
2374.3F69946213j289978j505204j017532j463852m40445j423492k066956j663513
$$ plain form
2311.6 675988235 676270370 676894989 676845627 677268982 678183746 679025269 679460983 679889832 680438690 680640717
2321.3 680640717 680749512 681156006 681222839 681336823 682554474 684021683 685444717 686941376 686876221
2329.9 686876221 684811325 684143219 684083252 683743286 684247665 684795837 685928116 685900192 686021652 686312790
2339.6 686312790 685628586 684819412 684006119 684280777 683560867 682089081 679952164 677307510 675373459
2348.3 675373459 676442490 679885025 680599442 682265091 684635239 685126266 686825867 687542343 690384216
2356.9 690384216 691991959 692978668 692863159 690954285 690513840 690324783 689569550 686535187 685572052
2365.6 685572052 684318924 683778229 683038940 680111694 678213882 675521469 673692093 671631012 669946213
2374.3 669946213 668656235 667151031 666133499 664669647 664229202 662805710 660738754 659075241
2382F59075241j555481q02307p88956l25927l33252m4861m9896j41221j60980p47757
2391.7F54124603m20379p45392l33328m40522o22406r2392j13754N61447q2245m63485
2401.3F51372147m19388o91376q42133o42547K16293J5564k41089j33209L69415k36282
2410.9F48767395p09686k26898n82886q24738j188202j04293L08303q4610J17493m12979
2420.6F45058899k50473l13263n53589r59320m91562j86615o98395o7978J61820O3553
2430.2F41763077n80673l64991j91040n66177l89748r53369p34024n32570n9700J48850
2439.9F37539635L090O0157o12030n14221p04002o24695n75867p21817l35426p8163
2449.5F33436661J4038m09050k37618l65028l34282n94063r10606m28848n25628l03535
$$ plain form
2382 659075241 657519760 656717453 655928497 655602570 655269318 655224457 655174561 655033340 654872360 654124603
2391.7 654124603 653704224 652958832 652625504 652184982 651562576 651470184 651356430 651917877 651835632 651372147
2401.3 651372147 650952759 650261383 649419250 648776703 648992996 649008560 648767471 648634262 649003677 648767395
2410.9 648767395 648057709 647830811 647247925 646423187 645234985 645130692 645438995 645354385 645471878 645058899
2420.6 645058899 644808426 644495163 643941574 642982254 642490692 642304077 641605682 641537704 641699524 641763077
2430.2 641763077 641182404 640817413 640626373 640060196 639670448 638717079 637983055 637450485 637390785 637539635
2439.9 637539635 637542725 637602882 636990852 636476631 635772629 635147934 634572067 633850250 633514824 633436661
2449.5 633436661 633450699 633041649 632804031 632439003 632104721 631510658 630600052 630171204 629645576 629342041
2459.2F29342041m41093J81999J57318p67288o90308p30743l07083n51873n83992n97191
2468.8F25011787l96919J83373k79694l33710l75404l66936j073532j136093m15764
2477.5F20817108l81126k11487n95512l78876r8419j22948n27344o24542n51491j186485
2487.1F16138878p22962n74531j39427n4055l19099O4697m38308o35300j044159j094093
2496.8F11181641q64907m18129j70288n95665k2049J03150k56539p66754p29408o91032
2506.4F06770020q22602m71992q58765q00438o83098j59797J19743k75803m68673q19741
2516.1F01528854n52978n65071l50075m36478o46476m62418k96593P4082n25093o53115
2525.7E97114639o34460n18074n75142r78699n39703k45095L7652m13437l56179j72309
$$ plain form
2459.2 629342041 628900948 629082947 629240265 628472977 627782669 627051926 626744843 626192970 625608978 625011787
2468.8 625011787 624614868 624798241 624518547 624184837 623809433 623442497 622368965 621232872 620817108
2477.5 620817108 620435982 620224495 619628983 619250107 619151688 619028740 618501396 617876854 617325363 616138878
2487.1 616138878 615415916 614841385 614701958 614647903 614328804 614393501 613955193 613319893 612275734 611181641
2496.8 611181641 610316734 609898605 609728317 609132652 609110603 609213753 608957214 608190460 607461052 606770020
2506.4 606770020 605947418 605475426 604616661 603816223 603133125 602973328 603093071 602817268 602348595 601528854
2516.1 601528854 600975876 600410805 600060730 599624252 598977776 598515358 598218765 598292847 597767754 597114639
2525.7 597114639 596480179 595962105 595386963 594408264 593868561 593623466 593661118 593247681 592891502 592719193
2535.4E92719193o19736p05376m63409j00899q11997l87153l63884o66161n4130o56243
2545E87890205n78270n26657l68690l66440q75244o29501l42217k56729o26068m87519
2554.6E82832870j82724J62774l81852q83827l40423p26662o90193n79605l48931j96953
2564.3E78664474k93045k29606m61044k80915o53801m41093m28047p16668n33294q34694
2573.9E73792267m30069m7341j78604n53245j95542m87709r69810m22363o13137k85530
2583.6E69608917m78592l74603m9057m24614n27611q43124k74353m36821o23856n86128
2593.2E64990158o44150l07007o17065k34489k76108l31307l08723p43866q38280o76346
2602.9E60012817m23851o21986l69072m95987j78566j7090n27038o06423r60502m95720
$$ plain form
2535.4 592719193 592099457 591394081 590930672 590829773 590017776 589630623 589266739 588600578 588546448 587890205
2545 587890205 587311935 586785278 586416588 586050148 585174904 584545403 584203186 583946457 583320389 582832870
2554.6 582832870 582650146 582812920 582431068 581547241 581206818 580480156 579789963 579210358 578861427 578664474
2564.3 578664474 578371429 578141823 577680779 577399864 576746063 576304970 575876923 575160255 574626961 573792267
2573.9 573792267 573362198 573314857 573136253 572583008 572387466 571899757 570929947 570507584 569894447 569608917
2583.6 569608917 569130325 568755722 568706665 568282051 567754440 566911316 566636963 566200142 565576286 564990158
2593.2 564990158 564346008 564039001 563421936 563187447 562911339 562580032 562271309 561527443 560689163 560012817
2602.9 560012817 559588966 558966980 558597908 558101921 557923355 557906265 557379227 556772804 555812302 555316582
2612.5E55316582p77512p13501m44374p55844j75247n23300p84226o02264l03879o74248
2622.1E49562187q47626l66363o74629m08898m39567m28658n25512m59939l42941q83636
2631.8E44184418o39725q32825n26886m54902j016922p86400m10423q4877j50948j80664
2641.4E39099846p11823p62977q62389j130981n45006l84712l35503o77338l47290
2650.1E33341827j18522n97267q11119o76346k01531p52220o07643m81186n33981p1144
2659.8E28490868l07808l63961o24275l54156l24898p18155q35381p06367k82021m57191
2669.4E23516655k17361j40000o3858m09927p49626l57552o96487n04227l79028k85569
2679E19713020l61442n76172k44675j67427j49536r45625q22068j23024l44543n23682
$$ plain form
2612.5 555316582 554539070 553825569 553381195 552625351 552450104 551926804 551142578 550540314 550236435 549562187
2622.1 549562187 548714561 548348198 547673569 547264671 546825104 546396446 545870934 545410995 545068054 544184418
2631.8 544184418 543544693 542711868 542184982 541730080 540713158 539926758 539516335 539431458 539280510 539099846
2641.4 539099846 538388023 537625046 536762657 535631676 535086670 534701958 534366455 533689117 533341827
2650.1 533341827 533223305 532626038 531814919 531138573 530937042 530184822 529577179 529095993 528562012 528490868
2659.8 528490868 528183060 527819099 527194824 526840668 526515770 525797615 524962234 524255867 523973846 523516655
2669.4 523516655 523299294 523159294 523095436 522685509 521935883 521578331 520881844 520377617 519998589 519713020
2679 519713020 519351578 518775406 518530731 518363304 518213768 517268143 516446075 516323051 515978508 515454826
2688.7E15454826n61866o04134p93762j51863K34947n7602n15099p63893o90193p47833
2698.3E10803528k68059m33311m41437k12631j90125j26724o54602l80364k63557m77524
2708E07355194m03023m16755o19965n88036o5841k42272k77824j53198q0262m34761
2717.6E04073257q85238n21240k91748l5019k07634J4190J35346k70386l17001q01087
2727.3E00893440o86874m26102n18799m94690k48336k82097k73285J68342j16386J59225
2736.9D98174438L2654o36520n48630m84924j93215k50396l78533o2561L36495J94511
2746.5D96183319o6185m56161p24221m49638p90291j83411J3276o85196j93253K91519
2756.2D92939758O2561m90455k9412k4376p13005p59964n14793j89476k97852p591
$$ plain form
2688.7 515454826 514892960 514288826 513495064 513343201 513578148 513520546 513005447 512241554 511551361 510803528
2698.3 510803528 510535469 510102158 509660721 509448090 509257965 509131241 508476639 508096275 507832718 507355194
2708 507355194 506952171 506535416 505915451 505327415 505261574 505019302 504741478 504588280 504508018 504073257
2717.6 504073257 503188019 502666779 502375031 502340012 502132378 502146568 502281914 502011528 501694527 500893440
2727.3 500893440 500206566 499780464 499261665 498766975 498518639 498236542 497963257 498131599 498015213 498174438
2736.9 498174438 498207092 497570572 497021942 496537018 496343803 496093407 495714874 495652313 495988808 496183319
2746.5 496183319 496117134 495660973 494936752 494487114 493696823 493513412 493526688 492841492 492648239 492939758
2756.2 492939758 493002319 492511864 492482452 492458076 491745071 490985107 490470314 490280838 489982986 489975395
2765.8D89975395l43M2839k18506q33473n70145o90803m33121l22075n05981l68615
2775.5D86075172k32238j46332l45078j58615l51562m02985n61943r92241o23627j87149
2785.1D82073402k61840l81775J52015l85475q29963o05011j058274q10089n12810
2793.8D77380180n14793o28052m18701k82135k65923j89666q02956q22105j038208
2802.5D72417641j212082r19647o94619l19824m25911k80533m01191p11632p54471
2811.2D66697731r70612j094512j080361j081505r01108m34608n12695m81568n78499
2819.8D59562263o94694o88057j101685r89799j143189r70039o72836o62995n97000
2828.5D52041969p76481n77088r85145j377411j452217j193924j083451j343078q12721
$$ plain form
2765.8 489975395 489975052 490017891 489799385 488965912 488395767 487704964 487271843 486949768 486443787 486075172
2775.5 486075172 485842934 485696602 485351524 485192909 484841347 484438362 483876419 482884178 482260551 482073402
2785.1 482073402 481811562 481429787 481581802 481196327 480366364 479761353 478703079 477892990 477380180
2793.8 477380180 476865387 476237335 475818634 475536499 475270576 475080910 474277954 473455849 472417641
2802.5 472417641 471205559 470285912 469591293 469271469 468845558 468565025 468163834 467452202 466697731
2811.2 466697731 465727119 464632607 463552246 462470741 461569633 461135025 460622330 460140762 459562263
2819.8 459562263 458867569 458179512 457077827 456088028 454944839 453974800 453301964 452638969 452041969
2828.5 452041969 451265488 450688400 449703255 448325844 446873627 445679703 444596252 443253174 442440453
2837.2D42440453q59909q85773j015549j615028j876602j571503j315193k171288k321129
2845.9D28808479k126503j911239j961060k077141j353416j443100j220932j032410
2853.6D15682678r33342l13225l68919l98254n3788M4938l28064o0006j12419n61294
2863.2D12598305p47605r17549p07435j104546j043968q64563q78029n98183o91909
2871.9D05044518o76117p03850m99802p96203r06678o21109q46405p24640n56144o18554
2881.6C98095016q75473n80520n69344q57658q80242j174736j089210j242256r80225
2890.2C89845352q07762p48978o38466j014022m72489o81305j086616r32999j077041
2898.9C82385674j064606j015358m52233M540J24969n83877j197548q16498n10750
$$ plain form
2837.2 442440453 441580544 440694771 439679222 438064194 436187592 434616089 433300896 431129608 428808479
2845.9 428808479 426681976 424770737 422809677 420732536 419379120 417936020 416715088 415682678
2853.6 415682678 414749336 414436111 414067192 413668938 413615150 413660088 413332024 413272018 413159599 412598305
2863.2 412598305 411850700 410933151 410225716 409121170 408077202 407212639 406334610 405736427 405044518
2871.9 405044518 404368401 403664551 403164749 402368546 401461868 400840759 399994354 399269714 398713570 398095016
2881.6 398095016 397219543 396639023 396069679 395212021 394331779 393157043 392067833 390825577 389845352
2890.2 389845352 389037590 388288612 387650146 386636124 386163635 385482330 384395714 383462715 382385674
2898.9 382385674 381321068 380305710 379853477 379858017 379982986 379399109 378201561 377385063 376874313
2907.6C76874313n95436j283951j177864q33320q97522q13484r94530j170921j327134
2916.3C67780151j221733j454925j646424r66835n58128j027489j146431n94635j63498
2925C59000053k5215p28073p38830O485M33158K22512l33596L38021L37105L02810
2934.6C58814430Q85773N30090K94304L20740O34155M97055K51427N68581P42073O37436
2944.2C64176064Q77761J160622M33731L44200N36423N23834P82013P41081Q81577
2952.9C70457306N69496P5836N4360N77964L19748J15166J021195N66330K56080M55055
2962.6C74468536P5798L65334R85298P79572N06286Q76046M75578K05879L26500O91147
2972.2C79755974J159935P29255L51906n8593L76510R12857N73120Q24509Q50678M02908
$$ plain form
2907.6 376874313 376278877 374994926 373817062 372983742 372086220 371272736 370278206 369107285 367780151
2916.3 367780151 366558418 365103493 363457069 362490234 361932106 360904617 359758186 359163551 359000053
2925 359000053 358974838 358246765 357507935 357514420 357947578 358170090 357836494 358174515 358511620 358814430
2934.6 358814430 359700203 360230293 360524597 360845337 361479492 361976547 362227974 362796555 363538628 364176064
2944.2 364176064 365053825 366214447 366648178 366992378 367528801 368052635 368834648 369575729 370457306
2952.9 370457306 371026802 371102638 371156998 371734962 372054710 372169876 373191071 373757401 374013481 374468536
2962.6 374468536 374544334 374909668 375894966 376674538 377180824 378056870 378532448 378738327 379064827 379755974
2972.2 379755974 380915909 381645164 381997070 381938477 382314987 383227844 383800964 384625473 385476151 385879059
2981.8C85879059m5777l25012m5395L90816L76396M20838L19366k2468M15496L89672
2991.5C87752991k55127l79830k05230n3597O9847j53579m93699l20968j55831R3537
3001.1C85898514k77825q48999p97119o69708l07541m04091k82936k09427l72391m58183
3010.8C81270294p80983n08270o43959o43349o59179j097184q05244m67224l80936
3019.5C75283966m44412j04141l60909r45282o66008q48312j208954r60083o11000
3028.1C69134865o40412m03175k19726n38369q49266j060982q76426p98226r19036
3036.8C62829247r46198n79910m19274o18095q36296q46748l13874r33494j231308
3045.5C56104050j007424j038475k99721n23300n14717j81122o10695j143875j315002
$$ plain form
2981.8 385879059 385833282 385508270 385462875 385853691 386230087 386650925 386970291 386947823 387363319 387752991
2991.5 387752991 387497864 387118034 386912804 386859207 386929054 386775475 386281776 385960808 385804977 385898514
3001.1 385898514 385620689 384771690 383974571 383304863 382997322 382593231 382310295 382100868 381728477 381270294
3010.8 381270294 380489311 379981041 379337082 378693733 378034554 376937370 376132126 375664902 375283966
3019.5 375283966 374839554 374735413 374374504 373429222 372763214 371914902 370705948 369745865 369134865
3028.1 369134865 368494453 368091278 367871552 367333183 366483917 365422935 364546509 363748283 362829247
3036.8 362829247 361883049 361303139 360883865 360265770 359429474 358582726 358268852 357335358 356104050
3045.5 356104050 355096626 354058151 353758430 353235130 352720413 352539291 351928596 350784721 349469719
3054.2C49469719q61816q28667q29811r16100p57561m37469l57018m48493o60820k29607
3063.8C43142357q34084j189880q46787j341018j006623n62782o90651m37774J93214
3072.5C36425972j61171q35304p07016p31354q58307q78219p14951p51267q04443m71115
3082.1C29512825j90353p66220j042710l17383p00302r19189n36576m47540o77376
3090.8C23915176r09347l50876n15289o56052o99844q14419o38447p63760o15463q32271
3100.5C17119408o74286n27325l68576m95834r80606m91963q19568p57866n79510p15294
3110.1C10708580k32544m68979m49219m31366o06079q29963q67176j048928j313038
3118.8C04461288m26425p8564l16773o38637p41787q99964j168670p49684p80410q17795
$$ plain form
3054.2 349469719 348607903 347779236 346949425 346033325 345275764 344838295 344481277 344032784 343371964 343142357
3063.8 343142357 342308273 341118393 340271606 338930588 337923965 337361183 336670532 336232758 336425972
3072.5 336425972 336264801 335429497 334722481 333991127 333132820 332254601 331539650 330788383 329983940 329512825
3082.1 329512825 329322472 328556252 327513542 327196159 326495857 325576668 325040092 324592552 323915176
3090.8 323915176 323005829 322654953 322139664 321483612 320783768 319969349 319330902 318567142 317951679 317119408
3100.5 317119408 316445122 315917797 315549221 315053387 314072781 313580818 312761250 312003384 311423874 310708580
3110.1 310708580 310476036 310007057 309557838 309126472 308520393 307690430 306823254 305774326 304461288
3118.8 304461288 304034863 303956299 303639526 303000889 302259102 301359138 300190468 299440784 298660374 297842579
3128.4B97842579o72894m35276n19504q51307p71961n23720P4100n62954j166572p49035
3138.1B91663456n64423m93431j043358q95271m63734o52904n18437n44738o29082
3146.8B85858078p49950r32732n33009m16126r80186j052609p57713m61216n32398
3155.4B79442139q38318p22618n95265n07641o54525j031685j159497n57765k77825
3164.1B73097000o58569q29487q99525q2092l78075j356239q95462o79855n29328k33459
3173.8B66554909j67713r24645j010971m26044q88539n57937l80516n75066o68144
3182.4B60955334q70037o35929o23589n56545m91143n38597p79380l74146m45652j179981
3192.1B54460335o96106o73409o62632m51011k99130j82762o46343o35777n71937m92745
$$ plain form
3128.4 297842579 297169685 296734409 296214905 295363598 294591637 294067917 294142017 293579063 292412491 291663456
3138.1 291663456 291099033 290605602 289562244 288666973 288203239 287550335 287031898 286487160 285858078
3146.8 285858078 285108128 284175396 283642387 283226261 282246075 281193466 280435753 279974537 279442139
3155.4 279442139 278603821 277881203 277285938 276778297 276123772 275092087 273932590 273374825 273097000
3164.1 273097000 272438431 271608944 270709419 270627327 270249252 268893013 267997551 267317696 266788368 266554909
3173.8 266554909 266387196 265462551 264451580 264025536 263136997 262579060 262198544 261623478 260955334
3182.4 260955334 260085297 259449368 258825779 258269234 257778091 257239494 256460114 256085968 255640316 254460335
3192.1 254460335 253764229 253090820 252428188 251977177 251678047 251495285 250848942 250213165 249641228 249148483
3201.7B49148483p88078o43806k99130p50732o81534n36308m00773p42797r90715m53644
3211.4B42860966k2526m2095o61907p71962o20403m11339l16791o04153q18691o19488
3221B37971611l41148o12088l57399m36725m57459k30121p69234o26507m86793l77312
3230.7B33276825m56791p53288n73120n77107p66125o28738L30982L5057r78946p18670
3240.3B28190079j46656k7352l69663k85702l63617n57499o37950j026745q71887k23847
3249.9B23679161K3651n13210l79734m0989l57304o55059n86033J8901j98955o47450
3259.6B20342979n26809k64130j42670n47123q13217n23758j64260l15571j26000k82249
3269.2B16637192o60782j6098J07174k59209p21092o60381k07844j96381j91192n98488
$$ plain form
3201.7 249148483 248360405 247716599 247417469 246666737 245985203 245448895 245048122 244305325 243314610 242860966
3211.4 242860966 242838440 242796345 242134438 241362476 240742073 240330734 240013943 239409790 238591099 237971611
3221 237971611 237630463 237018375 236660976 236224251 235766792 235536671 234767437 234140930 233654137 233276825
3230.7 233276825 232820034 232066746 231493626 230916519 230150394 229521656 229852638 229887695 228908749 228190079
3240.3 228190079 228043423 228016071 227646408 227360706 226997089 226439590 225801640 224774895 223903008 223679161
3249.9 223679161 223702812 223189602 222809868 222768879 222411575 221756516 221170483 221189384 220990429 220342979
3259.6 220342979 219816170 219552040 219409370 218862247 218049030 217525272 217361012 217045441 216919441 216637192
3269.2 216637192 215976410 215960312 216067486 215808277 215087185 214426804 214218960 214022579 213831387 213232899
3278.9B13232899n01347j51710k81811k46391l56636l8929m1752r03569o21566k1916
3288.5B10067272k36339j97812k14843j86959l13034m88472l15551j81103K58274j77174
3298.2B08014259n20134j9416j56327m32434n97114l80974k84844l43856n8861K09236
3307.8B05429535k08283q76789l80821l35655m99592l95870m55513J89667O1016m83761
3317.4B02043934k38209l21503j003589n65548J22318m18205p32842p36789j88561
3326.1A97961006o9828m30927j48354m61845r94473j017933l64131j25542m19579n02662
3335.8A93425732n89047l53298k62394k94380o78349k73761j2799p60421k67220k32925
3345.4A89701138m53053l12824l48702K5940k42882n11856m38022k77653q8406j37062
$$ plain form
3278.9 213232899 212731552 212579842 212298031 212051640 211695004 211656075 211614323 210710754 210089188 210067272
3288.5 210067272 209830933 209633121 209418278 209231319 208918285 208429813 208114262 207933159 208191433 208014259
3298.2 208014259 207494125 207474709 207318382 206885948 206288834 205907860 205623016 205279160 205220299 205429535
3307.8 205429535 205221252 204344463 203963642 203627987 203128395 202732525 202277012 202466679 202527695 202043934
3317.4 202043934 201805725 201484222 200480633 199915085 200037403 199619198 198886356 198149567 197961006
3326.1 197961006 197891178 197460251 197311897 196850052 195855579 194837646 194473515 194347973 193928394 193425732
3335.8 193425732 192836685 192483387 192220993 191926613 191248264 190974503 190961704 190201283 189934063 189701138
3345.4 189701138 189248085 188935261 188586559 188612499 188369617 187857761 187419739 187142086 187053680 186916618
3355.1A86916618l51219m01745k37846l81851k95716o7329O0234j85261k48146k03132
3364.7A84604607m53015J86577J93062k33822n06153q54778l15190r1209j44425j87606
3374.3A82198048o8646q3198n53418j77383K11315m3297l69491k34242J91994K17037
3384A81288719j22814n29518l66802k4701L357n6285p0439k48833n05504j02043K91252
3394.6A79556389J13888K18372L25546j75266l81489k82650J88294K44712o87580m31671
3404.2A78688545J98937J27086J72253K32410K97604N3692P4901n378r3766J40934
3413.9A79887218l83319o04096k8190M08763N42984N45063K10629j93062J29070L18394
3423.5A80833454O4545J44634M54464J39828l80459Q9397O97804L99685J94759L47157
$$ plain form
3355.1 186916618 186565399 186163654 185925808 185543957 185248241 185180912 185241146 185055885 184807739 184604607
3364.7 184604607 184151592 184338169 184531231 184297409 183791256 182936478 182621288 182530079 182385654 182198048
3374.3 182198048 182129402 182046204 181492786 181315403 181526718 181483421 181113930 180879688 181071682 181288719
3384 181288719 181165905 180636387 180269585 180244884 180248241 180191956 180121517 179872684 179367180 179265137 179556389
3394.6 179556389 179670277 179888649 180214195 180038929 179657440 179374790 179563084 179807796 179120216 178688545
3404.2 178688545 178887482 179014568 179186821 179419231 179716835 179770527 179845428 179840050 179746284 179887218
3413.9 179887218 179503899 178899803 178871613 179280376 179823360 180368423 180579052 180385990 180515060 180833454
3423.5 180833454 180897999 181042633 181497097 181636925 181256466 181345863 182043667 182443352 182638111 182985268
3433.2A82985268j39485k10476N57137O43272P2098j47839j39255L50399J001015M21257
3442.8A85393391J59778M26007L40614K91595M7856Q10051N76191m6406O77128O34422
3452.5A89310627K90108K03247M51813O64367L76072J92261L98598J046657O12087
3461.1A93545837J78891N14373N13058N69763M86737M70008M68026M58355L51429O25286
3470.8A98181763J065769M56276J00746L95679O32687P27635M38938K53219Q88253
3479.5B03140965Q71009q716L68213P36847Q87051J039925O31122Q30116Q55942M78382
3489.1B09830856N21946O40278N41382N30014M94156M60606J049900J301708Q20713
3497.8B16191559L00045K58522R13277J481990Q41389J58634N29862L92208R25274
$$ plain form
3433.2 182985268 182845783 182635307 183192444 183835716 183907814 183759975 183620720 183971119 184972134 185393391
3442.8 185393391 185553169 185979176 186319790 186611385 186659241 187469292 188045483 187999077 188676205 189310627
3452.5 189310627 189600735 189803982 190255795 190920162 191296234 191488495 191887093 192933750 193545837
3461.1 193545837 193724728 194239101 194752159 195321922 195808659 196278667 196746693 197205048 197556477 198181763
3470.8 198181763 199247532 199703808 199804554 200200233 200832920 201560555 201999493 202252712 203140965
3479.5 203140965 204011974 204003258 204371471 205108318 205995369 207035294 207666416 208496532 209352474 209830856
3489.1 209830856 210352802 210993080 211534462 212064476 212558632 213019238 214069138 215370846 216191559
3497.8 216191559 216491604 216750126 217663403 219145393 219986782 220145416 220675278 221067486 221992760
3506.5B21992760J082020N55896Q17871Q16727J143570Q71696K91901O14243R58156
3515.1B29144840R73416R13295J132756Q55255P37381Q25920J110039Q51249k43473
3523.8B36300678O99120J710872J524659P53784N96752R06944J056385J141262Q15792
3532.5B45506248P53880P39555J767559R04293k77233J412354J567802J839066J261253
3541.2B55474777R45034J364498P75986J086598J239452J807575Q37135Q75588J107693
3549.9B65514336J182499K024383L78304J709861J538430Q91418J674729Q68663J796093
3558.5B77578716J436005J406193J189460J543446J810932P61471K709866J573619
3566.2B90009708J554108P27081j2531K807388J456509J744347J768589J650505J598034
$$ plain form
3506.5 221992760 223074780 223630676 224448547 225265274 226408844 227280540 227572441 228186684 229144840
3515.1 229144840 230118256 231031551 232164307 233019562 233756943 234582863 235692902 236544151 236300678
3523.8 236300678 236999798 238710670 240235329 240989113 241585865 242492809 243549194 244690456 245506248
3532.5 245506248 246260128 246999683 248767242 249671535 249394302 250806656 252374458 254213524 255474777
3541.2 255474777 256419811 257784309 258560295 259646893 260886345 262693920 263531055 264406643 265514336
3549.9 265514336 266696835 268721218 269099522 270809383 272347813 273239231 274913960 275782623 277578716
3558.5 277578716 279014721 280420914 281610374 283153820 284964752 285726223 288436089 290009708
3566.2 290009708 291563816 292290897 292278366 295085754 296542263 298286610 300055199 301705704 303303738
3574.9C03303738R00612J758632J510735K625656K082100J411896K066535K074357
3582.6C17734261J904125J001148L181343K298279N07088K203559Q3123K087173K712212
3591.3C33712311K916984K026139J645050K879181k4643K380752L199845J733665L558655
3600C54027939J657219J007499K409707K406768K357598K740631K258148k78969L089104
3608.7C71675644J708908Q74672O141396K375640J66054M558907J323127L250237L779831
3617.4C95854416J178741K496186J264228J624184L070297L225556L257217L814011
3625.1D15784836K961502K380409O415062K497063p520867M064179N247879N710373
3632.8D37540436L563804J35956K469139L794175L339614J763688K896957L574333
$$ plain form
3574.9 303303738 304204350 305962982 307473717 310099373 312181473 313593369 315659904 317734261
3582.6 317734261 319638386 320639534 323820877 326119156 326626244 328829803 328912926 331000099 333712311
3591.3 333712311 336629295 338655434 340300484 343179665 343155022 345535774 348735619 350469284 354027939
3600 354027939 355685158 356692657 359102364 361509132 363866730 366607361 368865509 368586540 371675644
3608.7 371675644 373384552 374259224 380400620 382776260 382942314 387501221 388824348 392074585 395854416
3617.4 395854416 397033157 399529343 400793571 402417755 405488052 408713608 411970825 415784836
3625.1 415784836 418746338 421126747 427541809 430038872 422518005 426582184 431830063 437540436
3632.8 437540436 441104240 441240196 443709335 447503510 450843124 452606812 455503769 459078102
3640.5D59078102K786331K393074K281418L497315M306373O480675J235886k805825
3648.2D79253349N618477Q88062p53632J357689N946236N630645M532891N832062m926796
3656.9E03378983J992263N399475K608719L642922J563720K855416J880760K039413
3664.6E25361671L020592J287842M820557L203926J52J509590l542289L148575P547149
3673.3E46357765P890930K52190j3342438L155251Q258819M922028j429596J068420
3681E57133369L121262K115784J824150J235924P42607M168281P642403o369133m120712
3689.7E67493935P947349l859100q05130N386658J604156K235107J342469l89633Q71467
3698.4E81827278M58946K173119K784042l266792j438484L721542J585121Q42018M15955
$$ plain form
3640.5 459078102 461864433 464257507 466538925 470036240 474342613 480823288 482059174 479253349
3648.2 479253349 484871826 485759888 485006256 486363945 492310181 497940826 502473717 508305779 503378983
3656.9 503378983 505371246 510770721 513379440 517022362 518586082 521441498 523322258 525361671
3664.6 525361671 528382263 529670105 534490662 537694588 537694740 539204330 535662041 538810616 546357765
3673.3 546357765 554248695 554500885 541158447 544313698 552572517 557494545 556064949 557133369
3681 557133369 560254631 562370415 564194565 565430489 566173096 570341377 577983780 571614647 567493935
3689.7 567493935 575441284 571582184 570777054 576163712 577767868 580002975 581345444 580955811 581827278
3698.4 581827278 582286224 584459343 587243385 583976593 582538109 586259651 587844772 588686790 589102745
3707E89102745K853966N429611o818581K656098N153656j3759270L877030N614204
3714.8E94109459J254654P05643K004165J727486k531014J180764N466880k022476
3722.5F01895561l697090M862938J219826q36983k596397o36597M323769J328620M113961
3731.2F09977608l908348o105500J0699730R05457p064934R35249K74926o82297J798859
3739.8F06830750L465995l525276L070793J2226715r746666j6942176R563102N948639
3747.5F10891876N868721k467232r410781J1133079m595756q386727N695458M436607
3755.3F13165245L895493m547730J704407N399589p727508k109909M483146K112046
3763F16374779k43607L073082j938476m808884L372421N215569Q36563r369240J247826
$$ plain form
3707 589102745 591956711 597386322 590567741 593223839 598377495 584618225 588495255 594109459
3714.8 594109459 595364113 596069756 598073921 599801407 597270393 598451157 603918037 601895561
3722.5 601895561 598198471 603061409 604281235 603444252 600847855 600211258 604535027 605863647 609977608
3731.2 609977608 606069260 599963760 610663490 611568947 604504013 605439262 605714188 605031891 606830750
3739.8 606830750 610296745 606771469 609842262 622068977 612322311 595380135 604943237 610891876
3747.5 610891876 616760597 614293365 604882584 616015663 611419907 603033180 608728638 613165245
3755.3 613165245 617060738 612513008 614217415 619617004 611889496 609779587 614262733 616374779
3763 616374779 616131172 619204254 617265778 612456894 615829315 621044884 621881447 612512207 613760033
3771.7F13760033L781623P03011Q36983o19354J202621P35779L030243R06715p328873
3780.3F17008781J705323J415252Q61817K493896k656593j828537N99518R99260J209793
3789F21808510J39198k37923L06130P01446n38749J160469L475532l106842m396553
3797.7F19311218J473236L912163P226982m908027j1918145M074746K926330N097847
3805.4F27196350O273346j0284347m974976M770126J456337k12974J263275M73747
3813.1F25960884Q40721N491715j056710j3331718M078484N514373M488411J227837
3820.8F33213997j5302773J850853M907456J304054K543945Q55408m864807m63944
3828.6F24044189K802010L314018J044655q250313K455025P760811n093117j354790
$$ plain form
3771.7 613760033 617541656 618244667 619081650 618462296 619664917 620400696 623430939 624337654 617008781
3780.3 617008781 618714104 620129356 620991173 623485069 620828476 618999939 619599457 620598717 621808510
3789 621808510 621947708 621709785 622015915 622717361 622178612 623339081 626814613 623707771 619311218
3797.7 619311218 620784454 624696617 631923599 627015572 615097427 619172173 622098503 627196350
3805.4 627196350 633469696 623185349 618210373 622980499 624436836 624223862 625487137 625960884
3813.1 625960884 626801605 632293320 631236610 617904892 621983376 627497749 631986160 633213997
3820.8 633213997 617911224 619762077 624669533 625973587 628517532 629372940 624508133 624044189
3828.6 624044189 626846199 630160217 631204872 622954559 625409584 633170395 628077278 626722488
3836.3F26722488P945443p674065n704498P469368m485627q98590O830140j905747
3844F28298912l806038K453575J225357m21638J607551j43852K440758O105728n883102
3852.7F31877251R10682j3944778l39203J0288353j063538j806411J882400J684303
3860.4F29489059K548142m647446L166O531487m843369o310272L369560N070610N822526
3869.1F37033463p813988r001999M246483N615997M124565q703918l65677L962746
3876.8F29097672k32659K180328L982506m821205p482529N138207J892509J295929
3884.5F31050758N736275j2185059j34506L921280M24996M248161r78203p838020J075516
3893.2F25321198L442306j293869P46193J385002K214508K420654r767189L799096
$$ plain form
3836.3 626722488 634667931 626993866 621289368 628758736 624273109 623374519 630204659 628298912
3844 628298912 624492874 626946449 628171806 627750168 629357719 629213867 631654625 637760353 631877251
3852.7 631877251 632787933 618843155 618503952 628792305 627728767 625922356 627804756 629489059
3860.4 629489059 632037201 627389755 627392921 633924408 629081039 622770767 626140327 631210937 637033463
3869.1 637033463 629219475 620217476 624463959 630079956 634204521 625500603 625134926 629097672
3876.8 629097672 628865013 631045341 635027847 630206642 622724113 627862320 629754829 631050758
3884.5 631050758 636787033 624601974 624467468 628388748 628813744 633061905 632083702 624245682 625321198
3893.2 625321198 628763504 627469635 628215828 629600830 631815338 634235992 624468803 628267899
3900.9F28267899J963005n941697M636193l225556j261596J578445J257897K156600
3908.6F29431190r43222m46319m18129L60451k7886j031265J267395K846374j947402
3917.3F29091187l977623L557586J42861l521920K523880J950074J080513k190934
3925F28655624l705864J189309K110138J702194r29451p07054J897316k437401k121620
3933.7F25653191J024932j29623N76477N55687o32362m0398k61574J008988J091995
3942.3F28847313l025551k09274J374664J31569P16286j642800L37601Q55103j683007
3951F25701904J474228O64597j438332p72896L95165O06994l91235K97775l96385J06240
3960.7F26248055K53982j116791L05863K01225j19438L15361k16370L70026P22427
$$ plain form
3900.9 628267899 630230904 624289207 628925400 625699844 624438248 626016693 627274590 629431190
3908.6 629431190 628487968 628041649 627623520 627983971 627956085 626924820 628192215 631038589 629091187
3917.3 629091187 625113564 628671150 628814011 625292091 627815971 629766045 630846558 628655624
3925 628655624 624949760 626139069 628249207 629951401 629021950 628314896 630212212 627774811 625653191
3933.7 625653191 626678123 626548500 627124977 627680664 627048302 627007904 626746330 627755318 628847313
3942.3 628847313 625821762 625612488 626987152 627118721 627835007 626192207 626529808 627384911 625701904
3951 625701904 627176132 627840729 626402397 625629501 626024666 626631660 626240425 626538200 626141815 626248055
3960.7 626248055 626502037 625385246 625691109 625892334 625772896 626088257 625871887 626241913 626964340
3969.3F26964340k06070q5563k12212j73645J20544r20715l42293J84975K43912O64291
3979F26237564K17819j3199o4010j02654n54733M11720M98047n33409k82593m98695
3988.6F25315857L44467N17197j5145m42466J62506R75380j006508o36444M48456L26042
3998.3F25989342K74162j97182
4000.2F26066322
$$ plain form
3969.3 626964340 626758270 626672707 626460495 626286850 626407394 625486679 625144386 625329361 625573273 626237564
3979 626237564 626455383 626442184 626378174 626275520 625720787 626132507 626630554 626097145 625814552 625315857
3988.6 625315857 625660324 626177521 626162376 625719910 625882416 626857796 625851288 625214844 625663300 625989342
3998.3 625989342 626263504 626066322
4000.2 626066322
##END=$$ End of the data block
