##TITLE=$$ Begin of the data block
##JCAMP-DX=5.00 $$ ACD/SpecManager v 10.08
##SPECTROMETER/DATA SYSTEM=Varian
##DATE=15 Jan 2013 09:53:30
##DATA TYPE=INFRARED SPECTRUM
##DATA CLASS=XYDATA
##ORIGIN=
##OWNER=
##NPOINTS=3735
##FIRSTX=399.26403809
##LASTX=4000.35498047
##MAXX=4000.35498047
##MINX=399.26403809
##MAXY=69.65702057
##MINY=17.89335442
##XFACTOR=1.0000000000
##YFACTOR=0.000000100000000
##FIRSTY=37.06964874
##DELTAX=0.96440572
##XUNITS=1/CM
##YUNITS=TRANSMITTANCE
##XYDATA=(X++(Y..Y))
399.3C70696487L473282l227920n973130Q77381Q411255k321778n701980l60184j919899
$$ 370696487 374169769 370941849 364968719 365846100 374257355 371935577 366233597 365873413 363953514
407.9C63953514R05724K222747j148071k184028K75878j273117P69654L867645j379547
$$ 363953514 364859238 367081985 365933914 363749886 364025764 362752647 363522301 367389946 366010399
416.6C66010399j602631K541085n953560m138413M5700L266259P684440k138862n692177
$$ 366010399 364407768 366948853 360995293 356856880 356902580 360168839 367853279 365714417 360022240
425.3C60022240k615853N06707O037368K012711p85294L538056M1275l663521k824669
$$ 360022240 357406387 357913094 363950462 365963173 365177879 368715935 368757210 365093689 362269020
434C62269020j625366k075195k202073J768723K792320M31404J653099J404915J412621
$$ 362269020 360643654 358568459 356366386 358135109 360927429 361358833 363011932 364416847 365829468
442.7C65829468j046334p884864l612633L82118M326477L981514M92821J551247k72255
$$ 365829468 364783134 356898270 353285637 353667755 357994232 361975746 362468567 364019814 363747559
451.3C63747559K0141l44085J14288O88667j876907K65426k272682j085472J00670
$$ 363747559 363767700 363423615 363537903 364226570 362349663 362615089 360342407 359256935 359357605
460C59357605m60587J544838p25898k893410k692452j288108l60604K591172j9341
$$ 359357605 358897018 360441856 359715958 356822548 354130096 352841988 352481384 355072556 355053215
468.7C55053215J60790J266670n528145j410332L203354J518364j386490l539390K800102
$$ 355053215 355214005 356480675 350952530 349542198 352745552 354263916 352877426 349338036 352138138
477.4C52138138j382218n923271k776298K266617M848899J052971k571602k897682
$$ 352138138 350755920 344832649 342056351 344322968 349171867 350224838 347653236 344755554
485.1C44755554k131920j269989K897988M504471P55615j116371J17378j370278l456420
$$ 344755554 342623634 341353645 344251633 348756104 349511719 348395348 348512726 347142448 343686028
493.8C43686028l0747K188187L97072j563569p31086P8048m10842k44637l279610k19841
$$ 343686028 343655281 345843468 346240540 344676971 343945885 344023933 343613091 343368454 340088844 339869003
503.4C39869003K106552k074089l992462M46854O070442L067932j691055k239952j77193
$$ 339869003 341975555 339901466 335909004 336355858 342426300 345494232 343803177 341563225 341386032
512.1C41386032o75354k866669n09758L99094l49846P95479L02467o5689j35154j551781
$$ 341386032 340710678 337844009 337334251 337733345 337383499 338178978 338481445 338415756 338280602 336728821
521.7C36728821k202110j172829j212807j675148J889496L509140p18842j286048K73399
$$ 336728821 334526711 333353882 332141075 330465927 332355423 335864563 335145721 333859673 334133072
530.4C34133072m51393l4638p26280p96509n53131m09660j015701p23305K155495J223449
$$ 334133072 333681679 333647041 332920761 332124252 331571121 331161461 330145760 329422455 331577950 332801399
540.1C32801399K27471j081429k033501J84250k80609j667633j432991J62773R95293
$$ 332801399 333028870 331947441 329913940 330098190 329817581 328149948 326716957 326879730 327875023
548.7C27875023N08156j046410j109352q78105l013840j173439P43675n8326j02044
$$ 327875023 328383179 327336769 326227417 325349312 322335472 321162033 321905708 321847382 321745338
557.4C21745338R1553J4725O72684J000404p93419k51694n50422n92766J568680N02929
$$ 321745338 321836891 321851616 322524300 323524704 322731285 322479591 321929169 321336403 322905083 323408012
567.1C23408012o49795m83666P73926J534119N77354j438217k228317j022339j20583
$$ 323408012 322758217 322274551 323048477 324582596 325159950 323721733 321493416 320471077 320350494
575.8C20350494J981469J102256j066055j475143n3368J179390j67236k97051j03493
$$ 320350494 322331963 323434219 322368164 320893021 320839653 322019043 321851807 321554756 321451263
584.4C21451263N95894n84259r89647Q10967Q14781J672173P25174m93165j303596
$$ 321451263 322047157 321462898 320473251 321284218 322098999 323771172 324496346 324003181 322699585
593.1C22699585r20906J434402J335450K55737j389237p76901j67732P55043J417046
$$ 322699585 321778679 323213081 324548531 324804268 323415031 322638130 322470398 323225441 324642487
601.8C24642487j712227n67704K26250j824379k78091J356125P8354j062546k41432
$$ 324642487 322930260 322362556 322588806 320764427 320486336 321842461 321920815 320858269 320616837
610.5C20616837n53437p30552j00918L8776j147976j096878N34287q79956m84981Q62675
$$ 320616837 320063400 319332848 319231930 319270706 318122730 317025852 317560139 316680183 316195202 317057877
620.1C17057877O22024L88088M53606J458397Q12778L58811J083755j67656j54342
$$ 317057877 317679901 318067989 318521595 319979992 320792770 321151581 322235336 322067680 321913338
628.8C21913338K224350J841430R05495J750641J402969R65081P45468R55810J281815
$$ 321913338 324137688 325979118 326884613 328635254 330038223 331003304 331748772 332704582 333986397
637.5C33986397J498985J915550J040879O65130J725426K390594R95598l29475L96690
$$ 333986397 335485382 337400932 338441811 339106941 340832367 343222961 344218559 343889084 344285774
646.2C44285774L16773J54304Q50563J258850J347657R30404L79830O5612P57561L36266
$$ 344285774 344602547 344756851 345607414 346866264 348213921 349144325 349524155 349589767 350347328 350683594
655.8C50683594n31807M32243n54123r21478P93152Q3923j038055m41933n66826r08775
$$ 350683594 350151787 350584030 350029907 349108429 349901581 349985504 348947449 348505516 347938690 347029915
665.4C47029915R62944M221496M155808m987297r95407J081238N87844K91024M88472
$$ 347029915 347992859 352214355 356370163 351382866 350387459 351468697 352056541 352347565 352836037
674.1C52836037P07092J370735P80411O31523J165123R18045O92940Q69942J567039
$$ 352836037 353543129 354913864 355694275 356325798 357490921 358408966 359101906 359971848 361538887
682.8C61538887K190132J558952j44081j67923J367073J770134Q11997m89426m84428
$$ 361538887 363729019 365287971 365143890 364975967 366343040 368113174 368925171 368435745 367951317
691.5C67951317P76062J144829J062240J367188O68754J40114J81999k11296J31531
$$ 367951317 368727379 369872208 370934448 372301636 372970390 373110504 373292503 373081207 373212738
700.2C73212738R37309Q98514J42212N73273J164436R47800N68886p7019O32973O64901
$$ 373212738 374150047 375048561 375190773 375764046 376928482 377876282 378445168 378368149 379001122 379666023
709.8C79666023J99433M38499L32375J220703J584701J440354J248131L56483l06091
$$ 379666023 379865456 380303955 380636330 381857033 383441734 384882088 386130219 386486702 386180611
718.5C86180611J04332O08711j29166J99967J099319J679840J247864K35405P71713
$$ 386180611 386284943 386893654 386764488 386964455 388063774 389743614 390991478 391226883 391998596
727.2C91998596J240578J435928J012802N37758J179772R59015k21444N93033J666794
$$ 391998596 393239174 394675102 395687904 396225662 397405434 398364449 398143005 398736038 400402832
735.8D00402832J22376o3630P29866P66488Q7852l18947N67169M34571J204147J237602
$$ 400402832 400525208 400461578 401191444 401957932 402045784 401726837 402294006 402728577 403932724 405170326
745.5D05170326J81847Q10127J110153O99158M41132O75850K20375P74917J131859
$$ 405170326 405352173 406162300 407272453 407971611 408412743 409088593 409308968 410083885 411215744
754.2D11215744K39792J404800K028809J073151O90422R68017O82068Q13293P60460
$$ 411215744 411455536 412860336 414889145 415962296 416652718 417620735 418302803 419116096 419876556
762.8D19876556P84798J888008R10988N05753J122017J383705O36902j248055p99675
$$ 419876556 420661354 422549362 423460350 423966103 425088120 426471825 427108727 425860672 425060997
771.5D25060997J0605K32315L50876l8109J75781J279183L89404q44879J19819n989
$$ 425060997 425071602 425303917 425654793 425616684 425792465 427071648 427461052 426616173 426735992 426730003
781.2D26730003O61164M7111o08101J316529J393623P27692K68821J035347Q62542
$$ 426730003 427391167 427438278 426830177 428146706 429540329 430268021 430536842 431572189 432434731
789.9D32434731M75883L02849j100350o84509m49142O3362n82962l33100J563263O07338
$$ 432434731 432910614 433213463 432113113 431428604 430979462 431042824 430459862 430126762 431690025 432297363
799.5D32297363n80253j418724n76210l71781k182274k658004j522713o31561q67653
$$ 432297363 431717110 430298386 429722176 429350395 427168121 424510117 422987404 422355843 421488190
808.2D21488190n93376j387063j703453j508331k081528j819152j800690j274223o67649
$$ 421488190 420894814 419507751 417804298 416295967 414214439 412395287 410594597 409320374 408652725
816.9D08652725m70695m09203K51541J269455L33710J44119J540756K021065J645012
$$ 408652725 408182030 407772827 408024368 409293823 409627533 409771652 411312408 413333473 414978485
825.5D14978485J708450K799950L850517L200531K534066L373031K998314K834892
$$ 414978485 416686935 419486885 423337402 426537933 429071999 432445030 435443344 438278236
833.3D38278236L160172L481979K541313P71065K111435K763405K901764K539062J279145
$$ 438278236 441438408 444920387 447461700 448232765 450344200 453107605 456009369 458548431 459827576
841.9D59827576J275139J945037K044335N54352J027107J308098Q45527J295204J655465
$$ 459827576 461102715 463047752 465092087 465646439 466673546 467981644 468827171 470122375 471777840
850.6D71777840J710777J543426J812287Q23479P48367M67949J310463K385215J144257
$$ 471777840 473488617 475032043 476844330 477667809 478416176 478884125 480194588 482579803 483724060
859.3D83724060J321335J382713K124520J487541O27556j20011j163559o56128j151085
$$ 483724060 485045395 486428108 488552628 490040169 490667725 490547714 489384155 488728027 487576942
868D87576942l22456q58002o09626l49579j121674j350059l103676j428070q04215
$$ 487576942 487254486 486396484 485786858 485437279 484315605 482965546 479861870 478433800 477629585
876.7D77629585j860389k016716r67064j86043j042786J03150m00238p92923j176300
$$ 477629585 475769196 473752480 472785416 472599373 471556587 471659737 471259499 470466576 469290276
885.3D69290276j302109m58908o32973n98412j012611N92308K36893L56521J374360
$$ 469290276 467988167 467529259 466896286 466297874 465285263 465877571 466114464 466470985 467845345
894D67845345Q25233J569939k4987k10914p93038j181678N1841N837R73396R25598
$$ 467845345 468670578 470240517 470215530 470004616 469211578 468029900 468081741 468087578 469060974 469986572
903.7D69986572J286850J560288J855316J626282J395912J633339R59205K253495J383018
$$ 469986572 471273422 472833710 474689026 476315308 477711220 479344559 480303764 482557259 483940277
912.3D83940277O85310M69933r14383j480865k293778k138977k980728k958984k428971
$$ 483940277 484625587 485095520 484181137 482700272 480406494 478267517 475286789 472327805 469898834
921D69898834k427864k788658k621880j783905l328399m630204m944458m134254m036179
$$ 469898834 467470970 464682312 462060432 460276527 456948128 452317924 447373466 443239212 439203033
929.7D39203033m082489k730674j752320p14759j057854j282768j304322j221466j221084
$$ 439203033 435120544 432389870 430637550 429922791 428864937 427582169 426277847 425056381 423835297
938.4D23835297k341843k120552j242447k19192o07911p84645L63846L12042m39300
$$ 423835297 421493454 419372902 418130455 417911263 417303352 416518707 416882553 417194595 416755295
947.1D16755295j271477n30510j10931J95236N72891j57318J42288L72925Q4267j274109
$$ 416755295 415483818 414953308 414842377 415037613 415610504 415453186 415595474 415968399 416052666 414778557
956.7D14778557j947708j908951l050881l317375k349434j303024j253319j340789
$$ 414778557 412830849 410921898 407871017 404553642 402204208 400901184 399647865 398307076
964.4C98307076j466485j686744j512833j988068k971992l402901k634277k004089
$$ 398307076 396840591 395153847 393641014 391652946 388680954 385278053 382643776 380639687
972.1C80639687k198067k271156j997452k526741l559952m140053m487991m505043
$$ 380639687 378441620 376170464 374173012 371646271 368086319 363946266 359458275 354953232
979.8C54953232m731026n012665n377998m960518l818741l511009m258919m679889
$$ 354953232 350222206 345209541 339831543 334871025 331052284 327541275 323282356 318602467
987.6C18602467m673405m901829m556618m397525l620339k648182k839374l161011
$$ 318602467 313929062 309027233 304470615 300073090 296452751 293804569 290965195 287804184
995.3B87804184k800980k645912k414951k368183l511296k582454k113781k576027
$$ 287804184 285003204 282357292 279942341 277574158 274062862 271480408 269366627 266790600
1003B66790600k110558k026024j394558j700229j506710j573487j976471k392940k463512
$$ 266790600 264680042 262654018 261259460 259559231 258052521 256479034 254502563 252109623 249646111
1011.7B49646111j207238j516494j511288j917915j905175k136268k748852j567936
$$ 249646111 248438873 246922379 245411091 243493176 241588001 239451733 236702881 235134945
1019.4B35134945k133103k792129k899857j773109q70724p15713q09860j746369j338463
$$ 235134945 233001842 230209713 227309856 225536747 224666023 223950310 223140450 221394081 220055618
1028.1B20055618j225624n05543j626739j718674n8422N8460J269112J048756K58541
$$ 220055618 218829994 218324451 216697712 214979038 214920616 214979076 216248188 217296944 217555485
1036.7B17555485k22912J568317J922055O46114J086960M44469J183949Q04252M98448
$$ 217555485 217332573 218900890 220822945 221469059 222556019 223000488 224184437 224988689 225487137
1045.4B25487137L63407l03650p63111j369381k76051q04405p95688j321602j480942
$$ 225487137 225850544 225546894 224783783 223414402 223138351 222333946 221538258 220216656 218735714
1054.1B18735714r98917p40337L00026r36928L81928P65724J145782J966400R30691
$$ 218735714 217736797 216996460 217296486 216359558 216741486 217507210 218652992 220619392 221550083
1062.8B21550083Q54435R57432K668095J440830J614322K322560R83105R86328K95696
$$ 221550083 222404518 223361950 226030045 227470875 229085197 231407757 232390862 233377190 233672886
1071.5B33672886O57635J6536O2027P5760L91045N84049p610Q14342n69515N54981
$$ 233672886 234330521 234347057 234409084 234484844 234875889 235459938 235452328 236266670 235697155 236252136
1081.1B36252136J528836R41886M64459L05805J713028M22115N03521J327420J461448
$$ 236252136 237780972 238722858 239187317 239493122 241206150 241628265 242131786 243459206 244920654
1089.8B44920654J443901J789093J916485Q20790J390075J450215J618576R51862J305923
$$ 244920654 246364555 248153648 250070133 250890923 252280998 253731213 255349789 256301651 257607574
1098.5B57607574J483040R92623K297668J075936J373405J698742J042633J292973
$$ 257607574 259090614 260083237 262380905 263456841 264830246 266528988 267571621 268864594
1106.2B68864594J236991J608258J478843J303788M0664N68390J149063Q77648J369743
$$ 268864594 270101585 271709843 273188686 274492474 274533138 275101528 276250591 277128239 278497982
1114.9B78497982J125641J136265J94034N8918p19242l04184P02973n35336o4602K03686
$$ 278497982 279623623 280759888 280953922 281012840 280293598 279989414 280692387 280157051 280092449 280296135
1124.5B80296135J188240J193943N66273J210537J599140K170009J610928J507740
$$ 280296135 281484375 282678318 283244591 284455128 286054268 288224277 289835205 291342945
1132.2B91342945J554642K508411K615280K220192K867852K571392K418289J247711
$$ 291342945 292897587 295405998 298021278 300241470 303109322 305680714 308099003 309346714
1139.9C09346714J435375J676541N97000Q36353J417637J822014J184749Q76618M13227
$$ 309346714 310782089 312458630 313055630 313891983 315309620 317131634 318316383 319193001 319606228
1148.6C19606228J27430M75693l32604p55138k99874K91329j9398k20890k60010p52525
$$ 319606228 319733658 320209351 319876747 319121609 318821735 319113064 319093666 318872776 318612766 317860241
1158.3C17860241p52792o84071n81169j174889o92444N33753R65977J695823K417946
$$ 317860241 317107449 316423378 315842209 314667320 313974876 314508629 315474606 317170429 319588375
1166.9C19588375K788143K477188K474099K362442K358207K310372K635460L298950
$$ 319588375 322376518 324853706 327327805 329690247 332048454 334358826 336994286 340293236
1174.6C40293236L119812L149986L119087K606888K226906K669754J953087J284599
$$ 340293236 343413048 346563034 349682121 352289009 354515915 357185669 359138756 360423355
1182.4C60423355J655464J837998K375412J765480J157913J101227P75413M60930M14887
$$ 360423355 362078819 363916817 366292229 368057709 369215622 370316849 371092262 371553192 371968079
1191C71968079j93673j041259m69284n93911r01870l12882n87349q88748q92410j143608
$$ 371968079 371774406 370733147 370263863 369669952 368768082 368455200 367867851 366979103 366086693 364943085
1200.7C64943085j212006j425476j734810j706428j085740m13665l63579k07024L5096
$$ 364943085 363731079 362305603 360570793 358864365 357778625 357364960 357001381 356794357 356829453
1209.4C56829453J51672k84615r14917p37838q29316m49218L54805K39448J80168R0790
$$ 356829453 356981125 356696510 355781593 355043755 354214439 353765221 354120026 354359474 354539642 354630432
1219C54630432j41373o23741p82242o76994j222000r54437k60391k11297o03218o38237
$$ 354630432 354489059 353865318 353083076 352406082 351184082 350229645 349969254 349757957 349154739 348516502
1228.6C48516502m63867r74235j079254j087113r08852o94351r50241l28789K70844
$$ 348516502 348052635 347078400 345999146 344912033 344003181 343308830 342358589 342029800 342300644
1237.3C42300644M89197K39258l55034n57518o58150n13382r23805j086273q37632
$$ 342300644 342789841 343029099 342674065 342116547 341458397 340945015 340021210 338934937 338097305
1246C38097305k35252O80809J13640k65427l02849p82470q57582m66843k50969m72260
$$ 338097305 337862053 338542862 338656502 338391075 338088226 337305756 336448174 335981331 335730362 335258102
1255.7C35258102J14403M82636J62887l7956J97716K29530j80855l8414n5732J98288
$$ 335258102 335372505 335855141 336018028 335980072 336177788 336407318 336226463 336188049 336132317 336330605
1265.3C36330605M94346N38025O57120Q03222R91478P16286O99692N35965P21741O40831
$$ 336330605 336824951 337362976 338020096 338823318 339814796 340531082 341230774 341766739 342488480 343129311
1274.9C43129311K24495P97195J175156J071891R07402J370240J305771Q22334R41162
$$ 343129311 343353806 344151001 345326157 346398048 347305450 348675690 349981461 350803795 351744957
1283.6C51744957J020889J503182J675224J345139J398963J278344N69763R11445J167298
$$ 351744957 352765846 354269028 355944252 357289391 358688354 359966698 360536461 361447906 362615204
1292.3C62615204P63969R91669P25632L32260K69089M06494N42526O89163O14586K91710
$$ 362615204 363379173 364370842 365096474 365428734 365697823 366104317 366646843 367336006 367950592 368242302
1301.9C68242302j99394j52397L32412m01840k51808n1537k28996n6496o30912n43557
$$ 368242302 368042908 367890511 368222923 367821083 367569275 367517738 367288742 367232246 366601334 366057777
1311.6C66057777o46324p17735p67975m48074J00937K784M59290L80325Q31185J105499
$$ 366057777 365411453 364693718 363925743 363477669 363578606 363581390 364040680 364421005 365252190 366357689
1321.2C66357689J070824J067390K77252P79419Q87337M33731J43700J60026Q78m81682
$$ 366357689 367428513 368495903 368773155 369552574 370439911 370873642 371017342 371177368 371178246 370696564
1330.9C70696564l22762n45082m75616n81589l38516m3412p5111N40009L89823O38352
$$ 370696564 370373802 369828720 369353104 368771515 368432999 368389587 368314476 368854485 369244308 369882660
1340.5C69882660P52144P46231M99916N05600J016846P31201R17549M01916K13318
$$ 369882660 370634804 371381035 371880951 372386551 373403397 374134598 375052147 375454063 375667381
1349.2C75667381J29471l6392q2855m83322k63253n62553j6518J91498k6436k70080
$$ 375667381 375796852 375760460 375677605 375194283 374931030 374368477 374351959 374543457 374517021 374246941
1358.8C74246941m90342o74171j226654j98555o23589r1438K25601n44700m13895j111984
$$ 374246941 373756599 373082428 371855774 371657219 371033630 370942192 371167793 370623093 370209198 369097214
1368.5C69097214o93054l17002k04048k31705o95724m48532j82686N38978J01014l10097
$$ 369097214 368404160 368087158 367883110 367651405 366955681 366507149 366324463 366863441 366964455 366654358
1378.1C66654358n47333j77116l18718j190415j206550j643791j092606r60655j124115
$$ 366654358 366107025 365929909 365611191 364420776 363214226 361570435 360477829 359517174 358393059
1386.8C58393059j927910j712532r22203j845360j758308j957169j742477k633019
$$ 358393059 356465149 354752617 353830414 351985054 350226746 348269577 346527100 343894081
1394.5C43894081l831253j443710j389771j574516l082810k302436j204148k377815
$$ 343894081 340062828 338619118 337229347 335654831 332572021 330269585 329065437 326687622
1402.2C26687622k041016j636085k648850k744216j236477j150723j936359j434365
$$ 326687622 324646606 323010521 320361671 317617455 316380978 315230255 313293896 311859531
1409.9C11859531j418953j191902j518955j302776q91915j389122l85208l72104J78718
$$ 311859531 310440578 309248676 307729721 306426945 305535030 304145908 303760700 303388596 303567314
1418.6C03567314j425361r89800J172562J09901K22168l42464P33776Q96625N49145
$$ 303567314 302141953 301152153 302324715 302434616 302656784 302314320 303048096 303944721 304493866
1427.3C04493866J614571O46667R89800J170921J952362J566429J343803K480946J613522
$$ 304493866 306108437 306755104 307744904 308915825 310868187 312434616 313778419 316259365 317872887
1436C17872887J492939J179371K810440K154655J722794K097473J367683K140122J393928
$$ 317872887 319365826 320545197 323355637 325510292 327233086 329330559 330698242 332838364 334232292
1444.7C34232292J989060J365432J289826J897201J393624K395057J346512J641503
$$ 334232292 336221352 337586784 338876610 340773811 342167435 344562492 345909004 347550507
1452.4C47550507J006088J655693J907310N23453J869774j869L926544K240601K228546
$$ 347550507 348556595 350212288 352119598 352643051 354512825 354510956 358437500 360678101 362906647
1461.1C62906647K142753J803475K487297N03731J978798J804771K513084K547722
$$ 362906647 365049400 366852875 369340172 369843903 371822701 373627472 376140556 378688278
1468.8C78688278K476158L533707K623863K992363K300110L410721K978668J953621
$$ 378688278 381164436 384698143 387322006 390314369 392614479 396025200 399003868 400957489
1476.5D00957489K191887K223015K615165K423058K160263J714058J834030J810227
$$ 400957489 403149376 405372391 407987556 410410614 412570877 414284935 416118965 417929192
1484.2D17929192J669731J730613O88553O20613J836510R15604n41535N08499M76113
$$ 417929192 419598923 421329536 422018089 422638702 424475212 425390816 424849281 425357780 425833893
1492.9D25833893l23410n6458r4719m042473l52134j132927k698326j51711p41501
$$ 425833893 425510483 425454025 425359306 421316833 420964699 419831772 417133446 416981735 416240234
1501.6D16240234r52110r77554Q5602p3357k837219l576775J54610Q78486j071510
$$ 416240234 415288124 414310570 414396172 414322815 411485596 407908821 408063431 408941917 407870407
1510.2D07870407O04096n03846j366119r3002r41925n97763j702767k131500Q76350
$$ 407870407 408474503 407970657 406604538 406511536 405569611 404971848 403269081 401137581 402013931
1518.9D02013931J745262o74514k436257Q14934J030121J246643j070786J015892J358490
$$ 402013931 403759193 403084679 400648422 401463356 402493477 403740120 402669334 403685226 405043716
1527.6D05043716O562M72717R70345J242256J84211J75171j064071J087417O83823
$$ 405043716 405050278 405522995 406493340 407735596 407919807 408094978 407030907 408118324 408802147
1536.3D08802147K12173J689721k487832j566734J287918p8163N10368J903992R30367
$$ 408802147 409014320 410704041 408216209 406649475 407937393 407859230 408369598 410273590 411203957
1545D11203957j913147J051063K72865L90282r81560j478767Q35190j77002M67682
$$ 411203957 409290810 410341873 410614738 411005020 410023460 408544693 409379883 409202881 409670563
1553.6D09670563k694474p0571J181297L79372k088662j0471267J027832Q53881Q13294
$$ 409670563 406976089 406905518 408086815 408466187 406377525 395906258 396934090 397787971 398601265
1562.3C98601265j870918j856346l284379l300552j464271k806015j581345p965584
$$ 398601265 396730347 394874001 391589622 388289070 386824799 384018784 382437439 374471855
1570C74471855k017174k212143l910598l096810l181762p20902j1825981k335129l358497
$$ 374471855 372454681 370242538 366331940 363235130 360053368 359332466 347506485 345171356 341812859
1578.7C41812859m329567l794823m948654l128090n837040l501263m813308m072209
$$ 341812859 337483292 333688469 328739815 325611725 319774685 316273422 311460114 307387905
1586.4C07387905m153824m942474k667599m989052k548675m950791k997150l818645
$$ 307387905 303234081 298291607 295624008 290634956 288086281 283135490 280138340 276319695
1594.1B76319695m793549k506123m355297j364746l926372j579399l187085l397751
$$ 276319695 271526146 269020023 264664726 263299980 259373608 257794209 254607124 251209373
1601.9B51209373j419506l241958o13384l253689j072960k650948q26874p24258k704620
$$ 251209373 249789867 246547909 245934525 242680836 241607876 238956928 238130054 237405796 234701176
1610.5B34701176M12388k281170K40307k089310Q8539R02653m439087J396827j204280
$$ 234701176 235113564 232832394 233072701 230983391 231071930 231974583 227535496 228932323 227728043
1619.2B27728043J353244r14421J324215M7779k278614J714382j28021K108059j296596
$$ 227728043 229081287 228166866 229491081 229538860 227260246 228974628 228846607 230954666 229658070
1627.9B29658070J522846Q37173P34997J301746P9251K426262K88849K530498j449280
$$ 229658070 231180916 232018089 232753086 234054832 234134083 236560345 236849194 239379692 237930412
1636.6B37930412K609196J820011R85489K657967L68805K403202Q14266K333526J576291
$$ 237930412 240539608 242359619 243345108 246003075 246371880 248775082 249589348 251922874 253499165
1645.3B53499165j65539L399429p2365L337460Q00571L154564K755108m05865P5894
$$ 253499165 253333626 256733055 256660690 259998150 260798721 263953285 266708393 266302528 266378422
1653.9B66378422P41119L943653J248493K608281J005096J609078K016773J935272
$$ 266378422 267119541 271063194 272311687 274919968 275925064 277534142 279550915 281486187
1661.6B81486187L746128N75104L307628J982308K844753K788353K384663K878360
$$ 281486187 285232315 285807419 289115047 291097355 293942108 296730461 299115124 301993484
1669.4C01993484J266232N234776K172813L770065L681374K406158L038178L401794
$$ 301993484 303259716 308494492 310667305 314437370 318118744 320524902 323563080 326964874
1677.1C26964874M405251K722282M299507L190003M727478N376053J748237N887413
$$ 326964874 331370125 334092407 338391914 341581917 346309395 351685448 353433685 359321098
1684.8C59321098K661324N754394M162140M021530M524308M058876N231094M698181
$$ 359321098 361982422 367736816 371898956 375920486 380444794 384503670 389734764 394432945
1692.5C94432945N105591M697228M861831J873932M870453N808640N475311M006004
$$ 394432945 399538536 404235764 409097595 410971527 415841980 421650620 427125931 431131935
1700.2D31131935j24512P467499N619164M810829L699722L277397K411156K575302
$$ 431131935 431007423 438474922 444094086 448904915 452604637 455882034 458293190 460868492
1707.9D60868492M023438K351951K060623L144493L503380L121834J002541J448173
$$ 460868492 464891930 467243881 469304504 472448997 475952377 479074211 480076752 481524925
1715.6D81524925L266678K142754l788224L125115L750191K179908K144814J753769
$$ 481524925 484791603 486934357 483146133 486271248 490021439 492201347 494346161 496099930
1723.4D96099930J358375J629334J736030J229668J223221J666107l25088Q93364M246673
$$ 496099930 497458305 499087639 500823669 502053337 503276558 504942665 504617577 505510941 509757614
1732E09757614M127121p89642k896500M538651M231529K225151K555466Q00628j95312
$$ 509757614 513884735 513095093 510198593 514737244 518968773 521193924 523749390 524550018 524354706
1740.7E24354706M412193L652611J923904K861862M513894L942985K778740L059464
$$ 524354706 528766899 532419510 534343414 537205276 541719170 545662155 548440895 551500359
1748.4E51500359K234726N095481K382508J649246N680199M128761M175529M081879
$$ 551500359 553735085 558830566 561213074 562862320 568542519 572671280 576846809 580928688
1756.2E80928688J871643K385368L064728L026276L292961k34222J128501M450951
$$ 580928688 582800331 585185699 588250427 591276703 594569664 594335442 595463943 599914894
1763.9E99914894K714234K438659K701340K137947q78220K388535M520340L50723j898575
$$ 599914894 602629128 605067787 607769127 609907074 609028854 611417389 615937729 616288452 614389877
1772.5F14389877o38046M872704L116989J38321K741050J146622J990318R41315r37042
$$ 614389877 613751831 618624535 621741524 621879845 624620895 625767517 627757835 628699150 627762108
1781.2F27762108J005325J682549K035827p2212R47266K350578J539917P13654J150817
$$ 627762108 628767433 630449982 632485809 632413597 633360863 635711441 637251358 637965012 639115829
1789.9F39115829O19698J038399r90334j212921L927498J774597L16773K038421K248459
$$ 639115829 639735527 640773926 639783592 638570671 642498169 644272766 644589539 646627960 648876419
1798.6F48876419Q74481j184768K000351k06376J2513J628646R45130J822128Q75626
$$ 648876419 649750900 648566132 650566483 650360107 650372620 652001266 652946396 654768524 655644150
1807.3F55644150O32858J404190J949997j038895k88391R76410J92337J399079P248
$$ 655644150 656277008 657681198 659631195 658592300 658303909 659280319 659472656 660871735 660878983
1815.9F60878983J157379J058349J002732J586303J64261R51462m42047J018600J413727
$$ 660878983 662036362 663094711 664097443 665683746 665848007 666799469 666357422 667376022 668789749
1824.6F68789749k320022K18429K271729K881164Q65936l052978N86243K177200R4299
$$ 668789749 666469727 666688156 668959885 671841049 672706985 669654007 670240250 672417450 672511749
1833.3F72511749J297N01023P03735N11169m04739J379852Q60596R37424P51037J208725
$$ 672511749 672513046 673014069 673717804 674228973 673824234 675204086 676064682 677002106 677753143 678961868
1842.9F78961868L73001n966949J984711K676010N48858M35868R51309J249695M4098
$$ 678961868 679334869 673367920 675352631 678028641 678577499 679013367 679964676 681214371 681258469
1851.6F81258469O10427m0969J49536n9815l13949L27530Q0032J006622R59473J330109
$$ 681258469 681868896 681827927 681977463 681917648 681603699 681931229 682011261 683017883 683977356 685307465
1861.3F85307465J34124L37372M04053l81012L39737p77664J001663q61511j340561
$$ 685307465 685441589 685778961 686183014 685802002 686141739 685364075 686365738 685504227 684163666
1869.9F84163666J923599J401138J061783J15891J17645o72760l99399l89709N6228
$$ 684163666 686087265 687488403 688550186 688666077 688783722 688110962 687711563 687321854 687378082
1878.6F87378082J195908L77502Q22144L17154P24335m7684n30167J60141k62222J098556
$$ 687378082 688573990 688951492 689773636 690090790 690815125 690767441 690237274 690397415 690135193 691233749
1888.3F91233749l39660j166382Q60977J405716O84814L14255k85721j524887N50385
$$ 691233749 690894089 689727707 690588684 691994400 692679214 692993469 692707748 691182861 691733246
1896.9F91733246K1667m0207M82789L1738O01196L92456R08432R079J068k32315o95114
$$ 691733246 691754913 691714706 692197495 692229233 692830429 693222885 694131317 694140396 694141464 693909149 693214035
1907.6F93214035K213o6147q6899j74713J551437P41120k6169j679j35498P14417k371369
$$ 693214035 693216248 693150101 693063202 692888489 694439926 695181046 695154877 695153198 695017700 695732117 693360748
1918.2F93360748m59747J444473O63834P80792l27606j01776O72683M89350o66199
$$ 693360748 692901001 694345474 695009308 695790100 695462494 695360718 696033401 696522751 695856552
1926.8F95856552l53317m84390o16913N4931M04129J021576J17722N45349K4567l67585
$$ 695856552 695503235 695018845 694401932 694456863 694860992 695882568 696000290 696545639 696570206 696202621
1936.5F96202621j91421n69229o0349p27310O26831j79367r82666J427078Q70743J3657
$$ 696202621 696011200 695441971 695381622 694654312 695281143 695101776 694119110 695546188 696416931 696430588
1946.1F96430588o59409k48413l50723n42679l10898J22452N25360K55356M05197K1057
$$ 696430588 695771179 695522766 695172043 694629364 694318466 694440918 694966278 695221634 695626831 695647888
1955.8F95647888K94876m81872o82907l94211n79987J66016j26190J34048p6370Q86841
$$ 695647888 695942764 695460892 694777985 694383774 693803787 693969803 693843613 693977661 693901291 694788132
1965.4F94788132Q86917p08695m63409n39856J32370m22516r8877L94821Q4610N29023
$$ 694788132 695675049 694966354 694502945 693963089 694095459 693672943 693574066 693968887 694053497 694582520
1975.1F94582520O5841M14505k36892m32206m29535m12826j24512m99344J27869J8539
$$ 694582520 694648361 695062866 694825974 694393768 693964233 693551407 693426895 692927551 693055420 693073959
1984.7F93073959M69818K38495j144O4468m55398R6512l73536r73892n63278N28793
$$ 693073959 693543777 693782272 693781128 693845596 693390198 693486710 693113174 692139282 691576004 692104797
1994.3F92104797L6621k08053N29785R5215K14920m91715k96173l21350n18341m77753
$$ 692104797 692141418 691933365 692463150 692558365 692773285 692281570 691985397 691664047 691145706 690667953
2004F90667953n61828N65796M33731L95813l72467l25012j8235m63180j23749o88477
$$ 690667953 690106125 690671921 691105652 691501465 691128998 690803986 690785751 690322571 690198822 689510345
2013.6F89510345K060L5401j72043j70136o332L80554k72598j64566p86133m54178
$$ 689510345 689512405 689547806 689375763 689205627 689199295 689579849 689307251 689142685 688356552 687902374
2023.3F87902374n47638k74963K99454m03138L60337O8664K12021j46026n99976l92532
$$ 687902374 687354736 687079773 687379227 686976089 687336426 687405090 687617111 687471085 686871109 686478577
2032.9F86478577m12598J31683n34439q011l2119q927J48926j34277J6403p16629j58386
$$ 686478577 686065979 686197662 685663223 685655212 685623093 685614166 685763092 685628815 685645218 684928589 684770203
2043.5F84770203m34342k83661l26996k86483L56674j84021M44336k00730k89840n5542
$$ 684770203 684335861 684052200 683725204 683438721 683795395 683611374 684055710 683854980 683565140 683509598
2053.2F83509598l0747j20620r35364n58777n64728O77567M82864K41547N17044n43747
$$ 683509598 683478851 683358231 682422867 681864090 681299362 681976929 682459793 682701340 683218384 682674637
2062.8F82674637m6005m57459n17502k72751j25656j91345r2163L45993p4234M48685
$$ 682674637 682628632 682171173 681653671 681380920 681255264 681063919 680971756 681317749 681243515 681692200
2072.5F81692200j83869k23999j43280m64706j82266l64228j25274l43857L80325J61209
$$ 681692200 681508331 681284332 681141052 680676346 680494080 680129852 680004578 679660721 680041046 680202255
2082.1F80202255K54212K62527p52487j51978j39312o2485p61643l26614J49918m0055
$$ 680202255 680456467 680718994 679966507 679814529 679675217 679612732 678851089 678524475 678674393 678634338
2091.7F78634338O27671J42212L26538o61774p03659m94461p99027k20184l22342M54559
$$ 678634338 679262009 679404221 679730759 679068985 678365326 677870865 677071838 676851654 676529312 676983871
2101.4F76983871j33438L1281L26767o0425k65655r01642m26331o80847J7548o4774
$$ 676983871 676850433 676881714 677208481 677148056 676882401 675980759 675554428 674873581 674891129 674826355
2111F74826355r8801M77219K38419N65338m21067m30450o50787p73468k13623O4544
$$ 674826355 674727554 675204773 675443192 676008530 675587463 675157013 674506226 673732758 673519135 673583679
2120.7F73583679j35269m94537R13543K45819k97699k72293k29187K05155l34473O2637
$$ 673583679 673448410 672953873 673867416 674113235 673815536 673543243 673314056 673519211 673184738 673247375
2130.3F73247375o24542J1444L01972r6970M44946p5683K57645k03324m86832o16455
$$ 673247375 672622833 672634277 672936249 672839279 673284225 673208542 673466187 673262863 672776031 672159576
2140F72159576k08740K85797K07367P00379r003J83563O3629K2278J12686l60412l04795
$$ 672159576 671950836 672236633 672444000 673144379 673135376 673318939 673382568 673404846 673517532 673157120 672852325
2150.6F72852325m87136M4403k38724K61154N32379J50452K65732k06986q3694m52118
$$ 672852325 672365189 672409592 672170868 672432022 672964401 673114853 673380585 673173599 673089905 672637787
2160.2F72637787j45035k64664l35388L18604M51812L96271r0713M01916J42975M6005
$$ 672637787 672492752 672228088 671892700 672211304 672663116 673059387 672968674 673370590 673513565 673559570
2169.9F73559570l34396m57230K03019L6926P25021m501j26496r91j41755L25623j18790
$$ 673559570 673225174 672767944 672970963 673007889 673732910 673728409 673601913 673600922 673459167 673784790 673666000
2180.5F73666000L7156k77482Q8501o0806R6970L82614k35367K41699j14059J38779
$$ 673666000 673703156 673425674 673514175 673453369 673550339 673932953 673697586 673939285 673825226 673964005
2190.1F73964005j51520k25678j19400l0670P23877p9269K49633N1804J43585L45383
$$ 673964005 673812485 673586807 673467407 673436737 674160614 674081345 674330978 674382782 674526367 674871750
2199.8F74871750p9727R5901m82330l9902M6539M05808p2403n7983O26449m29687j84708
$$ 674871750 674792023 674887924 674405594 674365692 674412231 674818039 674745636 674687653 675314102 674884415 674699707
2210.4F74699707l32642J89286M07409R7733J01623l26767L58582K8839l3493k85721
$$ 674699707 674367065 674556351 674963760 675061493 675163116 674836349 675194931 675223770 675190277 674904556
2220F74904556k94265J9378L5553M77753J77307L23868l72467j17646J16578k75040
$$ 674904556 674610291 674629669 674665222 675142975 675320282 675644150 675271683 675154037 675270615 674995575
2229.7F74995575K3422p7972K66266m11225L38898N64880r2544J15051j90124K61688
$$ 674995575 675018997 674941025 675207291 674796066 675134964 675699844 675607300 675722351 675532227 675793915
2239.3F75793915k59552k79541m30756o6833M29458o6299M79507l4027j92566m93850
$$ 675793915 675534363 675254822 674824066 674757233 675186691 675120392 675599899 675565872 675373306 674879456
2248.9F74879456k55509P5531j65863L65448J71661M21601p9041J20850J0910o58264
$$ 674879456 674623947 674699478 674533615 674899063 675070724 675492325 675413284 675534134 675545044 674886780
2258.6F74886780q0948m8142J38245k30560J94168J41830R3003K40936k06757L42179
$$ 674886780 674805832 674757690 674895935 674665375 674859543 675001373 675094376 675335312 675128555 675470734
2268.2F75470734k81372l42408k67181L33557K45056l46451M41437p0343L03040j78376
$$ 675470734 675189362 674846954 674579773 674913330 675158386 674811935 675253372 675183029 675486069 675307693
2277.9F75307693l90472n00336q99276J17721k45819L06549J74179m1733O1722J63803
$$ 675307693 674917221 674416885 673517609 673635330 673389511 673696060 673870239 673828506 673890228 674054031
2287.5F74054031Q62656j59607l45230m93088J20011K96936J08413O48880p400N11932
$$ 674054031 674916687 674757080 674411850 673918762 674038773 674335709 674444122 675093002 675085602 675597534
2297.2F75597534J65177Q1710q9874m14123M36248J17035M95301L60565L75366K26898
$$ 675597534 675762711 675844421 675754547 675340424 675776672 675893707 676389008 676749573 677124939 677351837
2306.8F77351837K52304Q95691J42288J17417l22724K47879P32956j2664L91464N12237
$$ 677351837 677604141 678499832 678642120 678759537 678436813 678684692 679417648 679404984 679796448 680308685
2316.4F80308685Q01392R33151P50656L76587K99683L60718L051K09122N49927J056595
$$ 680308685 681110077 682043228 682793884 683170471 683470154 683830872 683833923 684043045 684592972 685649567
2326.1F85649567R15756M85382Q55331K75727r68628q39615q91647l59498J59836J126328
$$ 685649567 686565323 687050705 687906036 688181763 687213135 686373520 685481873 685122375 685282211 686408539
2335.7F86408539K496414j05515k93121N7373j203384q71124q33130m7379l08685o93512
$$ 686408539 688904953 688799438 688506317 688563690 687360306 686489182 685656052 685608673 685299988 684606476
2345.4F84606476j471405k199326k154693K67486K798920J161041J589737J949997
$$ 684606476 683135071 680935745 678781052 679048538 681847458 683008499 684598236 686548233
2353.1F86548233R43298J617279J402970K472915J71433J226959o31103j737595k63290
$$ 686548233 687491531 689108810 690511780 692984695 693156128 694383087 693751984 692014389 691751099
2361.8F91751099j492615L83530j610184j592179j205825o44074j364975k330322j093292
$$ 691751099 690258484 690642014 689031830 687439651 686233826 685589752 684224777 681894455 680801163
2370.4F80801163k578430j695023k136154k604752j779251j002579m46701j304245
$$ 680801163 678222733 676527710 674391556 671786804 670007553 669004974 668558273 667254028
2378.2F67254028j020736j616288j446228j294784j573868r98917r35821m41666l33710
$$ 667254028 666233292 664617004 663170776 661875992 660302124 659303207 658367386 657925720 657592010
2386.8F57592010K31782K30255r2011k83661q66699m90875o07758o28433q46405k97241
$$ 657592010 657823792 658054047 657962036 657678375 656811676 656320801 655713043 655084610 654238205 653940964
2396.5F53940964J9607r3460N44281l84445m65240m09623n87387n90210p22503j93711
$$ 653940964 653960571 653867111 654411392 654026947 653561707 653152084 652564697 651974487 651251984 651058273
2406.1F51058273j84326L2120O5842L20205k62375o74820l20129o42395n01862r36965
$$ 651058273 650873947 650906067 650971909 651292114 651029739 650354919 650034790 649392395 648890533 647953568
2415.8F47953568l25776L70713J82495k21710p33643l58734l26767k21253q70056r00421
$$ 647953568 647627792 647998505 648181000 647959290 647225647 646866913 646540146 646318893 645448837 644548416
2425.4F44548416j50528j55029n00107k46735N46341n01556j87531M5548q68225q64029
$$ 644548416 644397888 644242859 643742752 643496017 644042358 643540802 643353271 643398819 642530594 641666565
2435.1F41666565r33838j62353m12064k38113r0218j85356K47803k81792n11284j056862
$$ 641666565 640732727 640570374 640158310 639920197 639829979 639644623 639892426 639610634 639099350 638042488
2444.7F38042488o64635p92465p97882J14136P439J67274k26784k02446n37643p07588
$$ 638042488 637377853 636585388 635787506 635901642 635909081 636076355 635849571 635647125 635109482 634401894
2454.3F34401894n85099j084175o56318l60146j4343j71356O3858j1101n83954m95987
$$ 634401894 633816795 632732620 632076302 631716156 631701813 631530457 631594315 631583214 630999260 630503273
2464F30503273q59566n86967o94084o60210n45616l69454J08719k03132l53775n49660
$$ 630503273 629643707 629056740 628362656 627702446 627156830 626787376 626896095 626692963 626339188 625789528
2473.6F25789528k67296p50771q90655l36227n59655l42369m55284m15039m70848k85759
$$ 625789528 625522232 624771461 623880806 623544579 622984924 622642555 622187271 621772232 621301384 621015625
2483.3F21015625j15852n39093j088143j166458j33133k76947m78210n26734m05044
$$ 621015625 620899773 620360680 619272537 618106079 617972946 617695999 617217789 616691055 616286011
2492F16286011r918m56658l59306p64313r52225p13768m94804m47235n63393k99530
$$ 616286011 616276093 615819435 615460129 614695816 613743591 613029823 612535019 612087784 611524391 611224861
2501.6F11224861m43230k56080m69475j96152m58831j273652o19621o67648p22199
$$ 611224861 610781631 610525551 610056076 609859924 609401093 608127441 607507820 606840172 606117973
2510.3F06117973n58586k89726m578j95961o91833q57697m00467o26640l01704l59612
$$ 606117973 605559387 605269661 605265083 605069122 604377289 603519592 603119125 602492485 602190781 601831169
2519.9F01831169p87697p06405k37122L53355k36663m59710p56721o46248n55343r46847
$$ 601831169 601043472 600337067 600099945 600453300 600216637 599756927 599000206 598353958 597798615 596851768
2529.6E96851768o81457l63235k7009o65435m95262l00293l12081k96669r47113j44234
$$ 596851768 596170311 595807076 595780067 595114632 594619370 594319077 594006996 593710327 592763214 592618980
2539.2E92618980l75633q08525n92422k90108n5733n80063l16658o47316n74112l97949
$$ 592618980 592243347 591434822 590842400 590552292 590496559 589916496 589599838 588952522 588378410 587980461
2548.9E87980461o87294o09550m92287k50893n37719j80550k80342k57149j85356n99442
$$ 587980461 587293167 586683617 586191330 585940437 585402718 585222168 584941826 584684677 584499321 583899879
2558.5E83899879m05387o62766n69687p48634m93546l73382n41191j37596n26429n07889
$$ 583899879 583494492 582831726 582262039 581513405 581019859 580646477 580105286 579967690 579441261 578933372
2568.1E78933372m52499j54648m52652q33091n00222o50406k75573k71187k31438l08533
$$ 578933372 578480873 578326225 577873573 577040482 576540260 575889854 575614281 575343094 575111656 574803123
2577.8E74803123l61137m74739p69196l90129n84716n51033o42891l80707j37139l39202
$$ 574803123 574441986 573967247 573198051 572807922 572223206 571672173 571029282 570648575 570511436 570172234
2587.4E70172234j65940m79774m05503o05201o46363p43789o69289j27258n25589n70030
$$ 570172234 570006294 569526520 569121017 568515816 567869453 567125664 566456375 566329117 565803528 565233498
2597.1E65233498l85666j79749m65240n09606m54673r64089r62829p57828j49384m01764
$$ 565233498 564847832 564668083 564202843 563693237 563238564 562274475 561311646 560553818 560404434 560002670
2606.7E60002670j43547P172q30574o23932o27594n15022o48308n49240n22728q46024
$$ 560002670 559859123 559866295 559035721 558411789 557784195 557269173 556620865 556071625 555548897 554702873
2616.4E54702873l25279k84424n24635n48172k89269q50982j042900n35469n85900
$$ 554702873 554377594 554093170 553568535 553020363 552731094 551880112 550837212 550301743 549715843
2625E49715843m31671n69458m47159n74035q5335k9335r50012r62143j169358l51829
$$ 549715843 549284172 548714714 548267555 547693520 547608185 547578850 546628838 545666695 544497337 544145508
2634.7E44145508l41225j039772n99632l91083o7635j75743o56051r99375n49316l04222
$$ 544145508 543804283 542764511 542164879 541773796 541706161 541530418 540874367 539874992 539325676 539021454
2644.3E39021454n53322o59904p62063n54885q59032o09551k73246l16506n21164q09478
$$ 539021454 538468132 537808228 537046165 536491280 535632248 535022697 534749451 534432945 533911781 533102303
2654E33102303o28243n14946m00848q83828l74450M7569l81622k05422m27856o61621
$$ 533102303 532474060 531959114 531558266 530674438 530299988 530347557 529965935 529760513 529332657 528671036
2663.6E28671036q92601l43857m78630o23131j39351o32019l93562l93334j09558l05443
$$ 528671036 527778435 527434578 526955948 526332817 526193466 525561447 525167885 524774551 524664993 524359550
2673.3E24359550o48574j36338m86374m61959o71006n10902l41110m49372k64015l89480
$$ 524359550 523710976 523574638 523088264 522626305 521955299 521444397 521103287 520653915 520389900 520000420
2682.9E20000420k13128n02395n07927n62401o43120n30472l94172k60582n30281J411
$$ 520000420 519787292 519284897 518776970 518214569 517571449 517040977 516646805 516386223 515855942 515857353
2692.5E15857353n4626l23258o23359r90715o31600l93448k09732n06820l36876l72239
$$ 515857353 515802727 515479469 514856110 513865395 513233795 512840347 512630615 512123795 511786919 511414680
2702.2E11414680k89611j15662l15056j57585o18172k51693o16570r52225m31594n04990
$$ 511414680 511125069 511009407 510694351 510536766 509918594 509666901 509050331 508098106 507666512 507161522
2711.8E07161522M3907k16598j38016J29165k99453q03147j052627n46646k51236P4348
$$ 507161522 507205429 506988831 506850815 506979980 506680527 505877380 504824753 504278107 504026871 504101219
2721.5E04101219j68495o599J02272k08321k42882o41899k81906m57687n88684n61257
$$ 504101219 503932724 503926125 504028397 503820076 503577194 502935295 502653389 502195702 501607018 501045761
2731.1E01045761p35741j26762N4741o0577j63575J05820n0735l04184l65181p77855
$$ 501045761 500310020 500183258 500237999 500177422 500013847 500119667 500068932 499764748 499399567 498621712
2740.8D98621712q34160o05316l8910l624P3662K50587K26822j02539l23868k44293
$$ 498621712 497787552 497182236 497143326 497139702 497213364 497463951 497690773 497588234 497264366 497020073
2750.4D97020073j163788m90608J58958m57000k61803j04485Q1330k50511l71895m55895
$$ 497020073 495856285 495365677 495524635 495067635 494805832 494701347 494782677 494532166 494160271 493704376
2760D93704376m62150n49126p88498o0997K08931J02463l75481l86352l73612o25648
$$ 493704376 493242226 492693100 491904602 491843605 492052536 492154999 491779518 491393166 491019554 490393906
2769.7D90393906m60663n62668k15721p90062n62401L09334r6932l08342m35524k28157
$$ 490393906 489933243 489370575 489154854 488364792 487802391 488111725 488014793 487706451 487270927 487042770
2779.3D87042770m65202m56696m11071p83921p14759n04189k20528k24533j3542p12318
$$ 487042770 486577568 486120872 485709801 484925880 484211121 483706932 483486404 483261871 483248329 482536011
2789D82536011p37381k04201q24547q72345j041832p37495n87998l72543J00594k36283
$$ 482536011 481798630 481594429 480769882 479897537 478855705 478118210 477530212 477157669 477258263 477021980
2798.6D77021980j69868o18439r55048j041336j249160r42231m25643m19159q07381
$$ 477021980 476852112 476233673 475278625 474237289 472988129 472045898 471620255 471201096 470393715
2807.3D70393715m84123m00238n03083p18383q15506q88939j241913j142159j100044
$$ 470393715 469909592 469509354 469006271 468287888 467472382 466583443 465341530 464199371 463099327
2816D63099327p06062o24352m53758k85225o44646p66868j052590q89320j104088j005897
$$ 463099327 462393265 461768913 461315155 461029930 460385284 459618416 458565826 457676506 456572418 455566521
2825.6D55566521o00853o15273n49354r76258n36079m52461j505051j684227r05380
$$ 455566521 454965668 454350395 453801041 452824783 452288704 451836243 450331192 448646965 447741585
2834.3D47741585j053047j419106p57980r76830j146049j313286j491661j293869j795311
$$ 447741585 446688538 445269432 444511452 443534622 442388573 441075287 439583626 438289757 436494446
2843D36494446k136917k295647k018700j804924j848907k012100j793709j465111j669693
$$ 436494446 434357529 432061882 430043182 428238258 426389351 424377251 422583542 421118431 419448738
2851.7D19448738j058350j185264j063347m04205m58489J0414J5602j56593k62909
$$ 419448738 418390388 417205124 416141777 415737572 415279083 415289497 415305099 415148506 414885597
2860.3D14885597k57377m39148o35376m78516p48825q26035j153297j116714o32363
$$ 414885597 414628220 414189072 413553696 413075180 412326355 411500320 410347023 409230309 408597946
2869D08597946p12433r16328n11437q3236n62439q90236j171761r50737o32171q71353
$$ 408597946 407885513 406969185 406457748 406374512 405812073 404921837 403750076 402799339 402167168 401295815
2878.7D01295815o07911m41856n31883p57370r57871j090469r01299p75184r22356
$$ 401295815 400687904 400246048 399714165 398956795 397998924 396908455 396007156 395231972 394309616
2887.3C94309616r06525j001701o16035o38352r96399r30366m27246m65088j382637
$$ 394309616 393403091 392401390 391785355 391147003 390150604 389220238 388792992 388327904 386945267
2896C86945267j303139j139679q03719o20307p00722l45803j25999l2959j199188j407204
$$ 386945267 385642128 384502449 383698730 383078423 382377701 382031898 381905899 381872940 380673752 379266548
2905.7C79266548r74808p43141k77290j060562r70421p79839r93156j083450j051598
$$ 379266548 378291740 377548599 377271309 376210747 375240326 374460487 373467331 372383881 371332283
2914.3C71332283q50716j508789j478424j246261j273651j289826r90944j003189j276894
$$ 371332283 370481567 368972778 367494354 366248093 364974442 363684616 362693672 361690483 360413589
2923C60413589j81579q9073p07627o18057Q0605M80957J77345K84729j8272o1226K88086
$$ 360413589 360232010 360142937 359435310 358817253 358897858 359378815 359556160 359840889 359822617 359761391 360049477
2933.6C60049477O62193L25622j26419N17235N48134N01061R35020R20448K62337J64490
$$ 360049477 360711670 361037292 360910873 361428108 361976242 362477303 363412323 364332771 364595108 364759598
2943.3C64759598L04336N72815J333618P97158O44645Q20122K19345K44637R78088
$$ 364759598 365063934 365636749 366970367 367767525 368412170 369232292 369451637 369696274 370674362
2952C70674362J022034Q2664K80457Q09936P26242K00692L28254P93801K13318J31454
$$ 370674362 371696396 371779060 372059517 372869453 373595695 373796387 374124641 374918442 375131760 375263214
2961.6C75263214M04930R77860M37851q6899O61659O85196J013260O02112M616K75878
$$ 375263214 375668144 376646004 377083855 376996956 377658615 378343811 379357071 379959183 379963799 380239677
2971.2C80239677P27997R01108O83212P76215K29416L68538P91321O15882L75252J61591
$$ 380239677 380967674 381868782 382551994 383328209 383557625 383926163 384717484 385333366 385708618 385870209
2980.9C85870209N66559M38652L00712K40746K00920R1553K03285Q37097K94952j18789
$$ 385870209 386436768 386875420 387176132 387416878 387617798 387709351 387912636 388749733 389044685 388925896
2990.5C88925896j7281q5449m61922n17731J47820J78108J90125J74637j36109l94401
$$ 388925896 388908615 388823166 388361244 387843513 387991333 388169441 388359566 388534203 388398094 388003693
3000.2C88003693l58582m80041o70357n27039q35914p37343k90032k41088n92042l21159
$$ 388003693 387645111 387165070 386494713 385967674 385131760 384394417 384104385 383863297 383271255 382950096
3009.8C82950096j51138o40030p00836j436234j052665j99433j00021l31612p96776
$$ 382950096 382798958 382158928 381458092 380021858 378969193 378769760 378669739 378338127 377541351
3018.5C77541351J5908n27459j171073n18761p33223r96628o81763l47900j115418
$$ 377541351 377557259 377029800 375858727 375339966 374606743 373610115 372928352 372580452 371465034
3027.2C71465034j012458l77388k23961k59857r34487n44472q05816j288834r18693
$$ 371465034 370452576 370075188 369851227 369591370 368656883 368112411 367306595 366017761 365099068
3035.9C65099068q61626n62592n96160o12565n84678o50253q69332j036453o85654
$$ 365099068 364237442 363674850 363078690 362466125 361881447 361231194 360361862 359325409 358639755
3044.5C58639755q15239j198578j026306m12483m12140p49702o52886r43718j010360
$$ 358639755 357824516 356625938 355599632 355187149 354775009 354025307 353372421 352428703 351418343
3053.2C51418343n12810o23627r58366j025429q00705l65067o15882p30172o75773
$$ 351418343 350905533 350281906 349323540 348298111 347497406 347132339 346516457 345786285 345110512
3061.9C45110512n76897n27840j128997o68564q13256j290855m82254k40440l10555
$$ 345110512 344533615 344005775 342876778 342208214 341394958 340104103 339621849 339381409 339070854
3070.6C39070854n67932m12445l98903q57277q23326p57103p27425q04252n19295m81110
$$ 339070854 338502922 338090477 337691574 336834297 336010971 335253868 334526443 333722191 333202896 332721786
3080.2C32721786n07583m19884q16154r94950r49707p12356o65856m31442o25992r43794
$$ 332721786 332214203 331794319 330978165 329983215 329033508 328321152 327655296 327223854 326597862 325654068
3089.9C25654068m77638o02074p81135o74744l87077m04778p72514r72329p66220j07860
$$ 325654068 325176430 324574356 323793221 323118477 322731400 322326622 321554108 320581779 319815559 319707699
3099.5C19707699p02782j169109m38500j17225o42205q38909m32415o80008p45430
$$ 319707699 319004917 317835808 317397308 317280083 316637878 315798969 315366554 314686546 313941116
3108.2C13941116q75950p91263n50976o41117k38914m27361o83556q86726r06029o38237
$$ 313941116 313065166 312273903 311722927 311081810 310842896 310415535 309731979 308845253 307939224 307300987
3117.8C07300987o84719n33542o35815q21228q59184n06154m52518o07109q17719j249275
$$ 307300987 306616268 306082726 305446911 304625683 303766499 303260345 302807827 302200718 301382999 300133724
3127.5C00133724o59408m41075q14171r64698r07746o75297m63962k94132m75846n22728
$$ 300133724 299474316 299033241 298219070 297254372 296346626 295671329 295207367 294913235 294437389 293914661
3137.1B93914661q63952n98335m63200j213703j057186q15030l35998l49274o15425
$$ 293914661 293050709 292452374 291989174 290775471 289718285 288903255 288567257 288217983 287602558
3145.8B87602558m91466j054535r94969l62606k35920p59163o89964m33578p42054
$$ 287602558 287111092 286056557 285061588 284698982 284463062 283703899 283013935 282580357 281838303
3154.5B81838303q18463j325302j133385l02543n00736q24376m16412l93085p97883
$$ 281838303 281019840 279694538 278561153 278258610 277757874 276933498 276517086 276124001 275326118
3163.1B75326118p67097n32646l63999r57145j030255n76553p45869m00905k03591
$$ 275326118 274559021 274026375 273662376 272705231 271674976 271098423 270352554 269951649 269748058
3171.8B69748058r36603j183491k24438k06451o54755p07645j075211n33924n19543
$$ 269748058 268811455 267627964 267403526 267197075 266542320 265834675 264759464 264225540 263705997
3180.5B63705997q40721q23002p56645m11873o29749o13899p40204r91268p57904j00861
$$ 263705997 262865276 262042274 261285629 260873756 260244007 259630108 258889904 257898636 257140732 257039871
3190.1B57039871N7430o09741o81820j050281j076966p18097o41041j46713l23429
$$ 257039871 257097301 256487560 255805740 254755459 253678493 252960396 252319355 252172642 251849213
3198.8B51849213o86150n33161l61023o24142o65874l34530m88510p86858r83467n93471
$$ 251849213 251163063 250629902 250268879 249644737 248978863 248644333 248155823 247368965 246385498 245792027
3208.5B45792027j72635l42674n97515p05242n50442n09815p20539o12049m43287p33986
$$ 245792027 245619392 245276718 244679203 243973961 243423519 242913704 242193165 241581116 241137829 240403843
3218.1B40403843q01354o80770l06454k1095k09809m48055q88252o44322o17065n73959
$$ 240403843 239602489 238921719 238615265 238594170 238384361 237936306 237048054 236403732 235786667 235212708
3227.8B35212708l05081o35948r8229j43718p02725r01890p03105k92969m94499k09809
$$ 235212708 234907627 234271679 234173450 234029732 233327007 232425117 231722012 231429043 230934544 230724735
3237.4B30724735m64706q06141n67589k51522r8743k68193J63288o06308r56974r8953
$$ 230724735 230260029 229453888 228886299 228634777 228536034 228267841 228431129 227824821 226867847 226768894
3247B26768894m79984o55232m20875n33505p64408k20337J32370m86545m28982k45647
$$ 226768894 226288910 225633678 225212803 224679298 223914890 223694553 223826923 223340378 222911396 222665749
3256.7B22665749n13726n90133n30358p43980n69019j54305k68879j93176l2635m11415
$$ 222665749 222152023 221561890 221031532 220287552 219718533 219564228 219295349 219102173 219069538 218658123
3266.3B18658123n71785N3864M7264l61672m80118n72452k27375l10269l95145l39165
$$ 218658123 218086338 218140202 218187466 217825794 217345676 216773224 216545849 216235580 215840435 215501270
3276B15501270n31730l02449l67450q14057o12373J78986J50623k60449l35636n91583
$$ 215501270 214969540 214667091 214299641 213485584 212873211 213052197 213202820 212942371 212606735 212015152
3285.6B12015152n45635l18909k09331Q8462N0145k98081j15929n15193r41945l31306
$$ 212015152 211469517 211150608 210941277 211029739 211079884 210781803 210665874 210150681 209208736 208877430
3295.3B08877430j37348k15988k71702M8828P0744m02756l98255n48915k62509p1239
$$ 208877430 208740082 208524094 208252392 208301220 208371964 207969208 207570953 207022038 206759529 206688290
3304.9B06688290k35138j09768q1177l63483o87371n32798p63703m70905L7021k3574
$$ 206688290 206453152 206343384 206262207 205898724 205211353 204678555 203914852 203443947 203480968 203457394
3314.6B03457394K6874m81834k69947J06582m87556r51557o91929j17550l90339o41632
$$ 203457394 203484268 203002434 202732487 202839069 202351513 201399956 200708027 200590477 200200138 199558506
3324.2A99558506l11432j37634m13551o95649o41422n82981l58696k06432l06950m80957
$$ 199558506 199247074 199109440 198695889 198000240 197358818 196775837 196417141 196210709 195903759 195422802
3333.8A95422802m72260n27744o45790l52859o0101m33388r95865o78482l75461j13507
$$ 195422802 194950542 194422798 193777008 193424149 193364048 192930660 191934795 191256313 190880852 190767345
3343.5A90767345J39943k70520n76992m39109l0709l60889o18382o87523n87139K45438
$$ 190767345 190907288 190636768 190059776 189620667 189589958 189229069 188610687 187923164 187336025 187581463
3353.1A87581463l4142l4904J21097o42223o06308q2798j36757m86011l6888j34297
$$ 187581463 187547321 187512417 187633514 186991291 186384983 186302185 186165428 185679417 185642529 185508232
3362.8A85508232k70405k7828n49259j85013m1962o58283m86679J34411L04031k346
$$ 185508232 185237827 185209999 184660740 184475727 184433765 183775482 183288803 183423214 183727245 183724899
3372.4A83724899n08785p27997P7515K59514k72122l28884m07104o05431l79848K60830
$$ 183724899 183216114 182488117 182565632 182825146 182553024 182224140 181817036 181211605 180831757 181092587
3382.1A81092587J66263j22852j96724m15669l25508K19326M71382k9525l720L73211
$$ 181092587 181258850 181135998 180939274 180523605 180198097 180417423 180888805 180859280 180855560 181228771
3391.7A81228771K30694p29198p60003K16485p668j66149j98784k63577N8804O1188
$$ 181228771 181459465 180730267 179970264 180186749 180179081 180012932 179814148 179550571 179609375 179670563
3401.3A79670563J58882K1591l63941n53551Q0052M17156J10531J98555J16062R4662
$$ 179670563 179829445 179851036 179487095 178933544 179013596 179430752 179541283 179739838 179855900 179950562
3411A79950562p9651K39162L64227k33898l03802l06855L49217N91106J40477K17876
$$ 179950562 179870911 180110073 180474300 180240402 179936600 179629745 179978962 180570068 180710545 180928421
3420.6A80928421J05095l2978j28441K27585M80308k2678J0433N226j77822N23434
$$ 180928421 181033516 181000538 180872097 181099682 181579990 181557312 181567745 181572971 181395149 181918583
3430.3A81918583O26717L41777J19229k62146M14524M39129J91421L21045J97563L65124
$$ 181918583 182545300 182887077 183006306 182744160 183158684 183597813 183789234 184110279 184307842 184672966
3439.9A84672966O5269O17314O91089J2188M23222M90685M70237j23195k31228N43670
$$ 184672966 184738235 185355549 186046638 186058826 186482048 186972733 187442970 187319775 187088547 187632217
3449.6A87632217R28574P62272K38228L03039N94101N00717K50683P87316N33008n8708
$$ 187632217 188560791 189323063 189561291 189864330 190458431 190959148 191209831 191997147 192530155 192471447
3459.2A92471447N38940N04132N89714L78818L10421N00908P48348J024361j49574
$$ 192471447 193010387 193514519 194104233 194483051 194793472 195294380 196042728 197067089 196917515
3467.9A96917515M62074R19037J34678M31461N16319Q23040N01366L88641P25365O36501
$$ 196917515 197379589 198298626 198433304 198864765 199381084 200204124 200705490 201094131 201819496 202455997
3477.5B02455997O84166P14207J158466O59867o2962L77007Q26015P79858P83863N08861
$$ 202455997 203140163 203854370 205012836 205672703 205609741 205986748 206812763 207592621 208376484 208885345
3487.2B08885345K44484J246491J017418J11198K95925Q69027R15412L63312P76844
$$ 208885345 209129829 210376320 211393738 211504936 211800861 212669888 213585300 213948612 214725456
3495.8B14725456P73525N10312R48028O94485M15115O41613Q86345Q85334O29406N68276
$$ 214725456 215498981 216009293 216957321 217651806 218066921 218708534 219594879 220480213 221109619 221677895
3505.5B21677895Q47931Q14495J053123O97460M49887J472072Q64182R05876J147823
$$ 221677895 222525826 223340321 224393444 225090904 225540791 227012863 227877045 228782921 229930744
3514.2B29930744O69403Q78468O11763P72228L23658L15666J053124J369514J084328
$$ 229930744 230600147 231478615 232090378 232862606 233186264 233501930 234555054 235924568 237008896
3522.9B37008896L8624Q15143J092072J253338J261310Q21762J559773J309681M30298
$$ 237008896 237047520 237862663 238954735 240208073 241469383 242291145 243850918 245160599 245590897
3531.5B45590897L34014J471196J224308Q77533J012115R9297J054630J777134J689472
$$ 245590897 245924911 247396107 248620415 249497948 250510063 250609360 251663990 253441124 255130596
3540.2B55130596J000672J255054J890678Q34694M51851O79398J675091J257038J251678
$$ 255130596 256131268 257386322 259277000 260111694 260563545 261242943 262918034 264175072 265426750
3548.9B65426750J750450J662369J418839j05095J813450J851673O74495J347485J370964
$$ 265426750 267177200 268839569 270258408 270153313 271966763 273818436 274492931 275840416 277211380
3557.6B77211380J523075J018581J628914J130600J868782J950951N40180K818127
$$ 277211380 278734455 279753036 281381950 282512550 284381332 286332283 286872463 289690590
3565.3B89690590R94453J136761J984062N5123K340641J837425J781807J939010J490384
$$ 289690590 290685043 291821804 293805866 293860989 296201630 298039055 299820862 301759872 303250256
3574C03250256Q45241J526642K347012J666908K734508J737175J098233J395301K040863
$$ 303250256 304095497 305622139 307969151 309636059 312370567 314107742 315205975 316601276 318642139
3582.6C18642139K706891J184692K844086J814918M4365J484871Q37288L348541K852554
$$ 318642139 321349030 322533722 325377808 327192726 327237091 328721962 329559250 332907791 335760345
3591.3C35760345L081284K300949O15921K229271Q02498K611732L054848J738510L318253
$$ 335760345 338841629 341142578 341758499 343987770 344790268 347402000 350456848 352195358 355513611
3600C55513611J832275J561165K462730J754456K023087L100509K948075O56662L453979
$$ 355513611 357345886 358907051 361369781 363124237 365147324 368247833 371195908 371852570 375306549
3608.7C75306549J839523L28637N301017J985932L78494M459648Q99277K980194L624535
$$ 375306549 377146072 377474709 382775726 384761658 385140152 389599800 390499077 393479271 397103806
3617.4C97103806J603088L252716J116180K209778L853760K624550K596931L495560
$$ 397103806 398706894 401959610 403075790 405285568 409139328 411763878 414360809 417856369
3625.1D17856369L140602L426056O091805J597862n779038L968926M812279N242919
$$ 417856369 420996971 424423027 430514832 432112694 426333656 430302582 435114861 440357780
3632.8D40357780K760354L35044L563462M060363L386002J869621J664048L240547
$$ 440357780 443118134 443453178 447016640 451077003 454463005 456332626 457996674 461237221
3640.5D61237221L732605K442436J850014L596687M802170O637459J564712k405739
$$ 461237221 464969826 467412262 469262276 472858963 477661133 484298592 485863304 483457565
3648.2D83457565N127640J207390p91321J058655N953751N471229M379883N785866
$$ 483457565 488585205 489792595 489001274 490059929 496013680 501484909 505864792 511650658
3655.9E11650658m880181J924439N658684K879219L344535J166382K784958K452850
$$ 511650658 506770477 508694916 514353600 517232819 520577354 521743736 524528694 526981544
3663.6E26981544K378388K893219J689949N006065K941590Q26950K173195n851670
$$ 526981544 529359932 532253151 533943100 538949165 541890755 542717705 544890900 539039230
3671.4E39039230K613678Q729210R124222J10779j5983391L805046R127159M385948
$$ 539039230 541652908 550382118 559506340 559617119 543633728 547438774 556565933 560951881
3679.1E60951881k113533J290856L529434K685661J990509R05152L84521M398689Q020325
$$ 560951881 558838348 560129204 563658638 566344299 568334808 569239960 569624481 574023170 582043495
3687.8E82043495p120933l926125Q407059m480820r89304N702210J325760J615372
$$ 582043495 574922562 570996437 579403496 574922676 573933372 579635582 580961342 582576714
3695.5E82576714J250076j20087J437454J315766K920303K741585m983330k080994
$$ 582576714 583826790 583706703 585144157 586459923 589380226 592121811 587138481 585057487
3703.2E85057487M855690K609215P99179Q78029L009186M402275o743126L641892N970916
$$ 585057487 589913177 592522392 593321571 594199600 597208786 601611061 594867935 598509827 604480743
3711.9F04480743j4715309K401848M825173J684570J603966J940803J706429k709618
$$ 604480743 589765434 592167282 596992455 598677025 600280991 602221794 603928223 601218605
3719.6F01218605P61070N935822j778794m575271M219284J633148l19176k510681k12440
$$ 601218605 601979675 607915497 606136703 601561432 605780716 607413864 607094688 604584007 604371567
3728.3F04371567L911438J403885N683746k234917p379188R450416R02329q262863
$$ 604371567 608283005 609686890 615370636 613135719 605756531 615206947 616109276 607846413
3736F07846413J34926J275787L28407K260513L570176l794175K697068J2508011r701386
$$ 607846413 607981339 609257126 609585533 611846046 615416222 611622047 614319115 626827126 617125740
3744.7F17125740j7626457J0244713N906715N473557l440667r817581J2639466l911629
$$ 617125740 599499283 609743996 615650711 621124268 617683601 607866020 620505486 616593857
3752.4F16593857r516907N248146M241905M085961m395027J746711N168610p753334
$$ 616593857 607076950 612325096 616567001 620652962 616257935 618004646 623173256 615419922
3760.1F15419922j113587M390297J568566K72712L561593j963845n232315K771645
$$ 615419922 614306335 618696632 620265198 620537910 624099503 622135658 616903343 619674988
3767.8F19674988M939384R45473q641892J728020L807869L59993L47290r72175J254119
$$ 619674988 624614372 625559845 616917953 618645973 622453842 622813835 623161125 622188950 623443069
3776.5F23443069R14116K551232L51333p254257K220001K360192J063080K250518k765693
$$ 623443069 624357185 626908417 627259750 620005493 622225494 624585686 625648766 627899284 625133591
3785.2F25133591j366806J541061P58667J52245l44887Q9340M93202Q98056j36223
$$ 625133591 623766785 625307846 626066513 626218758 625873871 625963211 626456413 627354469 627218246
3793.8F27218246Q82378L596573l124886n232849J889038M450875P002067n182647
$$ 627218246 628100624 631697197 628572311 623339462 625228500 629679375 636681442 631498795
3801.5F31498795j2237206L377075L027649M861603N353279j0262031m372559N754852
$$ 631498795 619261589 622638664 625666313 630527916 635881195 625619164 621246605 627001457
3809.3F27001457J915932m18434J207886J53236J202431O253700j161842j4649544
$$ 627001457 628917389 628498955 629706841 629860077 631062508 637316208 636154366 621504822
3817F21504822M160270N980568N058403L185959j6121711J124649N503158J499825
$$ 621504822 625665092 631645660 636704063 639890022 623768311 624892960 630396118 631895943
3824.7F31895943K062187j081772m995918O90231K843323L537178J202621r089126
$$ 631895943 633958130 632876358 627880440 628570671 631413994 634951172 636153793 627064667
3832.4F27064667K071686Q080444m958382j295128Q037911q166924m764480Q403473
$$ 627064667 629136353 637216797 632258415 630963287 639001198 630834274 626069794 634473267
3840.1F34473267m628945j501465O706810k078476m172363K656632J544075k49596
$$ 634473267 629844322 628342857 635049667 632971191 628798828 631455460 632999535 632749939
3847.8F32749939J539001n07659K010421N837860n803642l77121j4529075J185455
$$ 632749939 634288940 633781281 635791702 641629562 635825920 635448799 620919724 622105179
3855.6F22105179J1075744o10771k139778J854782K089920K433930n467377k53143
$$ 622105179 633180923 632570152 630430374 632285156 634375076 636809006 631341629 631088486
3863.3F31088486O651954m000930n769463K731743M552116O017151p704658r293251
$$ 631088486 637740440 633739510 627970047 630701790 635253906 641271057 633566399 624273148
3871F24273148N043068O112403L053322r202766N18417L831253n46798K370224L777809
$$ 624273148 629316216 635428619 638481941 629279175 629797592 633628845 633082047 635452271 639230080
3879.7F39230080m557267o390266M641724J204452J626015O038322j2834472r29642
$$ 639230080 634672813 628282547 632924271 634128723 635754738 641793060 628958588 628028946
3887.4F28028946L893547J634712M862862j671257p836418Q74519L159180r93653P52335
$$ 628028946 631922493 633557205 638420067 636748810 628912392 629786911 632946091 631952438 632704773
3896.1F32704773J324043K281380K063408j0183907M386139L180237n655861M135170
$$ 632704773 634028816 636310196 638373604 628189697 632575836 635756073 630100212 634235382
3903.8F34235382l378296p83996J235962J35421J817551j80931O13365n26848n59578
$$ 634235382 630857086 630073090 631309052 631444473 633262024 633081093 633694458 633167610 632608032
3912.5F32608032j33247p55463J640740K958831k975883m202538M015923K62260l493652
$$ 632608032 632474785 631719322 633360062 636318893 633343010 629140472 633156395 633418655 629925003
3921.1F29925003K292633J688652O73561k579460k728424J831589J008072M55017k49367
$$ 629925003 632217636 633906288 634579849 632000389 629271965 631103554 632111626 632566643 632317276
3929.8F32317276O1188J515884k321510k144928J319084P36084O9122N5619L6125J00937
$$ 632317276 632378464 633894348 631572838 629427910 630746994 631483078 631552200 631607819 631643944 631744881
3939.5F31744881k27738J735382J482010l828964j095505J175537L63541Q84781j549797
$$ 631744881 631517143 633252525 634734535 630905571 629810066 630985603 631349144 632233925 630684128
3948.1F30684128J73797K31171j761475J294976L79181l46794j70784o3096Q02308
$$ 630684128 630857925 631089096 629327621 630622597 631001778 630654984 630484200 630421104 631223412
3956.8F31223412k82670j50299j14402Q19091J1712j727334J8311J79634L34511L11813
$$ 631223412 630940742 630790443 630676041 631495132 631506844 629779510 629797821 629977455 630311966 630623779
3966.5F30623779k30331N22041K83280j25847K25143l08494k70195j54114p16820k26288
$$ 630623779 630393448 630915489 631198769 631072922 631298065 630989571 630719376 630565262 629848442 629622154
3976.1F29622154n53627O19812J551628K58675K00195j40953k32811n02701q0795K25144
$$ 629622154 629068527 629688339 631239967 631498642 631698837 631557884 631325073 630822372 630741577 630966721
3985.7F30966721n71518k91520l19900L26576L3531K36283O96563K57187O76689q94279
$$ 630966721 630395203 630103683 629783783 630110359 630143890 630380173 631076736 631333923 632010612 631116333
3995.4F31116333p45201L09410K49329L85360n3787
$$ 631116333 630371132 630680542 630929871 631315231 631261444
4000.2F31261444
$$ 631261444
##END=$$ End of the data block
