##TITLE=$$ Begin of the data block
##JCAMP-DX=5.00 $$ ACD/SpecManager v 10.08
##SPECTROMETER/DATA SYSTEM=Varian
##DATE=15 Jan 2013 09:53:26
##DATA TYPE=INFRARED SPECTRUM
##DATA CLASS=XYDATA
##ORIGIN=
##OWNER=
##NPOINTS=3735
##FIRSTX=399.26403809
##LASTX=4000.35498047
##MAXX=4000.35498047
##MINX=399.26403809
##MAXY=70.03572845
##MINY=17.99754715
##XFACTOR=1.0000000000
##YFACTOR=0.000000100000000
##FIRSTY=37.98957062
##DELTAX=0.96440572
##XUNITS=1/CM
##YUNITS=TRANSMITTANCE
##XYDATA=(X++(Y..Y))
399.3C79895706j0639229L183823N653839m320488j178856j192398K377815q403549
407C65376663n307083L977203n64155l439064m861641N643310O951981j31187l377266
415.7C64268761P49473N126190J272393L290100p966004o433487l216018k626724K197570
424.3C56662254N659180Q25424J307984K633018m670410J006699M017486j864929p197609
433C58379097n277061K422752p81441L11165R99336M952507K610131l122139P034645
441.7C67528992K600822m563103j153411J145706j205139m116326j37405J27678L036613
450.4C63264427J216545l104629j144486N681496J800652o825600k00958R06944J422157
459.1C63016548K368355j748161j413765j562691L51906j359596k294312j932259K84653
$$ y = [379895706, 369256477, 372440300, 378094139, 373773651, 372594795, 371402397, 373780212, 365376663, 360069580, 364046783, 363482628, 360043564, 355181923, 360825233, 367777214, 367646027, 364268761, 365018234, 370144424, 371416817, 374706917, 366740913, 360307426, 357091408, 354464684, 356662254, 362321434, 363146858, 364454842, 367087860, 362417450, 363424149, 367441635, 365576706, 358379097, 353102036, 355524788, 354743347, 355054512, 356053848, 361006355, 363616486, 360494347, 367528992, 370129814, 365566711, 364413300, 365559006, 364353867, 360237541, 360100136, 360227814, 363264427, 364480972, 361376343, 360231857, 365913353, 367714005, 360888405, 360687447, 361594391, 363016548, 365384903, 363636742, 362222977, 360660286, 361012192, 359652596, 357358284, 355426025, 355710678]
467.7C55710678J220589p22199J065598j321335j825295m162216k296447J086196r24720
476.4C47830849j342659Q84933L908348J403237j538048k259674o8817r27430l068199
485.1C44822540K279206J811180J815338M55017j771927m4594j735954k396240j118698
493.8C44115868J689415K49290p02362m47388l35846K409592N34782q17718j410904
502.5C45284729n69725k582512m771614n60036K126122K450027N49965j0261j46561
511.1C41770134J076508J640358k732392l974762l487358r52949K288475J475830M35180
519.8C37539024j462173j641502J90200R25408r87129j392136o44951R74884J631241
528.5C35132866p12242q19664l47328j473694n40962J367340J79519j94473N68695
$$ y = [355710678, 356931267, 356209068, 357274666, 355953331, 354128036, 349965820, 347669373, 348755569, 347830849, 346488190, 347373123, 351281471, 352684708, 351146660, 348886986, 348818169, 347890739, 344822540, 347101746, 348912926, 350728264, 351183281, 349411354, 349366760, 347630806, 345234566, 344115868, 345805283, 346054573, 345352211, 344904823, 344568977, 346978569, 347513351, 346695633, 345284729, 344715004, 342132492, 337360878, 336800842, 338926964, 341376991, 341926956, 341916695, 341770134, 342846642, 344487000, 341754608, 337779846, 334292488, 333339539, 335628014, 337103844, 337539024, 336076851, 334435349, 334625549, 335550957, 334563828, 333171692, 332526741, 333501625, 335132866, 334420624, 333600960, 333253632, 331779938, 331238976, 332606316, 332785835, 332591362, 333160057]
537.2C33160057j020508j308098N7908J165161M4555j290970k318992j426163Q58383
545.9C27921333o82869j088218K24037L144188J543617l327904k234192j157112j037178
554.5C23305702p57446J062050j82610k470054o56929L22151J526642L56025O98738
563.2C23204269k58636k133026O05469l1853o2866N94825J341401J587333n32532j81388
572.9C24132996k98462j184883j391831m33388J52054P05834J330909M16184K38075
581.5C23667488o31027j516075j735802P24335K660370l12310j348533M31747O62804
590.2C22602997Q1444K51884j81541M26483O86302k76375K18849K49138J402626J057358
599.9C26519165j240463o47507K93961L00674p22999k093392j143570R23920j6403
$$ y = [333160057, 332139549, 330831451, 330889359, 332054520, 332099075, 330808105, 328489113, 327062950, 327921333, 327238464, 326150246, 326374283, 329518471, 331062088, 327734184, 325499992, 324342880, 323305702, 322548256, 323610306, 323427696, 320957642, 320300713, 320622864, 322149506, 322505531, 323204269, 322945633, 320812607, 321418076, 321386223, 321323357, 321918182, 323259583, 324846916, 324314384, 324132996, 323834534, 322649651, 321257820, 320824432, 320976486, 321682320, 323013229, 323429413, 323667488, 323036461, 321520386, 319784584, 320508919, 323169289, 322856979, 321508446, 321940193, 322602997, 322684441, 322936325, 322754784, 323181267, 323867569, 323591194, 323810043, 324059181, 325461807, 326519165, 325278702, 324631195, 324925156, 325225830, 324502831, 322409439, 321265869, 322189789, 322173386]
608.5C22173386n50194o45790q41484R65233q77953j684322k17514m1733r1820q63380
618.2C17324429n71461k29149J541634J411113L18108O28490o83002L06606J637230
626.9C21683998J033363J267586J924401P69577P53288J808777J012115J384278R56726
635.5C32594109J332473K310677J037941J109123J112785K9107N74417J971435J035004
644.2C43107071N94330J235199M00085J091767J500053R78126P98035O3172N20286
652.9C50288124J242256J09482q59184L28102N42221n55000m93927O9275j68000j258468
662.5C49244881r78394m41780M7493J295166L677063N889130n254517k312279j2512
671.2C51154251L66631P02362J608352J977730R12361J41220N53742J199531J232262
$$ y = [322173386, 321623192, 320977402, 320135918, 321101151, 320223198, 318538876, 318321362, 318279629, 318187809, 317324429, 316752968, 316523819, 318065453, 319476566, 319794674, 320423164, 319740162, 320046768, 321683998, 322717361, 323984947, 325909348, 326678925, 327432213, 329240990, 330253105, 331637383, 332594109, 333926582, 336237259, 337275200, 338384323, 339497108, 339526215, 340100632, 342072067, 343107071, 343701401, 344936600, 345336685, 346428452, 347928505, 348906631, 349704666, 349767838, 350288124, 351530380, 351639862, 350780678, 351108780, 351651001, 351096001, 350602074, 350671349, 350503349, 349244881, 348266487, 347824707, 347872200, 349167366, 352844429, 358733559, 353479042, 351166763, 351154251, 351520882, 352223244, 353831596, 355809326, 356721687, 356862907, 357416649, 358616180, 359848442]
679.9C59848442J457024J834716R42269P79571J024323R79919J087723k58102J32446
688.6C67828331J885147J026878K10686p1602K07520J122436O04058Q34350J143685
697.3C74791489K89611K82898K25678K15759J23978J75896P70683M75273Q42209J002197
706.9C79195671K13547M25911P32193P46841N81398J137047J212921M41895J519546
715.6C86206970Q46710n62896L26996K92396P57179J331177N97725O74286J159592
724.3C91630135R66720l53737n8326J798439J573791Q20198K73171L16467K029304
733C98996162J115075o62041Q90388J562500O90346M77257k9411l57781N44777P31964
742.6D03959236L48625R37538R92737Q87909P39060N82390O21681P37571J034584l51486
$$ y = [359848442, 361305466, 363140182, 364082451, 364862022, 365886345, 366866264, 367953987, 367695885, 367828331, 369713478, 370740356, 370951042, 370879440, 371086960, 372209396, 372813454, 373647804, 374791489, 375081100, 375363998, 375589676, 375805435, 375929413, 376105309, 376875992, 377351265, 378193474, 379195671, 379409218, 379835129, 380567322, 381314163, 381895561, 383032608, 384245529, 384687424, 386206970, 387053680, 386490784, 386817780, 387110176, 387867355, 389198532, 389796257, 390470543, 391630135, 392596855, 392243118, 392184792, 393983231, 395557022, 396377220, 396650391, 396966858, 398996162, 400111237, 399449196, 400339584, 401902084, 402592430, 403069687, 403040276, 402682495, 403227272, 403959236, 404307861, 405245399, 406238136, 407126045, 407865105, 408447495, 409069176, 409806747, 410841331, 410489845]
752.2D10489845l45535J264801O53877O03562K275543K353516J124153J037254Q72765
760.9D20329781L85704P09457J199074J031189J113014J197014R9602P68280N96351
769.6D27429466p62901J43738J52664J03874Q09479J33743q15391L67584Q55598k85568
779.2D28132286J04294M72908L57437m23965j75400R47075J044120R15223L55301R84115
788.9D32713394O00701k4415N34630Q698l18794m00887k54135k35443N54809M73442
798.5D33652000p95364j012917j150665m76761p56263j771775j760597j523514j143379
807.2D23260765m50363j081276k239914j338768j195946j814766j969337j905861j720200
815.9D09544334q97102O06117L31307J00631M10424K91939L84597J505356K303963
$$ y = [410489845, 410144310, 411409111, 412062988, 412666550, 414942093, 417295609, 418419762, 419457016, 420329781, 420715485, 421424942, 422624016, 423655205, 424768219, 425965233, 426064835, 426833115, 427429466, 426666565, 426810303, 426962967, 427066841, 427876320, 428010063, 427194672, 427562256, 428417854, 428132286, 428236580, 428709488, 429066925, 428642960, 428467560, 429414635, 430458755, 431373978, 431729279, 432713394, 433314095, 433289680, 433824310, 433833008, 433514214, 433113327, 432859192, 432623749, 433178558, 433652000, 432856636, 431843719, 430693054, 430216293, 429460030, 427688255, 425927658, 424404144, 423260765, 422810402, 421729126, 419489212, 418150444, 416954498, 415139732, 413170395, 411264534, 409544334, 408647232, 409253349, 409584656, 409685287, 410095711, 410387650, 410772247, 412277603, 414581566]
824.6D14581566J361847K430305L305512L528900L619881K272949K709732K611389
832.3D36422081L273811L408280K447281K831726K023391J746102J606064K795066
840D56553802K882691J278114R61724J017456J900749J688804J935158J418457M82140
848.7D70119095P01713J361351K299958J143799J532630K411690J271172p9689r0142
857.4D80671577J457673K739448K402229J003914J288071J181793Q23593l97987q35266
866D90335045k59743j578522q76236p58171n08537l65066q83217j709862k550850j129150
875.7D79715691j956215j149941q45566j352729k95411j157493p33719j104088o52084
884.4D70468445n29862r22546l46603j201325q42018k02065J055413R76639O17218
$$ y = [414581566, 415943413, 418373718, 421679230, 425208130, 428828011, 431100960, 433810692, 436422081, 439695892, 443104172, 445551453, 448383179, 450406570, 452152672, 453758736, 456553802, 459436493, 460714607, 461676331, 462693787, 464594536, 466283340, 468218498, 469636955, 470119095, 470820808, 472182159, 474482117, 475625916, 477158546, 479570236, 480841408, 480761719, 480671577, 482129250, 484868698, 487270927, 488274841, 489562912, 490744705, 491568298, 491170311, 490335045, 490075302, 488496780, 487620544, 486862373, 486353836, 485988770, 485105553, 483395691, 480844841, 479715691, 477759476, 476609535, 475763969, 474411240, 474115829, 472958336, 472224617, 471120529, 470468445, 469938583, 469016037, 468669434, 467468109, 466626091, 466424026, 467479439, 468456078, 469073296]
893D69073296N02472J57890J075897k70576m81759k78015p00988p64389q774J164322
902.7D69469376M89387J508904J854972J850358J800613J248741J815071R98421J429329
911.4D82465172J669845Q51937L78952J36032j225739k939720k785339l218498k924691
920D72407951k569198k581940k517548k520103k953224l497162l200874m105568m645233
928.7D43817101m884186l713379k372666j942482o25763j402854j723175q52700j039734
937.4D25260162j648254k120018j623688q35914m07486p04689l32451j24092j71967
946.1D17291603J05476o40220j157112j064797l4790Q79059P49970q3275n9700J42517
955.7D16128731j391068j999511k638779k970772l207397k852669r27086q05779j220703
$$ y = [469073296, 469575768, 469733658, 470809555, 470538979, 470057220, 469779205, 469078217, 468313828, 468305054, 469469376, 469958763, 471467667, 473322639, 475172997, 476973610, 478222351, 480037422, 481035843, 482465172, 484135017, 484986954, 485365906, 485501938, 484276199, 481336479, 478551140, 475332642, 472407951, 469838753, 467256813, 464739265, 462219162, 459265938, 455768776, 452567902, 448462334, 443817101, 438932915, 435219536, 432846870, 430904388, 430278625, 428875771, 427152596, 426299896, 425260162, 423611908, 421491890, 419868202, 419032288, 418624802, 417920113, 417587662, 417463570, 417291603, 417397079, 416756859, 415599747, 414534950, 414500160, 415379219, 416129189, 416045914, 415986214, 416128731, 414737663, 412738152, 410099373, 407128601, 403921204, 401068535, 400141449, 399335670, 398114967]
964.4C98114967j496582j325798j773033k683830k638474k872047k328186k255974
972.1C80741043k275886k422295k669907k451858l119049l900528n136223n163841
979.8C53601456m346848m418106m380073m583321m868279m360237m193687m972973
987.6C17477932n169430m397964l883381m041844l969078l441181k695885k531509
995.3B87347660k016315k306919k810116k346077l427048k843609k452526k712593
1003B66432457j606770j789226j695538j590137j501808j829567k227021k480888j667766
1011.7B50043736j067067k095966j275654j866970j852302j566296k502613k549572
1019.4B35267296l039627j935654j997852j506386j496735k188415j238594j057911
$$ y = [398114967, 396618385, 395292587, 393519554, 390835724, 388197250, 385325203, 382997017, 380741043, 378465157, 376042862, 373372955, 370921097, 367802048, 363901520, 358765297, 353601456, 349254608, 344836502, 340456429, 335873108, 331004829, 326644592, 322450905, 317477932, 312308502, 307910538, 304027157, 299985313, 296016235, 292575054, 289879169, 287347660, 285331345, 283024426, 280214310, 277868233, 274441185, 271597576, 269145050, 266432457, 264825687, 263036461, 261340923, 259750786, 258248978, 256419411, 254192390, 251711502, 250043736, 248976669, 246880703, 245605049, 243738079, 241885777, 240319481, 237816868, 235267296, 232227669, 230292015, 228294163, 226787777, 225291042, 223102627, 221864033, 220806122]
1027.1B20806122o88248j285534m38576r58118j283779o56395r79977L45517Q7032
1035.8B14948044J498413J479244J018639J703357J093464J201687M42143R14421N35011
1044.5B24834423O15425j00899r56077K48871n80540q38070j065502j58177j110382
1053.1B20889072j935157p63607r03092L44582o83518q0700R81617O74210J306686
1061.8B19830093J350956J382523J096973J910515J517964K228107J930809J056404
1069.5B32304344J427422N63488P06062n69496L32985J016369j03207R1171L20855
1078.2B36089993M86984n46646P19757P29027L77502R69257J034165R66930L06568
1086.9B41133537K317162J734905R59759J253261J580220J869983O87447J456985J049939
$$ y = [220806122, 220117874, 218832340, 218393764, 217435646, 216151867, 215495472, 214515495, 214861012, 214948044, 216446457, 217925701, 218944340, 220647697, 221741161, 222942848, 223384991, 224299412, 224834423, 225449848, 225348949, 224392872, 224641743, 224061203, 223223133, 222157631, 221999454, 220889072, 218953915, 218190308, 217287216, 217631798, 216948280, 216867580, 217849197, 218523407, 219830093, 221181049, 222563572, 223660545, 225571060, 227089024, 229317131, 231247940, 232304344, 233731766, 234295254, 235001316, 234431820, 234764805, 235781174, 235677967, 235769138, 236089993, 236576977, 236030331, 236750088, 237479115, 237856617, 238825874, 239860039, 240826969, 241133537, 243450699, 245185604, 246145363, 247398624, 248978844, 250848827, 251536274, 252993259, 254043198]
1095.6B54043198J491508J155033J258812K049580O82869J407604J062145J524925
1103.3B64675674J328736J334228K805634J629600P73201L96996Q24604P45392J334972
1112B75849037J507950P44667J479797O77395J92337L03707N60952M40864K3804n29347
1121.6B81251163j226100K53315R91096R36604P71961J321277J598988J050301J718368
1130.3B88666973J810265J563606J273155K199154K768250K699585K490692K391205
1138C05862885K653808J002083J415882J644192Q97121J300755Q02059J318493J087818
1146.7C17985096O23379Q90941N60551o4449n03159q2626j51100k34661m98562k30465
1156.3C18294945N18722l32164j012040r78107j071224p23477K68898N79129J150322
$$ y = [254043198, 255534706, 256689739, 257948551, 259998131, 260681000, 262088604, 263150749, 264675674, 266004410, 267338638, 270144272, 271773872, 272547073, 272944069, 273768673, 274514065, 275849037, 277356987, 278101654, 279581451, 280258846, 280451183, 280754890, 281315842, 281756706, 281780510, 281251163, 280025063, 280278378, 281269474, 282206078, 282978039, 284299316, 285898304, 286948605, 288666973, 290477238, 292040844, 293313999, 295513153, 298281403, 300980988, 303471680, 305862885, 308516693, 309518776, 310934658, 312578850, 313475971, 314776726, 315578785, 316897278, 317985096, 318608475, 319499416, 320059967, 319995518, 319492359, 319409733, 319258633, 319023972, 318525410, 318294945, 318813667, 318481503, 317469463, 316491356, 315420132, 314696655, 314965553, 315544682, 316695004]
1165C16695004J705894J805286K599259K595024K836227K406464J761627K481995L097572
1173.7C37984352K880783K586746K947808L261146L241387K364540K116928K204666
1181.4C59588356J522827J263237J825981K072106J984482J904754P95441L02925k7390
1190.1C71232719k37083j75247l71857L5248k12936o65703p50008l16696n49774j608391
1199.7C66380272j761704j611824j097831r19342j161538j213531r16405k41546n8632
1208.4C57397919P3204l21427o55594n01251l53126j03722o01921l74069K36702L39622
1218C55136337J78757m64516o78177r52758r61762q69598q25920m23088l90854k62566
1227.7C49485855l26309o06232q48961j102295j412582j296692n20630l75786l04603
$$ y = [316695004, 318400898, 320206184, 322805443, 325400467, 328236694, 330643158, 332404785, 334886780, 337984352, 340865135, 343451881, 346399689, 349660835, 352902222, 355266762, 357383690, 359588356, 361111183, 362374420, 364200401, 366272507, 368256989, 370161743, 370957184, 371260109, 371232719, 370995636, 370820389, 370448532, 370483780, 370270844, 369605141, 368855133, 368538437, 367988663, 366380272, 364618568, 363006744, 361908913, 360989571, 359828033, 358614502, 357698097, 357456551, 357397919, 357471123, 357149696, 356494102, 355992851, 355639725, 355536003, 354934082, 354560013, 354796715, 355136337, 355315094, 354850578, 354172401, 353219643, 352257881, 351388283, 350562363, 350139275, 349748421, 349485855, 349159546, 348553314, 347704353, 346602058, 345189476, 343892784, 343372154, 342996368, 342691765]
1236.4C42691765j19934L84865M70924l65715n55496r57451q68683o09894p78007l94593
1246C38897781k26554p1183j60560l1777Q3542k13966n84107q26378l43780q6708j16501
1256.6C36319809j2322K20643j8540k15568n1690j64413J69907K39181L89862K12822
1266.3C37089691J43089J197930J271362O65741O28624Q21953N20515L52288N83763
1274.9C43274956R04770R00612R69619J397019J022377Q47702Q54759J098251J559258
1283.6C52829323J250763Q92753J235199J483727R30824J203613J235314R68056J031227
1292.3C63060799P84149O48269L97683N30090O33583O72379M70962O34766P18460M6577
1301.9C68597717l6277j57929j26038l11241j38893j09024l59726O6338k75612l23525
$$ y = [342691765, 342571831, 342956696, 343427620, 343061905, 342506409, 341548958, 340680275, 340070381, 339292374, 338897781, 338671227, 338600044, 338439484, 338407707, 338491249, 338277283, 337693176, 336866798, 336523018, 336436310, 336319809, 336307487, 336528130, 336509590, 336294022, 336242332, 336077919, 336247826, 336487007, 336876869, 337089691, 337232780, 338430710, 339702072, 340367813, 340996437, 341818390, 342338905, 342691193, 343274956, 344179726, 345080338, 346049957, 347446976, 348469353, 349317055, 350171814, 351270065, 352829323, 354080086, 354972839, 356208038, 357691765, 358622589, 359826202, 361061516, 362029572, 363060799, 363844948, 364493217, 364890900, 365420990, 366054573, 366726952, 367197914, 367832680, 368551140, 368597717, 368561440, 368403511, 368277473, 367966232, 367827339, 367718315, 367358589, 367424927, 367149315, 366825790]
1311.6C66825790n76744p56569p18498q25996q354K85759M86793N29022P16057J187058
1321.2C67144318J306953J206818K90756K57797O18515N04418K12173K27432J01281
1329.9C71870461l42827k97318p19032q73108m75159J73455K52456j63460k822k03705
1339.6C69218941O88705J300087R48944O20499N62363P39975O09588Q34732O10008
1348.2C76133842P01180J88484l26767m80423o22749k0294m24004k28348M2572j70746
1357.9C74792747m37583m63181n16319q26531O218o61735l52936k48070m89998p934
1367.5C70794678p74689p26624o15997j75896k40287n11284O4544k30827L18642j73645
1377.2C67728615k19536l88565m78096n21393j289520j103325j724014j246643q46329
$$ y = [366825790, 366249046, 365492477, 364773979, 363947983, 363939629, 364225388, 364712181, 365241203, 365957260, 367144318, 368451271, 369658089, 369948845, 370206642, 370825157, 371329575, 371541748, 371769180, 371870461, 371527634, 371230316, 370511284, 369638176, 369163017, 369336472, 369588928, 369425468, 369422646, 369218941, 369907646, 371207733, 372156677, 372777176, 373339539, 374079514, 374689102, 375523834, 376133842, 376835022, 377023506, 376696739, 376216316, 375593567, 375573273, 375149269, 374920921, 374963493, 374792747, 374355164, 373891983, 373375664, 372549133, 372555351, 371893616, 371540680, 371292610, 370802612, 370794678, 370019989, 369293365, 368677368, 368501472, 368261185, 367749901, 367814445, 367583618, 367902260, 367728615, 367509079, 367120514, 366642418, 366121025, 364831505, 363728180, 362004166, 360757523, 359911194]
1385.8C59911194j473389k029800j515961j006012j952896j898346j732941j653099
1393.6C46648750k505722l151321j312714j513023j749153l366890k447357j193009
1401.3C29409561k454681k108345j578713k312355k589397j603413j104774j592236
1409C14065647j311664j498108j400013j342392j343384j075173j148815m17194o98051
1417.7C03830853M4307r86404m93317J134091R53L35312p45983L60279J275444P01237
1427.3C05456772J415481R15661J276341M63924J256657J808605J714611K517662J963787
1436C18789501J871853J349182K633667J657067J841774K445068J208420J575622J084481
1444.7C34456635K239570J487579J328698K072792J596946K386551J100006J854439
$$ y = [359911194, 358437805, 356408005, 354892044, 353886032, 351933136, 350034790, 348301849, 346648750, 344143028, 340991707, 339678993, 338165970, 336416817, 333049927, 330602570, 329409561, 326954880, 324846535, 323267822, 320955467, 318366070, 316762657, 315657883, 314065647, 312753983, 311255875, 309855862, 308513470, 307170086, 306094913, 304946098, 304528904, 303830853, 303875160, 302888756, 302395439, 303529530, 303530483, 303865795, 303119812, 303480091, 304755535, 305456772, 306872253, 307787914, 309064255, 309528179, 310784836, 312593441, 314308052, 316825714, 318789501, 320661354, 322010536, 324644203, 326301270, 328143044, 330588112, 331796532, 333372154, 334456635, 336696205, 338183784, 339512482, 341585274, 343182220, 345568771, 346668777, 348523216]
1452.4C48523216J207047J693306K059974j77574J175118J456413L519821J643562
1460.1C61100883K542153J983757J575508K721825J55449K171211K255974K560577
1467.8C77067337K409134K449760L387871K063294L357811K481613L182106K846145
1475.5C99245071J846161K825013K608299K623558K292480K233849J850624J838722
1483.2D17363777J731987J519280J509781Q2550Q78906K508011P94296n45960O92177
1491.9D26534805N30052m33654j98860l75214m466972K06489n71136k869835m71726
1500.6D17883949r69047j117211r47075M03595K18964k480545l299980j006394N60074
1509.3D09246330o57806P55463n24827j435546l94745j190682m72221j741371j981278
$$ y = [348523216, 349730263, 351423569, 353483543, 353305969, 354481087, 355937500, 359457321, 361100883, 363643036, 365626793, 367202301, 369924126, 370079575, 372250786, 374506760, 377067337, 379476471, 381926231, 385314102, 387377396, 390735207, 393216820, 396398926, 399245071, 401091232, 403916245, 406524544, 409148102, 411440582, 413674431, 415525055, 417363777, 419095764, 420615044, 422124825, 422207375, 423086281, 425594292, 426388588, 425842628, 426534805, 427064857, 426631203, 426432343, 426057129, 421590157, 421796646, 421225510, 418355675, 417883949, 416914902, 415797691, 414850616, 415254211, 415473175, 412992630, 409692650, 408686256, 409246330, 408588524, 409343987, 408819160, 407383614, 406988869, 405798187, 405325966, 403584595, 401603317]
1518D01603317J315346J796837j463623j843033J300507P88879J528130r76449J69983
1526.6D04219894J100731P21817Q10967P95517J107597M06990P25327j578560Q19359
1535.3D09129639J293525N18456J578064j719322l348885J794128J487122n78880J040535
1544D11194382J098594j355857P41348J6823R03816k11907j593132J99891j45722R88884
1553.6D11837120k866936p39479R35631Q73947m470672j2496224N508118K73819R63363
1562.3C99818687j554031k047157l577233l225898j030503k815361j600494p748032
1570C76219978k471466k307472l898659l013000l366585j445312j1684266j827201
1577.7C46206017l150368m173050l860855n239640l102684n669059l658734m885177
$$ y = [401603317, 402918663, 404715500, 403251877, 401408844, 402709351, 403498230, 405026360, 404049911, 404219894, 405320625, 406042442, 406853409, 407648926, 408756523, 409163513, 409888840, 408310280, 409129639, 410423164, 410941620, 412519684, 410800362, 407451477, 409245605, 410732727, 410153847, 411194382, 412292976, 410937119, 411678467, 411695290, 412599106, 412387199, 410794067, 410993958, 410848236, 411837120, 408970184, 408230705, 409166336, 410040283, 405569611, 393073387, 398581505, 398855324, 399818687, 398264656, 396217499, 392640266, 389414368, 388383865, 385568504, 383968010, 376219978, 373748512, 371441040, 367542381, 364529381, 361162796, 359717484, 348033218, 346206017, 343055649, 338882599, 335021744, 329782104, 326679420, 321010361, 317351627, 312466450]
1585.5C12466450l813248l865051n054913l128757n425511k518787m867458l095417
1593.2B80697308l600636m616432k330094m381389j583023l830605j896381l144283
1600.9B55314465k946110j828728l747997p42417l020057o41709k665462j166096r33189
1609.6B37622700k535038N48725k306156J00651k215024j14841K32182m224530K036896
1618.2B29145565q87356J365376j240158R26609J48449j073342J483517o56490K156238
1626.9B31368408q32958J428490O08749Q08277J133862K39849K929611J72157J431866
1635.6B39288311j525822K784233K195816J108399K257156L63007K805805P22542K258396
1644.3B52257843J759434O52561L221111r85737L773251J066265L330669L067379J189633
$$ y = [312466450, 308653202, 304788151, 299733238, 296604481, 291178970, 288660183, 283792725, 280697308, 277096672, 272480240, 270150146, 265768757, 264185734, 260355129, 258458748, 255314465, 252368355, 250539627, 246791630, 246049213, 243029156, 242387447, 239721985, 238555889, 237622700, 235087662, 235636387, 233330231, 233430882, 231215858, 231101017, 231333199, 227108669, 229145565, 228258209, 229623585, 228383427, 229310036, 229458485, 228385143, 229868660, 229212170, 231368408, 230535450, 231963940, 232572689, 233380966, 234514828, 234754677, 237684288, 237856445, 239288311, 237762489, 240546722, 242742538, 243850937, 246108093, 246471100, 249276905, 249999447, 252257843, 254017277, 254669838, 257890949, 256905212, 260678463, 261744728, 265075397, 268142776, 269332409]
1653B69332409j076012l08265M269714R35745K019234J274776K085286K308425J842118
1661.6B82683430L586120P09687L137378K007790L052254K839641K293110L153629
1669.4C03463039J540814N007629K360192L794574L184071K043724L394737L399430
1677.1C28188210M367294K734337M286804L532257M951439N546112L675346N391579
1684.8C62673378O42891N579185M094429M155655M709931M311828N218926M443550
1692.5C95829773N071297M508247M402504K276115N206871O055413N901336M958649
1700.2D34210205q74023O981315N470886M713707L460465L291664K853546K532807
1707.9D62640572L864669K549858K157593K586441L051834L670082J847497J415710
$$ y = [269332409, 268256397, 267948132, 272217846, 273153591, 275172825, 276447601, 278532887, 280841312, 282683430, 286269550, 286979237, 290116615, 292124405, 295176659, 298016300, 300309410, 303463039, 305003853, 310011482, 312371674, 316166248, 319350319, 321394043, 324788780, 328188210, 332555504, 335289841, 339576645, 343108902, 348060341, 353606453, 357281799, 362673378, 363316269, 368895454, 372989883, 377145538, 381855469, 386167297, 391386223, 395829773, 400901070, 405409317, 409811821, 412087936, 417294807, 423350220, 429251556, 434210205, 433336182, 440317497, 445788383, 450502090, 453962555, 457254219, 460107765, 462640572, 466505241, 469055099, 471212692, 473799133, 476850967, 480521049, 482368546, 483784256]
1715.6D83784256L200417J547775m597511L454742M260483K507210J973915J760673
1723.4D97891960J435280J679726J840400J390572J616859J890679j59760L49198L625831
1732E11560745M140053r54781k933960M965287M288177K195702K978554J056785j085701
1740.7E26210861M338837L680382K078018L023643M365044M072266K774810L303299
1748.4E53847160K366295M659386J939964J513405O071968M461365M398956M236641
1756.2E83495140J619759K414627L129501L002586L515778N608R02481M413604K844849
1764.8F05343933K371445K803840K567063j059876J924324M541779L88985k349053
1772.5F16532440m53529N022926L025475J29776K998466J391945J801148O02912j163902
$$ y = [483784256, 486984673, 488532448, 483934937, 487389679, 491650162, 494157372, 496131287, 497891960, 499327240, 501006966, 502847366, 504237938, 505854797, 507745476, 507585716, 507934914, 511560745, 515700798, 514746017, 511812057, 516777344, 521065521, 523261223, 526239777, 527296562, 526210861, 530549698, 534230080, 536308098, 539331741, 543696785, 547769051, 550543861, 553847160, 556213455, 560872841, 562812805, 564326210, 570398178, 574859543, 579258499, 583495140, 585114899, 587529526, 590659027, 593661613, 597177391, 597182999, 598085480, 602499084, 605343933, 607715378, 610519218, 613086281, 612026405, 613950729, 618492508, 618881493, 616532440, 616078911, 621101837, 624127312, 624257088, 627255554, 628647499, 630448647, 631051559, 629887657]
1781.2F29887657J089325J853829J964645J45264J343879K283058J381455Q03375J381378
1789.9F42133865Q03681Q42590j357880q72650M264527J976700K82516J766510K004623
1798.6F51844482O04706j201858J982269j15204L92914J452789O68488J788330R46045
1807.3F58362961J117477J274643J484375o34231j55487R02938J55182J217957N41382
1815.9F64267197J605148P52335O77261J155167j35880J025620j01700J386947J557694
1824.6F72189789k312546k2125K000656K583466P64389k803650P05566K324142L15094
1833.3F75744781K69547K99149N03921P46002n28412J375199R81827R61685O77490
1842F81031189R15222O18210n368652J796951K552566N40696P0114P54318J477356
$$ y = [629887657, 630976982, 632830811, 634795456, 634940720, 636284599, 638567657, 639949112, 640752487, 642133865, 642937546, 643780136, 642422256, 641549606, 645814133, 647790833, 648073349, 649839859, 651844482, 652449188, 651247330, 653229599, 653114395, 653507309, 654960098, 655628586, 657416916, 658362961, 659480438, 660755081, 662239456, 661605225, 661449738, 662352676, 662507858, 663725815, 664267197, 665872345, 666624680, 667301941, 668457108, 668321228, 669346848, 669245148, 670632095, 672189789, 669877243, 669855118, 671855774, 674439240, 675203629, 672399979, 673105545, 675429687, 675744781, 676014328, 676313477, 676817398, 677563400, 677034988, 678410187, 679392014, 680353699, 681031189, 681946411, 682564621, 677195969, 678992920, 681545486, 682086182, 682156296, 682910614, 684387970]
1850.7F84387970K42233R03702j83639k37885j20697j45874P94830J06888Q06732P47528
1860.3F87301788J033478L13034L83682K66495m36783L69110q95767N36423m61578
1869F88409882p27311K018662J692200R02633l09601k7923q07648j39999M6463j55792
1878.6F90901566R19647N93109J246490K56119K53754P5760k84806n7373q25042P68661
1888.3F93847885J34125q61511R49249J604919N10331o2333m12445j049194P42111
1896.9F95403137j05972k15683K41775J57700Q08945N31311R29031l662j00403m19769
1906.6F97226410o05316k8763J85547J63040m24728J606292R59320K83585k0218m38080
1916.2F98907089P85370k504806r16367J274948Q44116Q78449l85208j77536K63672
$$ y = [684387970, 684630203, 685533905, 685350266, 685112381, 684991684, 684845810, 685640640, 685747528, 686554260, 687301788, 688335266, 688648300, 689031982, 689298477, 688861694, 689230804, 688335037, 688871460, 688409882, 687682571, 689701233, 691393433, 692296066, 691986465, 691958542, 691150894, 691010895, 691057358, 690901566, 691821213, 692414322, 693660812, 693916931, 694170685, 694246445, 693961639, 693904266, 693079224, 693847885, 693982010, 693120499, 694069748, 695674667, 696184998, 696122665, 695710220, 694661026, 695403137, 695297165, 695081482, 695323257, 695480957, 696289902, 696821213, 697750244, 697746582, 697646179, 697226410, 696621094, 696592331, 696777878, 696940918, 696516190, 698122482, 699081802, 699365387, 699345169, 698907089, 699692459, 697187653, 696271286, 697546234, 698390350, 699268799, 698883591, 698706055, 698969727]
1924.9F98969727L61023l44239l7842k89154m80499Q4534r1782N84488M27780R73816
1934.6G00157852J99433m54789m71344p11441M3869l68881R34830o1264j240845R22775
1944.2F98950195O95496J2436m77066m9820m44565l18375j54037K2201L19825J4190
1953.8F98570480O38275r3460o408j67084m66461l85971m81186j8692m57154M49067
1963.5F97581406M17938Q48770P59354q95844o10733m51507m4022n83649K24533P05033
1973.1F97951279j4649J59378j26037L63083l00751j80512k58560n49011j43356l96881
1982.8F96503983J47628l6468M96139M91257K64282k94876p69806K66419m77448q12378
1992.4F95778732j11236M80575l7689L4943L41491l66363K41394m52499l21351l79943
$$ y = [698969727, 699330750, 698986511, 698948669, 698659515, 698179016, 698263550, 698171768, 698756256, 699184036, 700157852, 700357285, 699902496, 699431152, 698719711, 698763580, 698394699, 699329529, 699268265, 698027420, 698950195, 699645691, 699658127, 699181061, 699131241, 698686676, 698368301, 698214264, 698236465, 698556290, 698570480, 699208755, 699115295, 699108887, 698941803, 698475342, 698089371, 697608185, 697589493, 697132339, 697581406, 697999344, 698848114, 699607468, 698711624, 698100891, 697649384, 697605362, 697021713, 697246246, 697951279, 697936630, 698096008, 697969971, 698333054, 698032303, 697851791, 697593231, 697044220, 696900864, 696503983, 696651611, 696615143, 697111282, 697602539, 697866821, 697571945, 696802139, 697068558, 696591110, 695778732, 695667496, 696148071, 696110382, 696145325, 696486816, 696120453, 696361847, 695909348, 695587997, 695208054]
2002.1F95208054k42997L27607m84467j10550j49078L72696k04392m16412J0223o39343
2011.7F93671341k63519l96271J58081J76773M3869k48489j10627J48697o78329k3880
2021.3F92477646l49579j92108n10483m64630L75366k96173J29395m0894L39508k48794
2031F91219254q05054m04053m61960J76239m67987l0823N1117J23520K40403k03171
2040.6F89437485j9379n26581o3095p32879n28031j67465p5684N51377j94321J66702
2050.3F87848129j90353j08719l25775l42636P095o27136j93939m43116M89273J03684
2059.9F86216507j0605P18918l00446J60523m21448q12378n90439j23367J52206J66932
2069.6F85156403N32989j22223J48926k03095q850l06472p81784l03421n03998L58734
$$ y = [695208054, 694965057, 695292664, 694808197, 694697647, 694548569, 694921265, 694716873, 694300461, 694310684, 693671341, 693407822, 693011551, 693169632, 693346405, 693390274, 693141785, 693031158, 693179855, 692501526, 692477646, 692128067, 691935959, 691425476, 690960846, 691336212, 691040039, 691169434, 691128540, 691468048, 691219254, 690414200, 690010147, 689548187, 689724426, 689256439, 689225616, 689276733, 689400253, 689640656, 689437485, 689418106, 688891525, 688828430, 688095551, 687567520, 687400055, 687324371, 687875748, 687681427, 687848129, 687657776, 687549057, 687223282, 686880646, 686887741, 686260605, 686066666, 685623550, 686112823, 686216507, 686205902, 686924820, 686624374, 686784897, 686363449, 685551071, 684960632, 684837265, 684989471, 685156403, 685689392, 685567169, 685716095, 685513000, 685504150, 685197678, 684415894, 684112473, 683608475, 683967209]
2079.2F83967209k0218J16653K55127J02616K74353l00522m7989p35245n69000k78931
2088.9F82764053M0741K01874j15051M70505K3040K1515m77676o47888p17087p82395
2098.5F80781631j52587J5716P44782k0981j68686q7433m01001k55737m98734l01208
2108.1F79655762o31333K8382N569o8512J79367J12229L53012m12369j55029m62723
2117.8F78604355m18091k99072k86560o5995m53414P18154K08283k44293j53809r6588
2127.4F77512970L4409o42319J3504k87857M6463K58484J07803M13971K7237O9351
2137.1F77554016n29556l71552n18188l13416O5918K88773Q10928L22342O01196r2315
2146.7F77818146j53504j23672m92859j76849l30582Q6822n9509M65012j2894J92413
$$ y = [683967209, 683946991, 684063644, 684318771, 684421387, 684695740, 684395218, 684347229, 683611984, 683042984, 682764053, 682804794, 683006668, 682891617, 683362122, 683385162, 683406677, 682929001, 682281113, 681564026, 680781631, 680629044, 680644760, 681389542, 681368561, 681199875, 681112442, 680711441, 680455704, 679956970, 679655762, 679024429, 679052811, 679058380, 678989868, 679169235, 679281464, 679634476, 679222107, 679067078, 678604355, 678186264, 677887192, 677600632, 677534637, 677081223, 677799377, 678007660, 677763367, 677609558, 677512970, 677547379, 676905060, 676918564, 676630707, 676677170, 676935654, 677043457, 677457428, 677484665, 677554016, 677024460, 676652908, 676134720, 675821304, 675887222, 676175995, 676986923, 677309265, 677910461, 677818146, 677664642, 677540970, 677048111, 676871262, 676540680, 676627502, 676567993, 677033005, 677020111, 677212524]
2156.4F77212524R11484k57339n84870p34558J37940k43531j56478M32662K88544Q57239
2166F77863617r2621o0425l85818k75574j16348k41089K90298J5030R91440J16425
2175.6F78104935K6550P3242o26221J85013l34167J42898M5243R8495L20130J08184
2185.3F78144302K45285r5214L24783l57437j81809j9607j38474O2790o9122L92303
2194.9F78307800k80533J45112O12869M95071J8997k87551R0942m68140j39389O0425
2204.6F78555603N06516O5307j90201M35486j19018n7984l76816Q6518J62124L7461
2214.2F79104996J15738p6447M53644k4109K33078k26212l33480K8228k18048J49536
2223.9F79206924p7743M20837K08893J20163k81677m34113L2578j90430M49448m18778
$$ y = [677212524, 678124008, 677866669, 677281799, 676547241, 676685181, 676441650, 676285172, 676717834, 677006378, 677863617, 677770996, 677710571, 677324753, 677049179, 676932831, 676691742, 676982040, 676997070, 677988510, 678104935, 678131485, 678204727, 677578506, 677763519, 677429352, 677572250, 677617493, 677715988, 678036118, 678144302, 678389587, 678294373, 678619156, 678261719, 678079910, 678060303, 677921829, 677984619, 677915497, 678307800, 678027267, 678172379, 678785248, 679280319, 679299316, 679011765, 679102707, 678634567, 678495178, 678555603, 679062119, 679127426, 678937225, 679372711, 679253693, 679195709, 678818893, 678905411, 679067535, 679104996, 679220734, 679144287, 679597931, 679573822, 679806900, 679580688, 679247208, 679275436, 679057388, 679206924, 679129181, 679550018, 679758911, 679879074, 679597397, 679163284, 679195862, 679005432, 679454880, 679036102]
2233.5F79036102r3002M90799J69220O9504l64304L41721j7395Q2855k47040k42309
2243.2F79226151L24935r002L08227k46658J34430j9379k07824j19477l15170L94745
2252.8F79470978J82953K97317k12326M5929K16217k16904L3875k23007N9967m91638
2262.4F79163361j6785M09622K41852k2659l23182K97699n26657o2408J85089J86996
2272.1F79532928J89515n18036k4948j41602K06146m03671j99051k3575n35965J65863
2281.7F78247604k71225K18048R9640L57590K43301k64358M68826k95105k0828l09067
2291.4F78474426J2284M85534K80381Q62503j46866J67465J57394l67050k51617q0796
2301F79593658L86734P3014L02887L70483Q68759O12259L98331N17578m15039p1793
$$ y = [679036102, 678943100, 679433899, 679603119, 679672623, 679308319, 679650040, 679632645, 679715500, 679468460, 679226151, 679551086, 679542084, 679850311, 679603653, 679738083, 679718704, 679510880, 679391403, 679076233, 679470978, 679653931, 679951248, 679738922, 679784851, 680001068, 679784164, 679818039, 679595032, 679654999, 679163361, 679146576, 679556198, 679798050, 679775391, 679452209, 679749908, 679223251, 679160843, 679345932, 679532928, 679722443, 679204407, 679179459, 679037857, 679244003, 678840332, 678641281, 678617706, 678081741, 678247604, 677976379, 678194427, 678294067, 678651657, 678894958, 678630600, 679099426, 678804321, 678783493, 678474426, 678486710, 678972244, 679252625, 680115128, 679968262, 680135727, 680293121, 679926071, 679674454, 679593658, 679980392, 680053406, 680356293, 680726776, 681595535, 682207794, 682606125, 683123703, 682708664, 682636871]
2310.7F82636871j34506M00391N38482Q5297N28793L73230R52378J234741P45087J75323
2320.3F87536087P6981L78723L23105Q7585N60455J161728O09894P50275J089020N20935
2329.9F93094788j010971j340943p21130n33829L18756J094513J272278k89154K78625
2338.6F92162933L21732o40564R5825r40399p01981N6153p39746k451477k581101j933136
2348.3F82648239L91693L284226J189041J021576K679901P60956L50876J625289L255005
2356.9F97206802j09634R91135M94995k112885o24466q49228j89132j748123m59824
2365.6F92599640r52301j844406j47171j289978l230286l507309j515808k133026j952057
2374.3F76027298j013260j152191j155319j285782p11365j496582j408386j391373
$$ y = [682636871, 682502365, 682902756, 683441238, 683526535, 684055328, 684428558, 685380936, 686615677, 687360764, 687536087, 687613068, 687991791, 688314896, 688402481, 688962936, 690124664, 690734558, 691484833, 692573853, 693094788, 692083817, 690742874, 690021744, 689487915, 689806671, 690901184, 692173462, 691884308, 692162933, 692484665, 691844101, 691939926, 690999527, 690297546, 690353699, 689613953, 687162476, 684581375, 682648239, 683039932, 686324158, 687513199, 688534775, 691214676, 691975632, 692326508, 693951797, 697206802, 697097168, 698088303, 698583298, 696470413, 695845947, 694996719, 694807587, 693059464, 692599640, 691647339, 689802933, 689655762, 688365784, 685135498, 681628189, 680112381, 677979355, 676027298, 675014038, 673861847, 672706528, 671420746, 670709381, 669212799, 667804413, 666413040]
2382F66413040j751251j109238q80432n25513m91790P3776J03912o7291j20773o00357
2391.7F61044083o65894j007385n71976n26123j20773J14288M6082N18264j94473l09601
2401.3F58326492q90808r56802n40238m56466K3346k22473J39541J14136N4245l70026
2410.9F55220947n71747m32510r28802p40815r06906J72882M56925j75476j13755n46264
2420.6F51434479l12500o33774o15158o04248m41666j24817m41971m9057M4327J1521
2430.2F48267136m33274l97186m02374p88040o19049n79834k05460k57034%k08741
2439.9F44376144n34057j86234k58712o33088j165161p54776o94427k44866J48354
2448.6F40053177J11847J68762n25894k67220n46798l80402m26445j039848n07698
$$ y = [666413040, 664661789, 663552551, 662672119, 662146606, 661654816, 661728592, 661832504, 661765213, 661644440, 661044083, 660378189, 659370804, 658798828, 658272705, 658151932, 658266220, 658312302, 658830566, 658636093, 658326492, 657435684, 656478882, 655938644, 655482178, 655505524, 655283051, 655422592, 655536728, 655590973, 655220947, 654649200, 654216690, 653287888, 652547073, 651640167, 651813049, 652269974, 652094498, 651980743, 651434479, 651121979, 650488205, 649873047, 649268799, 648827133, 648702316, 648260345, 648211288, 648255615, 648267136, 647833862, 647436676, 647034302, 646246262, 645627213, 645047379, 644841919, 644584885, 644584885, 644376144, 643842087, 643655853, 643397141, 642764053, 641598892, 640844116, 640149689, 639904823, 640053177, 640165024, 640333786, 639807892, 639540672, 638993874, 638613472, 638187027, 637147179, 636639481]
2457.2F36639481l95203r6741m54254k25143o9161n20553m98619n85480k42272j024551
2466.9F32527504r90944k41241O8206m1771o04629k79236l02086m14581j058388q78601
2476.5F27784233m85306r39293m27703k10762q5679r8724j6823o51016p90558l05595
2486.2F23772774r94950q75740j035537m64592J52244k5444L9673p18117q37173o59256
2495.8F18353882o66695j067657p57828m08897o43502o0272k42767k77710k15111m38423
2505.5F13575020r27239j047515m00582m13399m07600p73087n98449O2065K0447r01451
2515.1F08188210j036034k14348p22847o90956n17426k32963k71073m67300j9073o39534
2524.7F03376656m22020l75595n75409q22220r16214m18740m63218Q0185k58675p9040
$$ y = [636639481, 636244278, 636147537, 635693283, 635468140, 635398979, 634878426, 634379807, 633794327, 633552055, 632527504, 631536560, 631295319, 631363525, 631321754, 630717125, 630437889, 630135803, 629721222, 628662834, 627784233, 627298927, 626359634, 625931931, 625721169, 625635490, 625536766, 625519943, 624868927, 624078369, 623772774, 622777824, 621902084, 620866547, 620401955, 620554199, 620528755, 620568428, 619850311, 619013138, 618353882, 617687187, 616619530, 615861702, 615452805, 614809303, 614749031, 614506264, 614228554, 614013443, 613575020, 612647781, 611600266, 611199684, 610786285, 610378685, 609605598, 609007149, 609069214, 609089661, 608188210, 607152176, 606937828, 606214981, 605524025, 605006599, 604773636, 604502563, 604035263, 604016190, 603376656, 602954636, 602579041, 602003632, 601181412, 600265198, 599846458, 599383240, 599463425, 599204750, 599125710]
2534.4E99125710l14217j036682n40505n61180j89056o86875p12776m77638m07333
2543.1E94199448L4141l77502m17061r38187n99785m53300p16477k77862l19519l45192
2552.7E89788704p62405l08457r6397l4409k82974r62257n20859n28641n47600p25593
2562.4E85019112m02832m64783l98369J65711m64440l27797o81343n64804m66995q52051
2572E80561409l90930o15769l57589k34108k27089l56217k08435l17116j102180o86874
2581.6E76065102m57840r9564l11165n53856n20668p84225l76320l76167j49041o14814
2591.3E71821442p87964n20401m91333j29090q12263n55153o6566k31362l48472o90079
2600.9E67188759r41048r39178m42772l07350j59226n41267o00968j07612l96042o68678
$$ y = [599125710, 598811493, 597774811, 597234306, 596673126, 596484070, 595797195, 595084419, 594606781, 594199448, 594233589, 593856087, 593439026, 592500839, 591901054, 591447754, 590731277, 590453415, 590133896, 589788704, 589026299, 588717842, 588621445, 588587036, 588304062, 587341805, 586820946, 586292305, 585744705, 585019112, 584616280, 584151497, 583753128, 583918839, 583454399, 583126602, 582445259, 581880455, 581413460, 580561409, 580170479, 579554710, 579197121, 578963013, 578735924, 578379707, 578171272, 577854156, 576751976, 576065102, 575607262, 575507698, 575196533, 574642677, 574122009, 573337784, 572961464, 572585297, 572436256, 571821442, 571033478, 570513077, 570021744, 569892654, 569080391, 568525238, 568458672, 568227310, 567878838, 567188759, 566247711, 565308533, 564865761, 564558411, 564399185, 563857918, 563256950, 563149338, 562753296, 562084618]
2610.6E62084618q49190n64804n99137o27288n45998o67572n15442n12543m55932n83687
2620.2E56163025m93813p91931p66716n50690p28988m05312n65681l89939l31955l68652
2629.9E50769348m62036n85861m26789r32350o28891o23970r03206p37991m38309k50511
2639.5E44779434l87344q0376n69954n61142p42721j225205q67729o86073k61650m31900
2649.1E38965340j65749m03786o95457k61116o71616m68254n31044q71277r12018l97148
2658.8E33587875q3427l26424l71551q02422m41551l48930n33829q15201q09784j26190
2668.4E28928566j57394M4517l00865m43802o43883q51974k33765k38571k55699p01790
2678.1E25145340n50423m56543n22766n0621l49541k89688m80728n84144n40924p50847
$$ y = [562084618, 561235428, 560670624, 560071487, 559444199, 558898201, 558230629, 557715187, 557202644, 556746712, 556163025, 555669212, 554877281, 554110565, 553559875, 552830887, 552425575, 551859894, 551469955, 551138000, 550769348, 550307312, 549721451, 549294662, 548362312, 547733421, 547109451, 546206245, 545468254, 545029945, 544779434, 544392090, 544311714, 543741760, 543180618, 542437897, 541212692, 540344963, 539658890, 539397240, 538965340, 538799591, 538395805, 537700348, 537439232, 536767616, 536299362, 535768318, 534897041, 533985023, 533587875, 533504448, 533178024, 532806473, 532004051, 531562500, 531213570, 530679741, 529864540, 529054756, 528928566, 528771172, 528815689, 528514824, 528071022, 527427139, 526575165, 526341400, 526102829, 525847130, 525145340, 524594917, 524138374, 523615608, 523564987, 523215446, 522925758, 522445030, 521860886, 521319962, 520569115]
2687.7E20569115o61698l12385j22032m31023p6523k79198n71289n44929p60880m78248
2697.4E16330910l40996k46925m81339l35312l1166m0512m24385o72379j30767m37699
2707E13189430n09414n87082q45757o11801k28996J81083l97338l51716j07269k55012
2716.6E09476128l71857p02934n78156l77807k40517m17748o2637J00174j85051j83067
2726.3E06456528m71421n31616n71403m53797p58018n73197R7771J05934K54021l2768
2735.9E03522034j51902k76260m24347n94444q32367n79567k02370M74243J50185j63155
2745.6E00922050L93372M26941n62706j088181o69288p85637k53220k66990j69144
2754.3D97947197J28250n79185j15014r994r6817l13187n83038l69644n66483j71089
$$ y = [520569115, 519907417, 519595032, 519473000, 519041977, 518965454, 518686256, 518114967, 517570038, 516809158, 516330910, 515989914, 515742989, 515261650, 514926338, 514895172, 514854660, 514430275, 513757896, 513627129, 513189430, 512680016, 512092934, 511247177, 510635376, 510406380, 510587463, 510190125, 509838409, 509731140, 509476128, 509104271, 508401337, 507823181, 507445374, 507204857, 506787109, 506724472, 506824646, 506639595, 506456528, 505985107, 505453491, 504882088, 504428291, 503670273, 503097076, 503194847, 503300781, 503554802, 503522034, 503370132, 503093872, 502669525, 502075081, 501242714, 500663147, 500460777, 500935020, 501085205, 500922050, 501315422, 501742363, 501179657, 500091476, 499422188, 498636551, 498383331, 498116341, 497947197, 498075447, 497496262, 497381248, 497371254, 497274437, 496961250, 496378212, 496008568, 495442085, 495270996]
2763.9D95270996l6125k6627l0937o0387k26097p00149p11632o24237n00908p21321
2773.5D91632576k71873q9837m51164k48375j62735j28021q12721p03240k97355o08635
2783.2D87858620o23436m76837j65940l44963l23486l64571m44832p07016r22050o20194
2792.8D82865295q07418m26331n13573m94728j45912l99933k16026n66444r47724j346817
2802.5D77000389j272240p54509o93588m78554l63159j16882l44048p41157q57735
2811.2D71378517j023979j155396j030006r39217j094932n12734m26368n07813k18620
2819.8D64469452m32778q80241j368179j154061j103401j193008j076546o80351l37029
2828.5D56243858p45735p35664q88863j213226j130867j003571j080513j110077j112594
$$ y = [495270996, 495234871, 495208244, 495177307, 495116920, 494890823, 494190674, 493479042, 492854805, 492353897, 491632576, 491360703, 491270866, 490819702, 490571327, 490408592, 490280571, 489467850, 488764610, 488467255, 487858620, 487235184, 486758347, 486592407, 486247444, 485923958, 485559387, 485114555, 484407539, 483485489, 482865295, 482057877, 481631546, 481117973, 480623245, 480477333, 480077400, 479861374, 479294930, 478347206, 477000389, 475728149, 474973640, 474280052, 473801498, 473438339, 473321457, 472977409, 472236252, 471378517, 470354538, 469199142, 468169136, 467229919, 466134987, 465622253, 465195885, 464688072, 464469452, 464036674, 463156433, 461788254, 460634193, 459530792, 458337784, 457261238, 456580887, 456243858, 455498123, 454762459, 453873596, 452660370, 451529503, 450525932, 449445419, 448335342, 447222748]
2837.2D47222748j164360q49037j300393j537323j559600j779862j734466k106362
2844.9D35191345k173080k194405j830139k015953k128220j599006j608391q19893
2852.6D20822258p28264q20122p73086o90575L8j53236l75252o31256J26801L40042
2862.3D17117348p23839o80657o03332q76007j378250j193047o34880n05066p68814
2870.9D09753456j007118m13780l93677n10254p04193j237602j196366p80792m87556
2879.6D03022118m39759m96521r29985q39348o80427p02477j047134j587143r58252
2888.3C95341072q73718j020546o51550m72527p44095j040993n12886p14645j285324
2897C88024788j251831q08487n95818n47790k49176l41530n50041j272011j164169
$$ y = [447222748, 446058388, 445209351, 443908958, 442371635, 440812035, 439032173, 437297707, 435191345, 433018265, 430823860, 428993721, 426977768, 424849548, 423250542, 421642151, 420822258, 420093994, 419273872, 418500786, 417810211, 417810249, 417657013, 417281761, 416650505, 416777306, 417117348, 416393509, 415712852, 415109520, 414233513, 412855263, 411662216, 411027336, 410522270, 409753456, 408746338, 408332558, 407938881, 407428627, 406724434, 405486832, 404290466, 403509674, 403022118, 402582359, 402085838, 401155853, 400316505, 399636078, 398933601, 397886467, 396299324, 395341072, 394467354, 393446808, 392795258, 392322731, 391578636, 390537643, 390024757, 389310112, 388024788, 386772957, 385964470, 385368652, 384820862, 384571686, 384230156, 383680115, 382408104, 381243935]
2905.7C81243935o24237n68390m13590j034660q30155o07643j065063j116562j230583
2914.3C73753052j355400j540642j443710j272164r44938j151696j129570n37071r18694
2923C63459167p34939n26657o04286l06168j47400R8381j06850k67066J08108P22809
2932.7C61695099Q11348K01149n1193M00428R51958Q12607J09062m7607O20842J027526
2942.3C66531219J002656N21202L53279P38220Q29697Q85963N91698Q23288P85904
2951C73063126K16522M37126K62260L27225N80788O03256N33485J64528N53360J102639
2960.6C77844315M42428k37083L74450O17981O92749R24988O20003N34325M01916K91061
2970.3C82507133J17569K71759O32439Q80699Q89740O21186J064987P70492L26767
$$ y = [381243935, 380619698, 380051308, 379637718, 378603058, 377772903, 377165260, 376100197, 374983635, 373753052, 372397652, 370857010, 369413300, 368141136, 367196198, 366044502, 364914932, 364377861, 363459167, 362724228, 362197571, 361593285, 361287117, 361139717, 361238098, 361131248, 360864182, 360972290, 361695099, 362506447, 362707596, 362656403, 363056831, 364008789, 364821396, 364930458, 364882851, 365503693, 366531219, 367533875, 368055077, 368408356, 369146576, 369976273, 370862236, 371453934, 372277222, 373063126, 373279648, 373716774, 373979034, 374306259, 374887047, 375490303, 376023788, 376188316, 376741676, 377844315, 378286743, 378049660, 378424110, 379042091, 379734840, 380659828, 381279831, 381814156, 382216072, 382507133, 382624702, 382896461, 383528900, 384409599, 385299339, 385920525, 386985512, 387756004, 388082771]
2979C88082771N88723M12368K75879n2299r6932N48744P94411L46069K37809L09410
2988.6C91446953L41835L58238j10741l81546l29475r804j48659r918L41873k56271
2998.2C91242485l35884j67503k09961o34384q46901r48258r75227m25225n03845J18599
3007.9C86313896N1041n50347k63443o63719q68683q75015m77028n71174o12030l73803
3017.5C81109695p36846k30828l65600o15273p91969j077423o19927p73468r52377
3026.2C74945984o97174l44734n63164p08046n86739p12433o09550r36356j255035
3034.9C68532753j036873n55725p67784o04477l26462q71887n18799p97119r65271
3043.6C62088356p52029r45778n80292r42535r56727p22541n53284r5520o67534j108589
$$ y = [388082771, 388671494, 389083862, 389359741, 389307442, 389210510, 389759254, 390553665, 390899734, 391137543, 391446953, 391788788, 392147026, 392036285, 391654739, 391325264, 391315460, 391166801, 391156883, 391498756, 391242485, 390906601, 390739098, 390529137, 389894753, 389047852, 388099594, 387124367, 386699142, 386195297, 386313896, 386364937, 385814590, 385551147, 384887428, 384018745, 383143730, 382666702, 382095528, 381483498, 381109695, 380372849, 380142021, 379776421, 379161148, 378369179, 377291756, 376671829, 375898361, 374945984, 374248810, 373904076, 373340912, 372632866, 372046127, 371333694, 370724144, 369787788, 368532753, 367495880, 366940155, 366172371, 365567894, 365241432, 364369545, 363850746, 363053627, 362088356, 361336327, 360390549, 359810257, 358867722, 357910995, 357188454, 356635170, 356539650, 355872116, 354763527]
3053.2C54763527q68988p71065j018371j273041q28171m60167p16553n00602n20325
3061.9C47806244o79894m19807q71124r99260j076470r54322l89519m37241l21388
3070.6C41657219m20036n29747o09780q36715p80411o47049o81839q66776p18841p54662
3080.2C34811363n64422l87345m71649m37469o96564r13391j230583o54984k19078
3088.9C29235878p38716o49567n48897m90875m52232m95148n70946r19075j209755
3097.6C23160667j053009p58590n95093m16260o04400l29781l07636p30610q11711
3106.2C17553577q18996l90892n02796p29408p56627n61885o12259q67920l01972p62920
3115.9C11247902r80072p14855q32005n24521n90019r94205j409016m21810j39618
$$ y = [354763527, 353894539, 353123474, 352105103, 350832062, 350003891, 349543724, 348827171, 348326569, 347806244, 347126350, 346706543, 345835419, 344836159, 343759689, 342805367, 342415848, 341978607, 341657219, 341237183, 340707436, 340097656, 339260941, 338480530, 337833481, 337151642, 336284866, 335566025, 334811363, 334246941, 333859596, 333387947, 332950478, 332253914, 331340523, 330109940, 329454956, 329235878, 328497162, 327847595, 327298698, 326807823, 326355591, 325860443, 325289497, 324370422, 323160667, 322107658, 321349068, 320753975, 320337715, 319733315, 319403534, 319095898, 318365288, 317553577, 316734581, 316343689, 315840893, 315111485, 314354858, 313792973, 313180714, 312312794, 312010822, 311247902, 310267830, 309552975, 308720970, 308196449, 307606430, 306612225, 305203209, 304781399, 304641781]
3124.6C04641781o26164l61976j010151p05033k26669q47263j172981q28877l69034
3133.3B98493633n88169o20003n65433n08308o54870r20314o76003o98566r82724p51876
3142.9B91527367m13685o09093o41575q45833r50183q59128o53228K64225k14100j254063
3152.5B85350704j009445o61106q24013r43718p19604n81703m77868o77909o82412
3161.2B78772926p11670o63032l75023o37417n36880o90613r04598q12550r03282j091881
3170.9B71445980r15737m0035l55473p33032m87175l17726l98636j080628o04744n38368
3180.5B65974426j118755j098614p92980k73342l40748l52707m71020n04474n30472
3189.2B60491314j065865j081943o01158k32296n44224r55486o85768j23387o32019
$$ y = [304641781, 304015617, 303653641, 302643490, 301938457, 301711788, 300864525, 299691544, 298862667, 298493633, 297905464, 297285461, 296720028, 296211720, 295556850, 294636536, 293960533, 293261967, 292279243, 291527367, 291113682, 290504589, 289863014, 289017181, 288066998, 287207870, 286554642, 286818867, 286604767, 285350704, 284341259, 283680153, 282856140, 281912422, 281192818, 280611115, 280133247, 279455338, 278772926, 278061256, 277398224, 277023201, 276385784, 275848904, 275158291, 274253693, 273441143, 272537861, 271445980, 270530243, 270490208, 270134735, 269401703, 268914528, 268596802, 268198166, 267117538, 266512794, 265974426, 264855671, 263757057, 262964077, 262690735, 262349987, 261997280, 261526260, 261021786, 260491314, 259425449, 258343506, 257742348, 257510052, 256965828, 256010342, 255324574, 255201187, 254569168]
3197.9B54569168j361408q47740k41890O847n53779o52066m23450o52085k79312p86400
3207.5B48777885r92412k69947l05176l92837m57440n62191p24106p38506n18475n54161
3217.2B43262634m65736n86186q65306m03805P3910k77234j027755r92203m91142m06113
3226.8B37821064k60868o67591o73790N1136j68057o60972p81174o42109r32674o37093
3236.4B32447872j32599m54368k89650o90041o49834k64148m82064m33216n84259l82576
3246.1B28085117n75370l39737k7657o01463o78273o21414l2768K3747o35262n88627
3255.7B24008293j39866k27279o57864n44472n89790J17779J60484p55196m57496k53334
3265.4B20661259k06738l88393m79126j51482k71587o37074m36573L681m24518k81944
$$ y = [254569168, 253207760, 252360020, 252118130, 252124977, 251571198, 250919132, 250495682, 249843597, 249564285, 248777885, 247785473, 247515526, 247210350, 246817513, 246360073, 245797882, 245073776, 244335270, 243816795, 243262634, 242796898, 242210712, 241345406, 240941601, 241015511, 240738277, 239710522, 238718319, 238227177, 237821064, 237560196, 236892605, 236218815, 236269951, 236101894, 235440922, 234659748, 234017639, 233084965, 232447872, 232315273, 231860905, 231571255, 230881214, 230231380, 229967232, 229485168, 229051952, 228467693, 228085117, 227509747, 227170010, 227142353, 226540890, 225862617, 225241203, 225208435, 225232182, 224596920, 224008293, 223868427, 223641148, 222983284, 222438812, 221849022, 221966801, 222127285, 221372089, 220914593, 220661259, 220454521, 220066128, 219587002, 219435520, 219163933, 218526859, 218090286, 218093967, 217669449, 217387505]
3275B17387505l30372p70245m20990o51131l65104Q9779m56620m55207L8452k18735
3284.7B13847332m22916j07651k63024m07791m9667Q4171m32186m50859l47099n48496
3294.3B10901814j10055k69126m04587j15910m78592m65984J0815j36929m03461k74926
3303.9B08253059l71036j74198p7782j19495k53849n06077k58885q70323o52313K96669
3313.6B05265770j5621l03612m66576k94132j41907m21867p54662n57174n54638p27997
3323.2B01027584L9425m31385n72052K26993m23240p96375n19772n66788r74273p09286
3332.9A96300831j79730j85108k59132p02343m99516l4561k80895n44090m38977m04873
3342.5A92771606p24620p86362l73497Q0719n62973q57639K71034M14791l82156o71711
$$ y = [217387505, 217057133, 216286888, 215865898, 215214767, 214849663, 214939442, 214482822, 214027615, 214066067, 213847332, 213424416, 213316765, 213053741, 212645950, 212596283, 212680454, 212248268, 211797409, 211450310, 210901814, 210791759, 210522633, 210118046, 210002136, 209523544, 209057560, 209068375, 208931446, 208527985, 208253059, 207882023, 207707825, 207630043, 207510548, 207256699, 206750622, 206491737, 205621414, 204969101, 205265770, 205250149, 204946537, 204479961, 204185829, 204043922, 203622055, 202867393, 202310219, 201755581, 201027584, 201067009, 200635624, 200063572, 200290565, 199867325, 199070950, 198551178, 197984390, 197010117, 196300831, 196121101, 195935993, 195676861, 194974518, 194475002, 194440441, 194159546, 193615456, 193176479, 192771606, 192046986, 191260624, 190887127, 190967846, 190404873, 189547234, 189818268, 190233059, 189850903, 189179192]
3352.2A89179192m16909l49693l26405k5787j64375l96252k48127j36032k44198j30443
3361.8A86740971q0967m19083m14486j70765k15988l06759k41890q5010j3619j66569
3371.4A84625835m99458p40948k07347R8972k7332J90200m55532o39820j11751J43928
3381.1A82376747L49293l08762n52025l94668p8125J03187l76129l2959j18618k67467
3390.7A80700474N56183N36441m87346n69878P2479q3980j92948n8231J94378J91193
3400.4A80858765k83642k15416k36874j47362J78013M52404N7755n32494K9450J63288
3410A80323887r060q0528j30501L42197K84367N627K08053L30544R689J69468J91727
3420.6A81645470m63620o1988L02276J31912M41781K81677n3253K26974M24118O13079
$$ y = [189179192, 188762283, 188412590, 188086185, 188060398, 187896023, 187499771, 187251644, 187115612, 186871414, 186740971, 186660004, 186240921, 185826435, 185655670, 185439682, 185132923, 184891033, 184806023, 184792404, 184625835, 184126377, 183385429, 183178082, 183277054, 183249722, 183439922, 182984390, 182344570, 182232819, 182376747, 182726040, 182417278, 181865253, 181470585, 181392460, 181495647, 181119518, 181086559, 180967941, 180700474, 181256657, 181793098, 181305752, 180735874, 180808353, 180724373, 180531425, 180473194, 180667572, 180858765, 180575123, 180359707, 180122833, 179975471, 180153484, 180605888, 180663643, 180131149, 180160599, 180323887, 180314827, 180234299, 180103798, 180445995, 180730362, 180735989, 180944042, 181274586, 181284275, 181453743, 181645470, 181181850, 181119862, 181422138, 181554050, 181995831, 182277508, 182224255, 182451229, 182875347, 183488426]
3430.3A83488426L21293j19076j13830j82095N26772N60951J25256L94115J35651K50415
3439.9A85387878M86660M52004J23482J60656N51185L05901L81203n1327J61915P14263
3449.6A88673820N69077O80733L64341O59047P75947m8313k74658L30620N19466M30870
3459.2A92680950J331062J065026K71339K84558N14087P57523K10266K31724N64651
3467.9A97911186O75926N28679M36516N67227K48470Q69751M57191m28257Q05302J408482
3477.5B03480473R92240N66655L07789N95893N39532K93026R74560J015167P24411
3486.2B09489746R08394L53565L35179P72476P88078O07605N74074N67512P01332J411190
3495.8B16509151N31655k38724P62005J174316O37131M00543Q16803L97454J29165
$$ y = [183488426, 183809719, 183690643, 183576813, 183394718, 183921490, 184482441, 184607697, 185001812, 185137463, 185387878, 185874538, 186326542, 186450024, 186610680, 187161865, 187467766, 187848969, 187797642, 187959557, 188673820, 189242897, 189923630, 190287971, 190947018, 191722965, 191674652, 191399994, 191730614, 192250080, 192680950, 194012012, 195077038, 195348377, 195632935, 196147022, 196904545, 197114811, 197346535, 197911186, 198587112, 199115791, 199552307, 200119534, 200368004, 201237755, 201694946, 201266689, 202071991, 203480473, 204472713, 205039368, 205347157, 205943050, 206482582, 206775608, 207750168, 208765335, 209489746, 210398140, 210751705, 211086884, 211859360, 212647438, 213255043, 213829117, 214396629, 215097961, 216509151, 217040806, 216802082, 217564087, 218738403, 219375534, 219776077, 220592880, 220990334, 221119499]
3504.5B21119499Q19111J684303J614590N35908K58026Q49113J432457J000958P16057
3513.2B30030022P36675L09067M51317J070804J617432P88498N53684R49688O87084
3521.9B37194271J025372Q02860N88627Q85429J063919J115208J702251J208420K39868
3530.6B45826225P07951O75239J333676J561947J333980Q80928L11146J403656J178436
3539.2B55213184J514950J449185R99260J599178J126060O42491M23851J545238J071472
3547.9B65584869J398735K116127J301442J492214M82769J477432J335564R22603J800232
3556.6B77911987R79481J691876J720695J590881J074772J914349J979179J48430K755852
3565.3B91767502K181835J615448J435738l98484K111302J477375J540317K111588
$$ y = [221119499, 221938610, 223622913, 225237503, 225773411, 226031437, 226880550, 228313007, 229313965, 230030022, 230766697, 231075764, 231527081, 232597885, 234215317, 235003815, 235557499, 236507187, 237194271, 238219643, 239022503, 239611130, 240496559, 241560478, 242675686, 244377937, 245586357, 245826225, 246534176, 247209415, 248543091, 250105038, 251439018, 252319946, 252631092, 254034748, 255213184, 256728134, 258177319, 259176579, 260775757, 261901817, 262544308, 262968159, 264513397, 265584869, 266983604, 269099731, 270401173, 271893387, 272376156, 273853588, 275189152, 276111755, 277911987, 278891468, 280583344, 282304039, 283894920, 284969692, 286884041, 288863220, 289011650, 291767502, 293949337, 295564785, 297000523, 296602039, 298713341, 300190716, 301731033, 303842621]
3573C03842621K168541J411571J431504K250022J083775K190132J603413J124916K136440
3581.7C19242935K088394K238274J859512L700676K067566n84907J489524O72150K766113
3590.4C35540237L060570L259659K113724J416397L362617N38330J966401L294830
3598.1C54552765J821136K855759J335182J588555K791214K215004K431030K938385
3605.8C72529030K633896L62358L431701J645966J94893O200943K488556J06735M678688
3614.5C94272766P49703L742294M603348R86747K088280Q55827J988717L370781L292884
3623.1D15951347L348160L066788K569313L323173O657105K426910o606216M266701
3630.9D35003281N519523N526734K848053m42238K975693M561195L275528J014519
$$ y = [303842621, 306011162, 307422733, 308854237, 311104259, 312188034, 314378166, 315981579, 317106495, 319242935, 321331329, 323569603, 325429115, 329129791, 331197357, 330612450, 332101974, 332774124, 335540237, 338600807, 341860466, 343974190, 345390587, 348753204, 349291534, 351257935, 354552765, 356373901, 359229660, 360564842, 362153397, 364944611, 367159615, 369590645, 372529030, 375162926, 375525284, 378956985, 380602951, 380797844, 386998787, 389487343, 389594078, 394272766, 395022469, 398764763, 403368111, 404354858, 406443138, 407298965, 409287682, 412658463, 415951347, 419299507, 422366295, 424935608, 428258781, 434915886, 437342796, 430736580, 435003281, 440522804, 446049538, 448897591, 448455353, 451431046, 455992241, 459267769, 460282288]
3638.6D60282288K041587M072457L704223K094841K025719L893013M777985N961914
3646.3D88854027K4338k340394O999131K054367j312981P89337N638008N984002M890441
3655E11580276N739975m710655K411385O262131K088699K530708J435356K585259K360725
3663.6E32283859K590676L010788J690101M888497K887039N49431K027320n095214
3671.4E44832497K738227Q747674R870147O18363j6392861L510437Q528099M361611
3679.1E66814194j799431J363029L388062K460899J763001J486854J518593M383583
3686.8E81378784P296372q631020m300957Q839264l641510k33345N727616J706352
3694.5E88141556J604156O94008K63558J682739R28306K583924L044433l813133k100868
$$ y = [460282288, 462323875, 466396332, 470100555, 472195396, 474221115, 478114128, 482892113, 488854027, 488878365, 486537971, 493537102, 495591469, 494278488, 495067825, 500705833, 506689835, 511580276, 517320251, 512609596, 515020981, 521283112, 523371811, 525902519, 527337875, 529923134, 532283859, 534874535, 537885323, 539575424, 544463921, 547350960, 547900391, 549927711, 544832497, 547570724, 556318398, 566188545, 566806908, 550414047, 553924484, 562452583, 566814194, 565014763, 566377792, 569765854, 572226753, 573989754, 575476608, 576995201, 581378784, 588675156, 580044136, 575743179, 584582443, 580940933, 580707588, 586435204, 588141556, 589745712, 590439720, 590703278, 592386017, 593314323, 595898247, 598942680, 595129547, 593028679]
3703.2E93028679M015655K074433N80063N12771L225632N014763o522064L529930N432625
3711.9F10892487j4966431L685913N572510K80761Q35610L050728K520599k618332
3719.6F09253845O23093N845795k155800m638138M958191J754493r68818k679978J59989
3728.3F12152672M220352J019363M940949l102646p477303J0286637J402702r352951
3736F14089775j42822K071838J483002J814728K271576l336220L433113J1648216j2045173
3744.7F21288033j5336876J0886802N652542N649491k134629r603958J1473961l814354
3752.4F24061012q500175M930877L268891L216324l958626K358513N859222p752418
3760.1F23483620k157517M491005J828423K77404L415795k620926n005570L822785
$$ y = [593028679, 597044334, 599118767, 599698830, 600211601, 603437233, 608451996, 601929932, 605459862, 610892487, 595926056, 599611969, 605184479, 605465240, 606300850, 609351578, 611872177, 609253845, 609876938, 615722733, 613566933, 608928795, 613886986, 615641479, 614672661, 611992683, 612152672, 616373024, 617392387, 622333336, 619230690, 611753387, 622040024, 623442726, 614089775, 613946953, 616018791, 617501793, 619316521, 621588097, 618251877, 621684990, 633333206, 621288033, 605951157, 616837959, 622490501, 628139992, 626005363, 616401405, 627875366, 624061012, 615560837, 620491714, 623760605, 626976929, 623018303, 625376816, 631236038, 623483620, 621326103, 625817108, 627645531, 627922935, 631338730, 628717804, 623712234, 627535019]
3767.8F27535019N845032P19185r574662J709938L664742J92985P10755o77529P62520
3776.5F30887985P45888L253441P20825p283440J965943J839714Q74061J792756l235093
3785.2F31562080j241531J736832J333618N62401n4360J63727K89917R51004n92537
3793.8F34711151m3449K648506k708702l669243J837540M288444P045403n715599j1440545
3802.5F26953506L806763K840271N000839N872116r916839m820595N110626K183152
3810.2F37029839K55317Q25005l94516R76486O075707j341477j3449135M810219N429382
3818.9F40216827L916703J079940j5958480J620292M958039J935424K835427N84411
3826.6F41188583m630317j034203K314606L877640J522216q918876K516327Q195076
$$ y = [627535019, 633380051, 634099236, 624524574, 626234512, 629899254, 630092239, 630802994, 630125465, 630887985, 631633873, 634887314, 635608139, 628324699, 630290642, 632130356, 633004417, 634797173, 631562080, 630320549, 632057381, 633390999, 633953400, 633899040, 634062767, 634352684, 635303688, 634711151, 634667702, 637316208, 634607506, 630938263, 632775803, 637064247, 644109650, 638394051, 626953506, 630760269, 633600540, 638601379, 644473495, 634556656, 629736061, 634846687, 637029839, 637285156, 638110161, 637715645, 638692131, 644767838, 643426361, 629977226, 634787445, 640216827, 644133530, 645213470, 629254990, 630875282, 635833321, 637768745, 640604172, 641188583, 636558266, 635524063, 637838669, 641716309, 643238525, 634319649, 636835976, 645031052]
3834.3F45031052n081292j30806Q954010r469909o987724P976341l852005o24581P447243
3843F43262329j991806m411659K714996J604881k98996J362076q26339J592559O195374
3851.7F49203415n120163j059036j4908142J561622J0987587j257477k142257K098312
3859.4F39363861K107391K100144n185280J097755O676941n619430n946465L824120
3867.1F38419037N125427N111084p801056q770637M650917O328125L584747r038200
3874.8F37609444M0664L692589q95614J603240M020081l602142o836586M492836J777343
3883.5F41901855K044983N025559j3665466O44569M161262M95148M528580j076203
3891.2F44060287p299156J238900L454360j106643R6206R67026K379837J966172r824334
$$ y = [645031052, 639949760, 639818954, 648772964, 639303055, 632315331, 640291672, 636439667, 635815086, 643262329, 641270523, 636858864, 639573860, 641178741, 640879745, 642241821, 641415482, 643008041, 649203415, 644083252, 643024216, 628116074, 629677696, 640665283, 639407806, 637265549, 639363861, 641471252, 643571396, 638386116, 639483871, 646160812, 640541382, 634594917, 638419037, 643544464, 648655548, 640854492, 632083855, 636734772, 643062897, 646647644, 637609444, 637650108, 641342697, 640447083, 642050323, 646070404, 642468262, 635631676, 640124512, 641901855, 643946838, 648972397, 635306931, 635951500, 640112762, 640607910, 645136490, 644060287, 636761131, 638000031, 641454391, 640347748, 640443954, 641410980, 643790817, 645756989, 635932655]
3899.9F35932655M540367K706376n435181M383163l334427p60879P75604J26877J918945
3908.6F40853500n12085L17994k50321j12839l61671m85344K052689K441711k741394
3917.3F41202240l756027L741989J49002l161736K413750J049423P92923j719894l333664
3926F37378006J557236J630554Q66470o58188l98788J977005k089005k344970J044388
3934.6F38962708M0054M70047J040954j58233k28195m04282J161118J223449l856773
3943.3F38250847j212235J119347O71349J734352j454964l21884J01700j666375J884919
3952F39107056O23359p00149k58827j1559K26402q38928L50800j79749O63490O59638
3961.6F39641533j719360j22681J08681Q0795M2610l50799O36177K01416r9183M94767
$$ y = [635932655, 640473022, 643179398, 637744217, 642127380, 638792953, 638032074, 638807678, 638934555, 640853500, 640341415, 640659409, 640409088, 640296249, 639934578, 639449234, 641501923, 643943634, 641202240, 637446213, 641188202, 641337204, 638175468, 640589218, 641638641, 642431564, 640711670, 637378006, 638935242, 640565796, 641432266, 640774078, 640375290, 642352295, 640263290, 637918320, 638962708, 639002762, 639472809, 640513763, 640355530, 640127335, 639723053, 640884171, 642107620, 638250847, 637038612, 638157959, 638829308, 640563660, 639108696, 638786812, 638888512, 637222137, 639107056, 639730415, 639030266, 638771439, 638759880, 638986282, 638147354, 638498154, 638318405, 638981895, 639641533, 637922173, 637799492, 637908173, 637988968, 638031578, 637680779, 638316956, 638518372, 638419189, 638913956]
3971.3F38913956k20452l50914M37737m57039r24263o06499Q77037J875038j5335k81067
3980.9F39248199P5112p64771p04307J47972M85268L51104j67846j005936q7700K70004
3990.6F37847099j30462K56881J271439R93385j478233n17540P24487K365j86996n02815
4000.2F38279610
$$ y = [638913956, 638693504, 638342590, 638780327, 638323288, 637399025, 636792526, 637669563, 639544601, 639529266, 639248199, 639323311, 638558540, 637854233, 638002205, 638487473, 638838577, 638670731, 637664795, 637577095, 637847099, 637716637, 637973518, 639244957, 640238342, 638760109, 638242569, 638967056, 638969421, 638782425, 638279610]
##END=$$ End of the data block
