##TITLE=$$ Begin of the data block
##JCAMP-DX=5.00 $$ ACD/SpecManager v 10.08
##SPECTROMETER/DATA SYSTEM=Varian
##DATE=15 Jan 2013 10:20:50
##DATA TYPE=INFRARED SPECTRUM
##DATA CLASS=XYDATA
##ORIGIN=
##OWNER=
##NPOINTS=3735
##FIRSTX=399.26403809
##LASTX=4000.35498047
##MAXX=4000.35498047
##MINX=399.26403809
##MAXY=67.11727142
##MINY=15.18234730
##XFACTOR=1.0000000000
##YFACTOR=0.000000100000000
##FIRSTY=32.43747711
##DELTAX=0.96440572
##XUNITS=1/CM
##YUNITS=TRANSMITTANCE
##XYDATA=(X++(Y..Y))
399.3C24374771O414070J7522049Q957939m382591o917343k942123M296569K992783
407C50316124M787674J622429q517990l207817j4229j171036j898003K651062K890587
415.7C47458801j605797q86421n379753L59078R95140l683625l382530J866608K543640
424.3C38285141J543312M646416K435837R60197k049255j369095l853073o738472M615135
433C38476143N299759j069336k531243J91384L321113L98293K24800q70895m203301
441.7C39236717J232758Q153076J399155o768761o313438K334060P528305k75306n114365
450.4C41412201m796105j136169P131767K336274k150231k211456l953591J256333
458.1C37889023O243362K585373m087257p636948l449020K556495N478135K425384
$$ y = [324374771, 330788841, 348310890, 357268829, 352886238, 345968895, 343026772, 347323341, 350316124, 355103798, 356726227, 348208237, 345000420, 344986191, 343815155, 341917152, 344568214, 347458801, 345853004, 344966583, 339586830, 339945908, 340941048, 337257423, 333874893, 335741501, 338285141, 339828453, 344474869, 346910706, 347870903, 345821648, 344452553, 340599480, 333861008, 338476143, 343775902, 342706566, 340175323, 340366707, 343687820, 344086113, 344310913, 343440018, 339236717, 340469475, 348622551, 350021706, 343252945, 336939507, 339273567, 346801872, 346526566, 341412201, 336616096, 335479927, 342611694, 344947968, 342797737, 340586281, 336632690, 337889023, 344132385, 346717758, 342630501, 334993553, 331544533, 334101028, 339579163, 342004547]
465.8C42004547k675171n477600m209671J373520L605347k183304o945801L108635
473.5C28600502O407585n57403k278901j193542l915901k97013J345444j785812k337342
482.2C23987617p67326J100540j31874p08542M93851j364288r50737L775291K627525
490.9C28062057j064720k033081j008873k096557l298588K036991K334251K9793n78232
499.6C22383041j012916J591415k632561k923107J017113R30309Q91190l88393j37578
508.2C19718513q63780n20306L81203n73521m84066k093678j827907J009159J894169
516.9C16639786r71298r70746J053887j563721k828102j307220j1998Q67520o27404
525.6C10280704k993412j95198K492352K313766p36179k328205m75616m17767r2297
$$ y = [342004547, 339329376, 333851776, 329642105, 331015625, 334620972, 332437668, 325491867, 328600502, 335008087, 334450684, 332171783, 330978241, 327062340, 326765327, 328110771, 326324959, 323987617, 323220291, 324320831, 324188957, 323480415, 323974266, 322609978, 321659241, 325434532, 328062057, 326997337, 324964256, 323955383, 321858826, 318560238, 320597229, 322931480, 322961273, 322383041, 321370125, 322961540, 320328979, 317405872, 318422985, 319353294, 320244484, 319856091, 319718513, 318854733, 318334427, 318715630, 318142109, 317658043, 315564365, 313736458, 314745617, 316639786, 315668488, 314697742, 315751629, 314187908, 311359806, 310052586, 310040588, 310908108, 310280704, 307287292, 307092094, 309584446, 311898212, 311162033, 308833828, 308358212, 307940445, 307848148]
534.3C07848148m75101j704311j40820R55868J750679j85528k832432j597175K47707
543C03867035J002502J047669j17722k681141k402515l31898K78626k98577j132526
551.6B99231453o06461o36539r2506K23541o83575R44443J032982j274224r56344j808777
561.3B95373993j586437J436863O29100L29781M80309m06399K70920K01206L16143
570B97045479r6035j139584j328983N39207J408806L16925J8750j605816r16615j83430
579.6B94058704n79948J407852R49555o02818r68952m81243j35937K67181l16734n45692
589.3B93051968J282520Q66585R3765m79317l05080R59892J107082J243058Q10699
597.9B98631172l91807j801644k72693J570510K87323j148128j861153j292953m97017
$$ y = [307848148, 307373047, 305668736, 305527916, 306483784, 308234463, 308048935, 305216503, 303619328, 303867035, 304869537, 305917206, 305799484, 303118343, 300715828, 300383930, 300662556, 300363979, 299231453, 298624992, 297988453, 297895947, 298119488, 297435913, 298380356, 299413338, 298139114, 297182770, 295373993, 293787556, 295224419, 295853519, 296183300, 296663609, 296257210, 296528130, 296729336, 297045479, 296949444, 295809860, 294480877, 295020084, 296428890, 296745815, 296764565, 295158749, 294242134, 294058704, 293478756, 294886608, 295836163, 295233345, 294264393, 293783150, 293647213, 293914394, 293597660, 293051968, 294334488, 295201073, 295294838, 294815521, 294510441, 295470333, 296577415, 297820473, 298631172, 298239365, 296437721, 296165028, 297735538, 298022861, 296874733, 295013580, 293720627, 293223610]
606.6B93223610o8989n95131M1599O22197q40130k92092p72628j453896q92200j98021
616.3B88774319P46307k08816K10971R66378J84002k18468j91784k07005J015740K298660
625.9B93370304J165485J49537O10427J997319J404876K23141R66301J836319J347904
634.6C03071613L20607J614723K148342K000618J747513N49526J331043J523819O11496
643.3C14919300N71480P89299N19352J81503R08699J526451J323853J085930J257782
651.9C23083649o4583o29616J088028M33540n27267K07443n0926p97844p51419j4496
661.6C21976509O218J41449N4245p41081o01235j609840p20806N417805K134056o78597
671.2C25378723j109886N66101J538963J320916P91740J444550J603393L85933P7591
$$ y = [293223610, 293154621, 292559490, 292601089, 293223286, 292383156, 292091064, 291318436, 289864540, 288972340, 288774319, 289520626, 289311810, 289522781, 290489159, 290673161, 290454693, 290262909, 290055904, 291071644, 293370304, 294535789, 294685326, 295295753, 297293072, 298697948, 298921089, 299887390, 301723709, 303071613, 303392220, 305006943, 307155285, 309155903, 310903416, 311452942, 312783985, 314307804, 314919300, 315490780, 316280079, 316799431, 316980934, 317889633, 319416084, 320739937, 321825867, 323083649, 323019066, 322389450, 323477478, 323911018, 323383751, 323591194, 323540268, 322742424, 321991005, 321976509, 321982727, 322124176, 322178421, 321437340, 320836105, 319226265, 318505459, 323923264, 326057320, 325378723, 324268837, 324834938, 326373901, 327694817, 328486557, 329931107, 331534500, 331920433, 331998024]
679.9C31998024J114922K079887J947975J667252R11178O67534J349411Q06389P05261
688.6C43247833R10530O22712J60141K92167J517830J510277J485405P10335k60735
697.3C50196495J215515J403809J32789k49900M23240P80144J80550N7373L42826J207963
706.9C55690804K455406K111206N22232J3504J76353O39687Q31528P33718Q64068k6818
716.6C64011688N3482P42188J338615J053581J69297J311111Q59947M18511P16629
725.2C70675049K58980J145286J694069J352463N49087N29824O17866Q06504J720657
733.9C79349785J732635P97005n73082n06821j19781P87773J380272L75748K05421
742.6C83428955N07164R35974J357575J550560K57301N65948J268311n42984K87552
$$ y = [331998024, 333112946, 335192833, 337140808, 338808060, 339719238, 340386772, 341736183, 342542572, 343247833, 344158363, 344781075, 344941216, 345233383, 346751213, 348261490, 349746895, 350457230, 350196495, 351412010, 352815819, 352948608, 352698708, 353121948, 353902092, 354082642, 354140015, 354482841, 355690804, 358146210, 360257416, 360779648, 360793152, 360969505, 361609192, 362440720, 363174438, 364038506, 364011688, 364065170, 364807358, 366145973, 367199554, 367368851, 368679962, 369539909, 369958420, 370675049, 370934029, 372079315, 373773384, 375125847, 375674934, 376204758, 376822624, 377629128, 379349785, 381082420, 381879425, 381306343, 380799522, 380679741, 381467514, 382847786, 383223534, 383428955, 383936119, 384872093, 386229668, 387780228, 388037529, 388603477, 389871788, 389328804, 389616356]
751.3C89616356J073494J357269J000824k69585J032715J782227J324310J401177J817093
760D00135880P91358P75223J454582J145401J507264Q52279L32604n89485L85742J398849
769.6D08189697N18036M60816o31104k79388j52054o2370L1127j3084P41882m14695
779.2D08388863n69649k7313J335830J060334o5194K74811j77536N23224K83012N62249
788.9D11588631J00784M60167J937866J58119o1569n29365r84993o44989m12445o65627
798.5D10946579j636047j026345m04205l14903k042618j949730j334152k000275j483345
807.2C98754959j645203j443519k886276k700959j146659j024514o81495j802445j393509
815.9C84030380q62427q54225o36520o09093Q61550Q83827L85895J168403K200318
$$ y = [389616356, 390689850, 392047119, 393047943, 392778358, 393811073, 395593300, 396917610, 398318787, 400135880, 400927238, 401702461, 403157043, 404302444, 405809708, 406661987, 406994591, 406405106, 406790848, 408189697, 408707733, 409168549, 408537445, 408258057, 408106003, 408043633, 408074760, 408061676, 408803558, 408388863, 407819214, 407791901, 409127731, 410188065, 410122871, 410397682, 410220146, 410743370, 411026382, 411588631, 411689415, 412149582, 414087448, 414245567, 414183998, 413654633, 412669640, 412024651, 411612206, 410946579, 409310532, 408284187, 407879982, 407565079, 405522461, 403572731, 402238579, 400238304, 398754959, 397109756, 395666237, 392779961, 390079002, 388932343, 387907829, 387226334, 385423889, 384030380, 383167953, 382313728, 381677208, 381068115, 381929665, 382813492, 383199387, 384367790, 386568108]
824.6C86568108K285232K618981L451080L183250L201752L469582L740692L255462
832.3D11774139L185273K563247K032814K607651K916260L316765J926841K031594
840D32354584K195968K231636J978455Q54530K293969K304611K790680J594658m93966
848.7D48105125K05880J393394K863808K430839J626664N87730J608314J298523R1439
857.4D60211716K668457L073425K041740J172295J143074M94232N19982N84106l71437
866D71537590r2659p78160q9493j739578k300530r33532o73180J34621j317215r03511
875.7D62844353j819420k278290r96971r48143q15735j893272q01087m66652n57785
884.4D52266998p16018q14934m85268j215133n93606j678962o66085M91219m02985
$$ y = [386568108, 388853340, 391472321, 394923401, 398106651, 401308403, 404777985, 408518677, 411774139, 414959412, 417522659, 419555473, 422163124, 425079384, 428396149, 430322990, 432354584, 434550552, 436782188, 438760643, 439615173, 441909142, 444213753, 447004433, 448599091, 448105125, 448311005, 449704399, 452568207, 454999046, 456625710, 457213440, 458821754, 460120277, 460211716, 462880173, 465953598, 467995338, 469167633, 470310707, 470804939, 471324921, 471909027, 471537590, 471444931, 470666771, 470577278, 468837700, 466537170, 465603638, 464930458, 465065079, 463747864, 462844353, 461024933, 458746643, 457749672, 456801529, 455985794, 454092522, 453291435, 452824783, 452266998, 451550980, 450736046, 450250778, 449035645, 448442039, 446763077, 446096992, 446588211, 446185226]
893D46185226K5330K61574O61697k19307J06087K31056n1994o70128j424828J02234
902.7D45206947M58374J195679J592827K295532K783547J911735J862564K140389K952995
911.4D62400589L87306j868515j674995j033783j389275k241325j252442k296867l565330
920D47465363l881150k505302k125473l270378k883377m054375m499168m353409l866043
928.7D16026688l277092k802086k405968k872276j804848j651802j327629j091538
936.4C98793449j516723r94911j600457j405944j364251j423912q16726l12767m17099
945.1C88940659j207467o02912k40593K03285L38898L41033L01133j171723j300239
953.8C85602074j182175j173172j207390j488724j704330k596092k636872k455368
$$ y = [446185226, 446210556, 446472130, 447133827, 446914520, 447020607, 447251663, 447199669, 446529541, 445104713, 445206947, 445665321, 446861000, 448453827, 450749359, 453532906, 455444641, 457307205, 459447594, 462400589, 462787895, 460919380, 459244385, 458210602, 456821327, 454580002, 453327560, 451030693, 447465363, 443584213, 441078911, 438953438, 435683060, 432799683, 428745308, 424246140, 419892731, 416026688, 412749596, 409947510, 407541542, 404669266, 402864418, 401212616, 399884987, 398793449, 397276726, 396281815, 394681358, 393275414, 391911163, 390487251, 389670525, 389357758, 388940659, 387733192, 387130280, 386889687, 387092972, 387431870, 387772903, 388074036, 386902313, 385602074, 384419899, 383246727, 382039337, 380550613, 378846283, 376250191, 373613319, 371157951]
961.5C71157951k331276j914634j968231k393609k579879k194367k042084k142868
969.2C53591003j714096j388549k617569l922348l409653k719116k895127l755340
976.9C31169205m716301m648323m657231m750766m528618m667664m597988n343018
984.7B93259296n999965n687771m931793m286957l818836l613797m047641m082699
992.4B56789837m046860k833691k569313k493839k593059l768425l086071l661042
1000.1B31737537k762756j879349k581825k051334j922131k009716k436104q12988
1007.8B15281334j421089k020493j307831k615318j762199j884995j549167r90849
1015.5B01729393j098919j565094l110084l054657k019425m28657j322651k235279
$$ y = [371157951, 368826675, 366912041, 364943810, 362550201, 359970322, 357775955, 355733871, 353591003, 351876907, 350488358, 347870789, 343948441, 340538788, 337819672, 334924545, 331169205, 326452904, 321804581, 317147350, 312396584, 307867966, 303200302, 298602314, 293259296, 287259331, 281571560, 276639767, 272352810, 268533974, 264920177, 260872536, 256789837, 252742977, 249909286, 247339973, 244846134, 242253075, 238484650, 235398579, 231737537, 228974781, 227095432, 224513607, 222462273, 220540142, 218530426, 216094322, 215281334, 213860245, 211839752, 210531921, 207916603, 206154404, 204269409, 202720242, 201729393, 200630474, 199065380, 195955296, 192900639, 190881214, 190452557, 189129906, 186894627]
1023.2A86894627l441315l302307j119538q90426K43912r97868j488609j407833r78394
1031.9A73512249L41530p78732n05467l54748J212578J798859J316719J090107J052933
1040.6A78686028K608928J746769O09589n83439L6392L94974l30486l22724j743831
1049.3A81102200j153851j019363m66671p26204j375408o35529j129189k17018k70691
1058A74108276m05693m04987R64355K175751J833210J638146R03129J789303J622448
1066.6A84223938K567348J948605O38180J180878K64358M48017N96333J859436J128216
1075.3A94855309n8537P0381M79756J436748j41544P45773J096172P15886M83779O75755
1085B00359478J852074P51609J517163J019325J127930J714000J465226J811504J005688
$$ y = [186894627, 183453312, 180151005, 179031467, 178141041, 178384953, 177387085, 175898476, 174490643, 173512249, 173853779, 173075047, 172569580, 172214832, 173427410, 175226269, 176542988, 177633095, 178686028, 181294956, 183041725, 183651314, 183067875, 183104267, 183499241, 183168755, 182846031, 181102200, 179948349, 178928986, 178462315, 177736111, 176360703, 175725174, 174595985, 174378967, 174108276, 173702583, 173297596, 174261951, 176437702, 178270912, 179909058, 180812187, 182601490, 184223938, 186791286, 188739891, 189378071, 190558949, 190823307, 191271324, 191867657, 193727093, 194855309, 194796772, 194867153, 195346909, 196783657, 196642113, 197387886, 198484058, 199199944, 199683723, 200359478, 202211552, 202963161, 204480324, 205499649, 206627579, 208341579, 209806805, 211618309, 212623997]
1093.6B12623997J126671O76746J538353R71794J022053J875591R78718J718883R71108
1102.3B23503914J274547R68190J456928K181492R14058J354275O7444O3629P91664
1111B32576141R74541J259899J005917R68761M19693J001091N68104N09396n4741j024952
1120.6B38203850l19824l60604k35100Q0166J183777J207524J692466J804581R14230
1129.3B44171066K064858K012787K021465K048073J938095J629505J875420K887611
1137B60648880K323818K226200K007466J696052J393814J587773J300964L25623Q11596
1145.7B74322186Q88423N47200K24151N42164L39546J13449M04816l4428R9087j066513
1155.4B76380081q34656j01738j099357q63762p16763m09431p11041m0569J223412
$$ y = [212623997, 213750668, 214427414, 215965767, 216937561, 217959614, 219835205, 220813923, 222532806, 223503914, 224778461, 225746651, 227203579, 229385071, 230299129, 231653404, 231720848, 231784477, 232576141, 233550682, 234810581, 235816498, 236785259, 237204952, 238206043, 238774147, 239283543, 239228802, 238203850, 237884026, 237523422, 237288322, 237368488, 238552265, 239759789, 241452255, 243256836, 244171066, 246235924, 248248711, 250270176, 252318249, 254256344, 255885849, 257761269, 260648880, 262972698, 265198898, 267206364, 268902416, 270296230, 271884003, 273184967, 273510590, 274322186, 275210609, 275757809, 275981960, 276524124, 276863670, 276977119, 277381935, 277347507, 277446594, 276380081, 275545425, 275443687, 274344330, 273480568, 272763805, 272354374, 271643333, 271602764, 272826176]
1164B72826176J357917J680985J487236J748600J940117K470569K655488K818145L297997
1172.7B92283230L152885L315354L139724L000756L108711K940826K349625K133312
1180.4C15424423J965447K346267K815590K292366K019348J471329J116028J180191
1188.1C30630989J261673Q82759K93160k87094o41175l39622q91114q18100L2540k58599
1197.8C29865417n79566j224289k254219j727982p83234p96165r28574j155510j229400
1206.5C19186478q24623k06051k78073p68490n7601K63862m84485o77605o50959j85623
1216.1C15316830M406o77491p18898k45018l54672m36840j63059l81527p76310j090508
1225.8C10476913j174488j105251j028023n16452n15957q44155r02805j141777q24547
$$ y = [272826176, 274184093, 275865078, 277352314, 279100914, 281041031, 283511600, 286167088, 288985233, 292283230, 295436115, 298751469, 301891193, 304891949, 308000660, 310941486, 313291111, 315424423, 317389870, 319736137, 322551727, 324844093, 326863441, 328334770, 329450798, 330630989, 331892662, 332775421, 333068581, 332781487, 332140312, 331800690, 330909576, 330091476, 330124016, 329865417, 329285851, 328061562, 325807343, 324079361, 323296127, 322499962, 321571388, 320415878, 319186478, 318361855, 318155804, 317877731, 317109241, 317051640, 317315502, 316831017, 316153412, 315502453, 315316830, 315321236, 314643745, 313924847, 313679829, 313325157, 312888317, 312725258, 312343731, 311567421, 310476913, 309302425, 308197174, 307169151, 306652699, 306136742, 305292587, 304389782, 303248005, 302423458]
1234.4C02423458k34909k89688n11475k61192m86164o53172j98993j03703J39084l77197
1244.1B99446049q25444l35941l12710o53534p43866j26991j22013n93929m91276p0457
1253.7B95169888J00193J2035J24798j18237j61533m07906k49366m311R4128J022548
1263.4B95582237P10850L77941K57225M68502Q35438N02644R24377R39674O94790L02353
1273C01596031O51169J484337J418552J289768J106301O95553L47843J222668J464271
1281.7C11276493J359005J662579J195621J464234J561775J387691J406384J420631
1289.4C22734413J218529O58493L54843P11212J491394J493683R41467O51589O20956
1298.1C30876579j1062L5095O13174M92859K68746O332L59726l662m41399k19650K2316
$$ y = [302423458, 302188549, 301898861, 301387386, 301126194, 300640030, 299986858, 299787865, 299684162, 299823246, 299446049, 298620605, 298284664, 297971954, 297318420, 296574554, 296447563, 296325550, 295731621, 295240345, 295169888, 295270081, 295282116, 295406914, 295288677, 295127144, 294719238, 294469872, 294465561, 294559689, 295582237, 296293087, 296671028, 296928253, 297396755, 298232193, 298734837, 299659214, 300598888, 301293678, 301596031, 302247200, 303731537, 305150089, 306439857, 307546158, 308241711, 308589554, 309812222, 311276493, 312635498, 314298077, 315493698, 316957932, 318519707, 319907398, 321313782, 322734413, 323952942, 324611435, 324966278, 325677490, 327168884, 328662567, 329604034, 330255623, 330876579, 330865517, 330900612, 331513786, 332006645, 332275391, 332281723, 332641449, 332637787, 332196388, 331976738, 331999054]
1308.7C31999054K0485q06198r84154j036491o18363n2070j32714j39274k94266K87323
1318.3C28243332P36847J121330J294136J155281J111946L77426J97640O22444Q56781
1327C35717163L57819L28064Q5182m55094k75192q43658n37262J29699j45645q31909
1336.7C33529167o70700J106q2473Q05740R83887J147117J179047P97043J060447P26281
1346.3C39476662R32197N59540K42729m387l36227j47019n08766l14674N7220R5940
1355.9C40053215l77655n78346p17469n21698n59272p76596N8975r62982l93677N2299
1365.6C35276794m77867l46756p64236l66554l98102o70052o60095n226r4605q97827
1375.2C30595474O00205M05578j23596m61120l9483k00538r82933p97959j783180j799354
$$ y = [331999054, 332019539, 331213341, 330229187, 329192696, 328574333, 328522263, 328389549, 328250275, 327956009, 328243332, 328980179, 330101509, 331395645, 332550926, 333662872, 334040298, 334237938, 334860382, 335717163, 336074982, 336403046, 336488228, 336033134, 335757942, 334914284, 334377022, 334506721, 334361076, 333529167, 332858467, 332859573, 332777100, 333582840, 334566727, 335713844, 336892891, 337689934, 338750381, 339476662, 340408859, 340968399, 341211128, 341206741, 340870514, 340723495, 340214729, 339900055, 339957275, 340053215, 339675560, 339097214, 338379745, 337858047, 337298775, 336522179, 336581154, 335618172, 335224495, 335276794, 334798927, 334452171, 333687935, 333321381, 332923279, 332253227, 331593132, 331587906, 331493301, 330595474, 331195679, 331601257, 331477661, 331016541, 330977058, 330776520, 329793587, 328995628, 327212448, 325413094]
1384.9C25413094j252442r17854k253189j854248o25458j717987j962319k195034j795730
1393.6C10838833k801228l534946j097508j507911j856022l821163k749119j190148
1401.3B92280788j982135j631012j843739l070164l108978j674213j485939k116547
1409B75368061j460380j244679j212273j641960j288547p82185j201095n29538n92365
1417.7B65415039k76298k130757q2245J259556J29109J033725l73134J78604Q14914
1426.3B65968513L56122J237716J045208K018910O81972J345253J471272J736736L349895
1435B79211597K593823J939869k22054K185746K362442K201938K591915J593914K134667
1443.7B96593857J188812J571674J523991J801033J914291J392308K078991P44609
$$ y = [325413094, 324160652, 323242798, 320989609, 319135361, 318509903, 316791916, 314829597, 312634563, 310838833, 308037605, 304502659, 303405151, 301897240, 300041218, 296220055, 293470936, 292280788, 290298653, 288667641, 286823902, 283753738, 280644760, 278970547, 277484608, 275368061, 273907681, 272663002, 271450729, 269808769, 268520222, 267738037, 266536942, 266007404, 265415039, 265138741, 263007984, 262925739, 264185295, 264314404, 265348129, 264974995, 265153599, 265968513, 266324635, 267562351, 268607559, 270626469, 271308441, 272653694, 274124966, 275861702, 279211597, 281805420, 283745289, 283523235, 285708981, 288071423, 290273361, 292865276, 294459190, 296593857, 297782669, 299354343, 300878334, 302679367, 304593658, 305985966, 308064957, 308809566]
1451.4C08809566J752644J614475K283154K993965K027130J081314j459827L913059
1459.1C23015480K451820K779847K141533J440696K175751L69301L170471K603416
1466.8C40148315K920189K721939K424164K853966J107216K926407L538437M297256
1474.6C62937889L505249K132187K491493K663994K883682K375374K129822J601906
1482.3C82721596J561203J519241J519775K158471J475143O41098J271973K08626q01316
1491C92275810M82826N81589p66945n48286j50566n369950n38215r48982l012543l09906
1500.6C81694832j046295j580162j618920L0594R6016k342224k815208o15197r193
1509.3C71794243j585465L91426q40911r83963M15115l48663o90194l213577k333870
$$ y = [308809566, 310562210, 312176685, 314459839, 317453804, 319480934, 320562248, 319102421, 323015480, 325467300, 328247147, 330388680, 331829376, 334005127, 334374428, 337544899, 340148315, 343068504, 345790443, 348214607, 351068573, 352175789, 355102196, 358640633, 362937889, 366443138, 368575325, 371066818, 373730812, 376614494, 378989868, 381119690, 382721596, 384282799, 385802040, 387321815, 389480286, 390955429, 391596527, 392868500, 393077126, 392275810, 392758636, 393340225, 392573280, 392024994, 391874428, 386504478, 385966263, 385017281, 382004738, 381694832, 380648537, 379068375, 377449455, 377480049, 377576065, 375233841, 372418633, 371803436, 371794243, 370208778, 370600204, 369759293, 368775330, 369190445, 368841782, 368151588, 364938011, 362604141]
1518C62604141R74999J816063P23724k023735l17230Q47397J639099m59519J538811
1526.6C67343750J706505J32217O01654O70433L20168M00581K538872o42319K32392
1535.3C73304253O35681L50761J588631k646561L27378K560844J83601k220230N33600
1544C74617958J912003n7755J553002N38635P54089p92198j778717J169586P77855
1552.7C78694458J456909l247490j472435J023522Q74214k744064q934975L404198
1560.4C69054337j203232o0616j477203j140213l244744l516578j497917k683182j353035
1569.1C52877617r274712k033233j826134l940964l050003l487816k440033j4280777
1576.8C12543945j164608k543831l920173m014645n977363m010258o159344l392486
$$ y = [362604141, 363579140, 365395203, 366118927, 364095192, 363777962, 364625359, 366264458, 365804939, 367343750, 369050255, 369182472, 369784126, 370454559, 370774727, 371175308, 373714180, 373071861, 373304253, 373939934, 374290695, 375879326, 373232765, 373560143, 376120987, 376304588, 374084358, 374617958, 376529961, 376472206, 378025208, 378563843, 379317932, 378525734, 376747017, 377916603, 378694458, 380151367, 376903877, 375431442, 376454964, 377329178, 374585114, 365650139, 369054337, 367851105, 367790489, 366313286, 365173073, 361928329, 358411751, 356913834, 354230652, 352877617, 343602905, 341569672, 339743538, 335802574, 332752571, 329264755, 326824722, 312543945, 311379337, 308835506, 304915333, 300900688, 294923325, 290913067, 284753723, 281361237]
1584.5B81361237m984837m135399m504967n810928l379993n980549k861653m880199
1592.2B44822712l206310m184475m891720k532158n113335j831646m052944j899338
1599.9B17110786l317718l201580j987991m183236o62346k929325o93836l209247j819058
1608.6A95106449j067867k338944O96946k292729K33708j923218J44329j107712n099201
1617.3A82351761L214226o24409J466293j495208J124801J3657j870060J844730k1362
1626A86004429K717152j414032Q55865M17862J025219J650219R7694K648049J05381
1634.6A94107838K588482j283932K727604J633777J107273K561493k11353K616291
1642.4B05847473P46327K558956K135467l52668K932834n12962L778744Q61358L173676
$$ y = [281361237, 276376400, 272241001, 267736034, 261925106, 258545113, 252564564, 249702911, 244822712, 241616402, 237431927, 232540207, 230008049, 224894714, 223063068, 219010124, 217110786, 213793068, 210591488, 208603497, 204420261, 203757915, 200828590, 200134754, 196925507, 195106449, 194038582, 191699638, 192396584, 190103855, 190337563, 188414345, 188558674, 187450962, 182351761, 185565987, 184941578, 186407871, 184912663, 186037464, 186051121, 184181061, 186025791, 186004429, 188721581, 187307549, 188163414, 188581276, 189606495, 191256714, 191354408, 194002457, 194107838, 196696320, 195412388, 198139992, 199773769, 200881042, 203442535, 203231182, 205847473, 206593800, 209152756, 211288223, 210935555, 213868389, 213355427, 217134171, 217995529, 221169205]
1651B21169205K227649j203651K930641r49955L921395J590366L014259J148396J823196
1659.7B35671501K163181J597996L522511R10702L963165K086010L025150L296280
1667.4B56236496K755203M339142K034245M978752J972847L806953L589420L444367
1675.1B83157425L730144L427315N603562L388042M391270L511715M960403N534973
1682.9C17704849K045574O618824K331696O381149M626808M073220M731331M527130
1690.6C53040581N848922M826813N348702N272979N624619K653694M827690O142006
1698.3C93586006O204643P077828j169472O308937N760765N042229L638725L533898
1706D29983559L601570L114128M278030L512841K664756K591820K792358K796097J269913
$$ y = [221169205, 223396854, 222193203, 225123844, 224173889, 228095284, 229685650, 232699909, 233848305, 235671501, 237834682, 239432678, 242955189, 243865891, 247829056, 249915066, 252940216, 256236496, 258991699, 263330841, 265365086, 270343838, 272316685, 276123638, 279713058, 283157425, 286887569, 290314884, 295918446, 299306488, 303697758, 307209473, 312169876, 317704849, 319750423, 326369247, 328700943, 335082092, 339708900, 343782120, 348513451, 353040581, 358889503, 363716316, 369065018, 374337997, 379962616, 382616310, 387444000, 393586006, 399790649, 406868477, 405699005, 412007942, 417768707, 422810936, 426449661, 429983559, 433585129, 436699257, 440977287, 444490128, 447154884, 449746704, 452539062, 455335159, 456605072]
1714.7D56605072J392708L546867L275795l002968K847710L681107K270507K146912
1722.4D72763710J318474P41730J763458J958237J415863J944885K334823M8752P90100
1731.1D85080032M098969L815727j987686l359337N000916M547386K852020L555222
1738.8E03603249R27505j267052M598847L946228J508407K283478M259987M172096
1746.5E24032745L212395K944985K346725N462112K223969J282082N938453L968392
1754.2E51411858L656196M231415J321945K366982L682327K807045L821564N35583
1761.9E73834915M55475L899841K172776K072181K522202K379951j281471K276802
1769.7E88332672N189781J261597r65195k143860L984032K966309n17197K402306J197052
$$ y = [456605072, 457997780, 461544647, 464820442, 461817474, 464665184, 468346291, 470616798, 472763710, 474082184, 474823914, 476587372, 478545609, 479961472, 481906357, 484241180, 484289932, 485080032, 489179001, 492994728, 491007042, 487647705, 492648621, 497196007, 500048027, 503603249, 504530754, 503263702, 507862549, 511808777, 513317184, 515600662, 519860649, 524032745, 527245140, 530190125, 532536850, 537998962, 540222931, 541505013, 547443466, 551411858, 555068054, 559299469, 560621414, 562988396, 566670723, 569477768, 573299332, 573834915, 574290390, 578190231, 580363007, 582435188, 584957390, 587337341, 586055870, 588332672, 593522453, 594784050, 593818855, 591674995, 595659027, 598625336, 598108139, 600510445, 601707497]
1778.3F01707497J757011O88629j63994J997528K095376J912612o93016J25618K034798
1787F11462059J444855P25937J816177R89494K29645p40662j29280M040566J493111
1795.7F21331902m46244J167984J715584L05405j178856K838516O77185K35748J649590
1804.4F28296814R08012J749344R75151K05040P86820J575622r19609J06392J386185
1813F35069771O94122J430855N40123J439667M43954N51949Q42590l01590Q15659j62812
1822.7F41364288J394577J393128k043915J42212K413101K648087N76629k728500M0207
1831.4F45199814J969452M08783N99670L68042M16260Q96606k08816J296615N00870
1840.1F51447296R27887M51202J026764J509324n588685J458893K466736K47498l48206
$$ y = [601707497, 603464508, 604153137, 603989143, 605986671, 608082047, 609994659, 609301643, 609427261, 611462059, 612906914, 613632851, 615449028, 616438522, 616668167, 615927505, 615798225, 619838791, 621331902, 620885658, 622053642, 623769226, 624074631, 622895775, 625734291, 626411476, 626647224, 628296814, 629204826, 630954170, 631929321, 632134361, 632921181, 634496803, 633577194, 633683586, 635069771, 635763893, 637194748, 637734871, 639174538, 639618492, 640170441, 641013031, 640711441, 641527100, 641364288, 642758865, 644151993, 642108078, 642250290, 644663391, 647311478, 647888107, 645159607, 645199814, 647169266, 647578049, 648177719, 648545761, 648962021, 649858627, 649649811, 650946426, 651447296, 652375183, 652826385, 653853149, 655362473, 649773788, 651232681, 653699417, 653946915, 653598709]
1848.7F53598709P16629J564789J84936O43311k96860N89447M56467r1553P30896j37176
1858.4F57959595N64422k5100N48858L73764L08380L20740m883J055680k80762O84814
1868F61505508j206054j406555J650543R62753P50351J97754N11932p9422L41111K76870
1877.7F63504791r4909L4332k45285Q53576l02581K39486L84674J66550N79910k60543
1887.3F64860001J258926L17841j615525P8278J026916L5324L76359N41076r67636
1896F65911560O11038J16883J85546M40674o10J83029k76871M99115j09710K10876
1905.6F67771530J56708L85437N46112m77524k31399m00162R47037N0354m807J25122
1915.3F68868408J19629J835556j667328j122513J066742Q41370M51355j311340o74820
$$ y = [653598709, 654315338, 655880127, 656065063, 656708374, 656411514, 657000961, 657457428, 657365875, 658096771, 657959595, 658524017, 658498917, 659047775, 659421539, 659729919, 660050659, 660045776, 661101456, 660820694, 661505508, 660299454, 658892899, 660543442, 661506195, 662256546, 662454300, 662966232, 662886810, 663227921, 663504791, 663409882, 663444214, 663198929, 664052505, 663749924, 663989410, 664374084, 664540634, 665120544, 664860001, 666118927, 666436768, 664821243, 664899521, 665926437, 665961761, 666338120, 666879196, 665911560, 666522598, 666639481, 666825027, 667265701, 667265091, 667448120, 667171249, 667670364, 667560654, 667771530, 667928238, 668313675, 668859787, 668382263, 668150864, 667750702, 668697739, 668748093, 668743286, 668868408, 668988037, 670823593, 669156265, 668033752, 669100494, 669941864, 670393219, 669081879, 668407059]
1923.9F68407059L05023O59637L18985O76499j14594k86941J47476n08499L83301j03684
1933.6F69884262J4877m48913k3728Q13981l5859L11585k24991Q81500l30734k365646
1943.2F68476334L51486P24640J06201j79367L35312k36817n7907M66767J93786k03018
1952.9F69977417o60553j5793j59302Q7815m40903l80096K71988J30615O06994J06888
1962.5F69525070L35236j12152n6534l17078j444473m10614J05972N18952K20413M84085
1972.2F68848877M23584J24435J30387m52500j62658n27268P3319N2871j98440j31607
1981.8F68181000n6153O21872j71051J47934j55258j90735m02221j034775K59018j1444
1991.5F67188187m10080r7123N01709K11487R1706k1744n26810K33307m32587k32315
$$ y = [668407059, 668712082, 669371719, 669690704, 670367203, 670252609, 669965668, 670113144, 669604645, 669987946, 669884262, 669899139, 669450226, 669426498, 670240479, 670204620, 670516205, 670291214, 671172714, 670841980, 668476334, 668827820, 669552460, 669658661, 669479294, 669814606, 669577789, 669519882, 669986649, 670180435, 669977417, 669316864, 669301071, 669141769, 669229584, 668788681, 668408585, 668680573, 668811188, 669418182, 669525070, 669860306, 669748154, 669691620, 669374542, 667930069, 667519455, 667625427, 668144379, 668364792, 668848877, 669272461, 669396896, 669527283, 669074783, 668912125, 668384857, 668458176, 668511047, 668312607, 668181000, 668124847, 668746719, 668575668, 668723602, 668568344, 668377609, 667975388, 666940613, 667199631, 667188187, 666778107, 666680984, 667182693, 667394180, 667485886, 667464142, 666937332, 667170639, 666738052, 666505737]
2001.1F66505737m47769k81067M76609j22605J2741k78930M14276L1509l44086l81622
2010.7F65584793o44073J3122n99289j62277K9678J92337j48086k09580O26603o9809
2020.4F64613419j88294q43582n56107j89514K1134J45340l46070M0131k73514K75498
2030F62698441m55094n52215J06048l31192k1057n90973j85013j99203m7302l3036
2039.7F60389404M9820P15256k33307j85242n83267l59649j91956j05591j04446n08805
2049.3F58882217K68708l23105L26996K14386k64054k28958o10885J25045m21447J10626
2059F58079529l0518o10R4299m15497K50168m01382J28250k39105n33600p9575n3863
2069.6F56798096K43835k72903K07138r4834j12686j48849n4169J0147o54983j22605
$$ y = [666505737, 666057968, 665776901, 666253510, 666130905, 666143646, 665864716, 666278992, 666310501, 665966415, 665584793, 664940720, 664953842, 664354553, 664192276, 664221954, 664414291, 664266205, 664056625, 664683228, 664613419, 664425125, 663581543, 663025436, 662835922, 662857056, 663002396, 662656326, 662696457, 662422943, 662698441, 662243347, 661691132, 661797180, 661465988, 661444931, 660853958, 660668945, 660469742, 660422440, 660389404, 660439224, 661154480, 660921173, 660735931, 660152664, 659793015, 659601059, 659495468, 659391022, 658882217, 659150925, 658827820, 659154816, 659369202, 659105148, 658876190, 658265305, 658390350, 657968903, 658079529, 658049011, 658048401, 658142700, 657727203, 657977371, 657575989, 657704239, 657465134, 656931534, 656851959, 656798096, 657041931, 656769028, 656976166, 656881332, 656768646, 656619797, 656565628, 656575775, 655920792, 655798187]
2079.2F55798187j65863M32205k33078n47332P1334J36414M97894m26712q3465l15552
2088.9F55164032l56293l23181m71268J11161k38877M11606l36990m32053j907r9182
2098.5F53427048k2736m95682J6098l44162J50528j54037k97470J09939n77774j95923
2108.1F51615829l87954K27279k30407k22855L11661k20490q7509o18362M6081k20260
2117.8F50213013j29013J22070k32773q6288o24924Q6899j76316K46735M10309j09711
2127.4F49720001p4768p10831j01242q850L33786k32544l82309Q2093k69318M07867
2137.1F48763885J37024K89841j72043j10168l8300n64651K51465J68991K38952k40402
2146.7F48724594k8534p9574J6021N88761m13819k52914m35562l9597Q1024K1820J22605
$$ y = [655798187, 655632324, 656064529, 655831451, 655284119, 655355453, 655491867, 655989761, 655563049, 655479584, 655164032, 654807739, 654484558, 654013290, 654124451, 653885574, 654297180, 653960190, 653528137, 653526230, 653427048, 653404312, 652908630, 652924728, 652580566, 652731094, 652577057, 652279587, 652389526, 651811752, 651615829, 651227875, 651455154, 651224747, 651001892, 651313553, 651093063, 651005554, 650387192, 650433273, 650213013, 650084000, 650206070, 649973297, 649887009, 649262085, 649348984, 649172668, 649419403, 649829712, 649720001, 649645233, 648934402, 648833160, 648824310, 649158096, 648925552, 648543243, 648625336, 648356018, 648763885, 648900909, 649190750, 649018707, 648908539, 648870239, 648305588, 648557053, 648726044, 648964996, 648724594, 648696060, 648616486, 648632507, 649221268, 648807449, 648554535, 648118973, 648079376, 648160400, 648182220, 648304825]
2157.3F48304825j05820Q09479J5488k5635n2719j48239K86407j32294q3542l61480
2167F48506470K26745q7890K9831N69076J33896K33154n1574q1940m24347j05286o7825
2177.6F48880310P3319J08795j82495L40499l17001J42899L11889M47083O9656r12018
2187.2F48962936N8442L1814J05515K27585M77142P8125j25351J55563k99759N61600
2196.9F50233612l6926k32697k76260j20392L44009l48205L94211J74255L88336J30081
2206.5F50650024l50799k43759m13819N51834J70441K21863p0267k41546p8125Q0184
2216.1F50276031O57883j97067m6387j55334K76413m1352j87988O71921k46964J27182
2225.8F51134338l19671l02582j1444Q6593K78626n81665j18179k66571M24270R7504
$$ y = [648304825, 648199005, 649008484, 649023972, 648998337, 648945618, 648797379, 649083786, 648951492, 648867950, 648506470, 648733215, 648645325, 648675156, 649244232, 649378128, 649611282, 649559708, 649477768, 649053421, 648948135, 648880310, 648953629, 649062424, 648879929, 649220428, 648903427, 649046326, 649358215, 649805298, 649874954, 648962936, 649021378, 649053192, 649158707, 649386292, 649863434, 649941559, 649816208, 649971771, 649672012, 650233612, 650196686, 649963989, 649687729, 649567337, 649911346, 649563141, 649957352, 650131607, 650519943, 650650024, 650299225, 650055466, 649641647, 650193481, 650363922, 650585785, 650515518, 650273972, 650195847, 650276031, 650933914, 650736847, 650690460, 650535126, 650811539, 650770187, 650582199, 651254120, 651007156, 651134338, 650814667, 650512085, 650500641, 650587234, 650865860, 650284195, 650166016, 649899445, 650323715, 650421219]
2235.4F50421219r3842P59430O7826o5995q85620k24838J86310j2207J02234j02692
2245.1F50151825J79062m12598J32446n8975K9907K32926k34833j28250l86353M83246
2254.7F49988403j40381m11071K94647M84695K18430l23029J5259n20019j38398m7836
2264.4F49420700J96457J67694l66974K63214j05438J35117k11792J90735O0958n23300
2274F49227371L33100k53525j11542k98004J38779J86843j46865O3552m06494K64130
2283.7F48997345m50897l26004n9128R0713K11716n57098K20260l87039q7890O3552
2293.3F47715530N7297L10517n88761m55475p67975J56632N6229n723K20948l77274
2302.9F46321945Q4686k03170J55945o84357j95847J00861o99997N50842n1422m86984
$$ y = [650421219, 650327377, 651086807, 651154633, 651088638, 650203018, 649978180, 650164490, 650152283, 650254517, 650151825, 650330887, 649918289, 650050735, 649991760, 650021667, 650254593, 650019760, 649891510, 649505157, 649988403, 649848022, 649436951, 649731598, 650216293, 650434723, 650111694, 650126953, 649606934, 649468536, 649420700, 649617157, 649784851, 649417877, 649681091, 649575653, 649710770, 649498978, 649689713, 649750671, 649227371, 649560471, 649306946, 649195404, 648897400, 649036179, 649223022, 649076157, 649139709, 648733215, 648997345, 648546448, 648220444, 648161316, 648252029, 648463745, 647906647, 648126907, 647739868, 647651978, 647715530, 647772827, 648083344, 647494583, 647039108, 646271133, 646427765, 646483994, 646478271, 646699219, 646321945, 646406631, 646203461, 646359406, 645675049, 645479202, 645580063, 644880066, 645430908, 645379486, 644892502]
2312.6F44892502n22156M62036J03913n52063K44979m51812m01459r07669P1487k17819
2322.2F42721939q02612j33820R7809P24258r12017r9869p01141n84183j19248n78537
2331.9F39612579J607361q6059r7504n15213j533966q82263J016273J929207q88824
2340.6F40161591k22168j87569K51427j88904j060562m11339o18286N75599O20575
2349.2F38920364P13311j72692m76341j51443j480065j182480j45569J431046Q4724
2357.9F37540855j10740j077309k39944Q43925j756363p42683j690369O93970J042213
2366.6F34503555j13792K97966q47702P69272N73234L05j004943l19252L98063j37481
2376.2F34119225L64379p5569K48604j91421j68839j99737m85688L5820l11203k56118
$$ y = [644892502, 644370346, 644832382, 644936295, 644384232, 644629211, 644177399, 643775940, 642868271, 642939758, 642721939, 641919327, 641785507, 641883316, 642607574, 641695557, 641595688, 640894547, 640310364, 640191116, 639612579, 641219940, 641133881, 641036377, 640521164, 638987198, 638104935, 639121208, 641050415, 640161591, 639939423, 639751854, 640003281, 639814377, 638753815, 638342476, 637724190, 638299789, 638920364, 639633675, 639460983, 638984642, 638833199, 637353134, 636170654, 636025085, 637456131, 637540855, 637430115, 636352806, 636112862, 636956787, 635200424, 634457741, 632767372, 633461342, 634503555, 634389763, 634687729, 633840027, 634609299, 635182533, 635182838, 634177895, 633858643, 634256706, 634119225, 634483604, 634408035, 634656639, 634465218, 634296379, 634096642, 633610954, 633646774, 633335571, 633079453]
2385.9F33079453m69780n25589k82097M89235L35350n11589k07062n09796j99662m29573
2395.5F30768890k25448j92681n86242N836m38461m9095l48053k03591J16692m35333
2405.2F28412514k75193o14929k45895n83878m56543l31382l74604J00708l26767k50663
2414.8F25053368p81136l11432P4730j28403n07393p76443o6605q43772l53470j24359
2424.5F21235085o7215Q9912p09267j53160m02870k02637n09224o03180k01988n81894
2434.1F17893562k98843o82640j85738k35061l15514o3133m80461k13013m86755o06575
2443.7F14325829p65191k72140k9488k45056k90603p87621k13089q8234m73099o53267
2453.4F10508041m46891m13933k98691j2627l63884j44958o01235n58166m54178m59175
$$ y = [633079453, 632609673, 632084084, 631801987, 632291222, 632626572, 632114983, 631907921, 631398125, 631198463, 630768890, 630543442, 630350761, 629764519, 629770355, 629331894, 629282799, 628934746, 628731155, 628847847, 628412514, 628137321, 627522392, 627276497, 626692619, 626236076, 625904694, 625530090, 625630798, 625304031, 625053368, 624272232, 623960800, 624035530, 623907127, 623399734, 622623291, 622556686, 621712914, 621359444, 621235085, 621167870, 621257782, 620548515, 620395355, 619992485, 619789848, 619280624, 618677444, 618475456, 617893562, 617594719, 616912079, 616726341, 616491280, 616175766, 616112633, 615632172, 615419159, 614932404, 614325829, 613560638, 613288498, 613259010, 613013954, 612723351, 611935730, 611722641, 611634407, 611161308, 610508041, 610061150, 609647217, 609348526, 609335899, 608972015, 608827057, 608225822, 607667656, 607213478, 606754303]
2463F06754303j36032p49550n13191l49694k29759p02553n84716J60370m65317n15366
2472.7F02668495n49965m03175n72243m57649m68521j010361k87628r9106k88811o10847
2482.3E97920189o13365p35436n01594j52588p30820n08957p85599m02984k89955o85501
2492E92513390l78838n55191k78816m26331k59247n91583p25593k68631o04287n21812
2501.6E87903061n67093j98517m65278m31405n65605j158447m61845m38538k23083
2510.3E83393250l60070o59408q37250n03311J72882m54827m22668m80003n31006r44290
2519.9E78373299r67217j60065m74090n32570m26140j39808n09034l02314J47285n00488
2529.6E74508858n86930q88824p11136p45964l06206N3292l96538j81771p84606p89147
$$ y = [606754303, 606618271, 605868721, 605355530, 605005836, 604776077, 604073524, 603488808, 603649178, 603183861, 602668495, 602118530, 601715355, 601143112, 600685463, 600216942, 599206581, 598918953, 598819847, 598531036, 597920189, 597306824, 596571388, 596069794, 595917206, 595186386, 594677429, 593891830, 593488846, 593198891, 592513390, 592134552, 591579361, 591300545, 590874214, 590614967, 590023384, 589297791, 589029160, 588424873, 587903061, 587335968, 587137451, 586672173, 586240768, 585675163, 584516716, 584054871, 583616333, 583393250, 583033180, 582373772, 581536522, 581033211, 581206093, 580751266, 580328598, 579848595, 579317589, 578373299, 577406082, 577246017, 576771927, 576239357, 575813217, 575673409, 575164375, 574862061, 575009346, 574508858, 573921928, 573033104, 572321968, 571576004, 571269798, 571323090, 570926552, 570744781, 569960175, 569171028]
2539.2E69171028l43017j99395m35371o21300l98559o30417m93012m85573j20506k19116
2548.9E65224762l89099j56670n14221o89888r12933o28395o64978o22635m46282N188
2558.5E60204849J84136p88422l67851l67813n04914k11219l21236n02510j010971
2567.2E56314049n79567m34227k33116l36075m62914l97987p59697l09448n45807m19197
2576.8E51836014l26233n23071m21524n13916l59955p09229j80054L357k77366l62206
2586.5E48165817o08482n39093p54013m14009n68733p59697o82297k55509n1880q08448
2596.1E42723656m64096l92685k35215k63786p57332o14090m48646k50359o65169n64537
2605.7E38067741p23304q87337l39966j21536k68517p76329m67300o05049p42646l33595
$$ y = [569171028, 568828011, 568628616, 568193245, 567571945, 567173386, 566542969, 566049957, 565564384, 565443878, 565224762, 564835663, 564678993, 564164772, 563474884, 562561951, 561933556, 561268578, 560645943, 560199661, 560204849, 560388985, 559600563, 559232712, 558864899, 558359985, 558148766, 557827530, 557325020, 556314049, 555734482, 555300255, 555067139, 554731064, 554268150, 553870163, 553110466, 552801018, 552255211, 551836014, 551509781, 550986710, 550565186, 550051270, 549691315, 548982086, 548802032, 548805389, 548528023, 548165817, 547557335, 547018242, 546264229, 545850220, 545281487, 544521790, 543839493, 543583984, 543532104, 542723656, 542259560, 541866875, 541631660, 541367874, 540610542, 539996452, 539547806, 539297447, 538632278, 538067741, 537344437, 536457100, 536117134, 535995598, 535727081, 534950752, 534483452, 533878403, 533135757, 532802162]
2615.4E32802162j79329n71480j140213m83245m79393n64423m80499n75791l69529
2624.1E27958260n40238o45447p39555l31230q53501r49249k2850l08609q44688j035462
2633.7E21687431l98330l17345m01764k27814n90095p96433o46476k18430p50198o83937
2643.4E16656609k71874n28564p25098p45163l39889n07317m19731n79300n95780m74968
2653E11468925p19947l70446m71954m01993n61027l76511l61748n60226k73438q57467
2662.6E06514168m94042n67588o72341L9101j40267o15387o84471j03302l79181l41148
2672.3E02555542m75845o40068k74163p40127k14615k32315n98145m94461n85022l97758
2681.9D97903023k34871l9978o52237p00073k72522k60468m01459m00505j29013m61197
$$ y = [532802162, 532622833, 532051353, 530911140, 530427895, 529948502, 529384079, 528903580, 528327789, 527958260, 527418022, 526772575, 526033020, 525701790, 524848289, 523899040, 523876190, 523567581, 522722893, 521687431, 521289101, 520971756, 520569992, 520342178, 519752083, 518955650, 518309174, 518090744, 517340546, 516656609, 516384735, 515856171, 515131073, 514385910, 514046021, 513538704, 513118973, 512539673, 511943893, 511468925, 510748978, 510378532, 509906578, 509504585, 508943558, 508567047, 508205299, 507645073, 507371635, 506514168, 506020126, 505452538, 504780197, 504819298, 504679031, 504063644, 503379173, 503275871, 502896690, 502555542, 502079697, 501439629, 501165466, 500425339, 500210724, 499978409, 499380264, 498885803, 498300781, 497903023, 497668152, 497628174, 496975937, 496275864, 496003342, 495742874, 495341415, 494940910, 494811897, 494350700]
2691.6D94350700l34663l14102n65872o11687n04189l42369m66079k91024l20892l5744
2701.2D90564079k46963q16002o47621m31824m76646n20783J54953k09274o80161m51469
2710.9D86238289m78974l94325n34363j42707j61858k14462j99509m70657m18129n35813
2720.5D82687492m15725m34456M768P8888k56157n11360o54297j47438l62739q9150
2730.2D79899826k42233o03905J0796K8419k89383n91736j52435k83356m39987r1629
2739.8D77244377q4228j49231o14128k53029l98674n63546P6485K52228M5319l19214
2749.4D75236359p4158m26979n13497j61399m07105l54805j67465k87781o78406k81334
2759.1D71883430j38206k70729l04871o39152n01328k87513P3013J8768k42920q20923
$$ y = [494350700, 494016037, 493701935, 493136063, 492524376, 492020187, 491677818, 491211739, 490920715, 490599823, 490564079, 490317116, 489501114, 488853493, 488421669, 487945023, 487424240, 487579193, 487369919, 486689758, 486238289, 485759315, 485364990, 484830627, 484687920, 484526062, 484311600, 484112091, 483641434, 483223305, 482687492, 482271767, 481837311, 481842079, 481920967, 481664810, 481153450, 480499153, 480351715, 479988976, 479899826, 479657593, 479053688, 479064484, 479092903, 478803520, 478211784, 478059349, 477775993, 477336006, 477244377, 477160149, 477010918, 476396790, 476143761, 475745087, 475181541, 475258026, 475510254, 475555573, 475236359, 475162201, 474735222, 474221725, 474060326, 473653221, 473298416, 473130951, 472843170, 472164764, 471883430, 471745224, 471474495, 471169624, 470530472, 470029144, 469741631, 469814644, 469833412, 469590492, 468769569]
2768.7D68769569q81157p896O1188r6283n91850o61736m82674o20803n03808n58624
2778.4D64425926m29230k60963l84026r03739m53568M501q2817r1438q20122n95093
2788D60409431n28984p00950m68483n17426n91964r07670o62231p47681n01327k39716
2797.7D54542999n56755p49702j369210j040687l19100k61573q82645r04694n47943
2806.3D47910690n89409k80571q45832r09310o92405p78275m92897q85124j167488
2815D41269379j139946n60189J32370m33616j342926j104813j120911j269111p19605
2823.7D33710632o71692m01420q98934j264686j032753j044121p55348j137695q88176
2832.4D25615807r91478j195107j105270j317139q44650j350708j461106j511344k129403
$$ y = [468769569, 467888412, 467880516, 467941704, 467845421, 467253571, 466591835, 466109161, 465488358, 464984550, 464425926, 463996696, 463735733, 463351707, 462447968, 461994400, 461998901, 461916084, 461824646, 461004524, 460409431, 459880447, 459179497, 458711014, 458193588, 457601624, 456693954, 456031723, 455284042, 454782715, 454542999, 453986244, 453236542, 451867332, 450826645, 450507545, 450245972, 449363327, 448458633, 447910690, 447321281, 447040710, 446194878, 445285568, 444593163, 443814888, 443321991, 442436867, 441269379, 440129433, 439569244, 439701614, 439267998, 437925072, 436820259, 435699348, 434430237, 433710632, 433038940, 432637520, 431738586, 430473900, 429441147, 428397026, 427641678, 426503983, 425615807, 424624329, 423429222, 422323952, 421006813, 420162163, 418811455, 417350349, 415839005, 413709602]
2841.1D13709602j871566j214447j404229k377243k093811k251358k675590k561646
2848.8C97259712j840172j034507j695900j351281q73298o18439o99692r72290l4828
2857.4C88139305K12746K49939k70882n71899l04375k69470r9335q24318j168251j159325
2867.1C83934135j145782j023750r19228l38745l72353r88617j190948q80547n67283
2875.8C76506882k46239m16908q81310j197548j208152p72400o39038l21808p66907
2884.4C70056572j394692j256027j252174j012344r26781o54602o56471q26951j053123
2893.1C61023407j311455q21724q63609j151543j268501o72264k97508j011048r18884
2901.8C52706871m25529o19278j231690r55009o46935p96432q12264j059532j023827
$$ y = [413709602, 411838036, 410623589, 409219360, 406842117, 404748306, 402496948, 399821358, 397259712, 395419540, 394385033, 392689133, 391337852, 390464554, 389846115, 389146423, 388174133, 388139305, 388352051, 388601990, 388331108, 387759209, 387454834, 387185364, 387086029, 386261711, 385093460, 383934135, 382788353, 381764603, 380845375, 380506630, 380134277, 379145660, 377954712, 377074165, 376506882, 376260643, 375843735, 374962425, 373764877, 372556725, 371784325, 371145287, 370823479, 370056572, 368661880, 367405853, 366153679, 365141335, 364214554, 363559952, 362903481, 362076530, 361023407, 359711952, 358890228, 358026619, 356875076, 355606575, 354934311, 354636803, 353625755, 352706871, 352281342, 351662064, 350430374, 349475365, 348828430, 348031998, 347219734, 346160202, 345136375]
2910.5C45136375j144485j132393j335602j285209j278267j887474j325951j191521
2918.2C34555473j515388j226807r98688j057891r61190l60756j03645k0218m38232
2926.9C27872658k99225N71136P14188K68860k09503j11771k3994K64015L64151L63693
2936.5C29774208N80330O07071Q02612P72324P63931O32591P59430O31027O82068R65119
2946.2C36970711J02539L10173O89583Q57773J208763O27288K47651J99356K94761
2954.8C41508598L68996Q32405M01840K59438Q93478J95313N43365J090012O82678
2963.5C46776123K82097L38287N19944P84568J316223O16799O45103Q51670N47866
2972.2C52678680N66025N15480P97577L19595O93207O59485m0855N24788N40390N73654
$$ y = [345136375, 343991890, 342859497, 341523895, 340238686, 338960419, 337072945, 335746994, 334555473, 333040085, 331813278, 330814590, 329756699, 328795509, 328434753, 328331108, 328310890, 327872658, 327573433, 328144569, 328858757, 329127617, 328918114, 328806343, 328782349, 329046364, 329410515, 329774208, 330354538, 330961609, 331764221, 332536545, 333300476, 333933067, 334692497, 335323524, 336005592, 336970711, 337073250, 337383423, 338073006, 338930779, 340139542, 340766830, 341014481, 341213837, 341508598, 341877594, 342709999, 343111839, 343371277, 344264755, 344460068, 345003433, 346093445, 346776123, 347058220, 347396507, 347916451, 348701019, 350017242, 350634041, 351279144, 352130814, 352678680, 353244705, 353760185, 354557762, 354877357, 355570564, 356230049, 356189194, 356713982, 357254372, 357828026]
2981.8C57828026L62282O9694J34201N3749l8j83487O7711M88434N20973j1330j64566
2992.5C59165649o4888j68304k25220l74832k77367n50155o09017m15649k35329r613
3002.1C56235275n48897q63113o36444n51147n98259n66826n18303l61519n70831q46520
3011.7C50173416m67338l57399n54009j014595q22525o04057r66263o54831o83937
3020.4C44048462o93321o22139n31578o38733j081581p16133o39458p13310o44341
3029.1C37767868n65491p64656j081962q13866j005783j002960o79016n11208p09114
3037.8C30633812j066437j131325j038322l93028n10788r35211p88041q54911j097145
3046.5C22818604j425171r60884j86501l65524p79629q76827j235581j062889l53680
$$ y = [357828026, 358190308, 358260002, 358394203, 358447952, 358447914, 358264427, 358332138, 358820572, 359341545, 359330215, 359165649, 359100761, 358932457, 358707237, 358332405, 358055038, 357504883, 356895866, 356480217, 356244888, 356235275, 355686378, 354823265, 354186821, 353635674, 353037415, 352470589, 351952286, 351590767, 351019936, 350173416, 349706078, 349348679, 348794670, 347780075, 346957550, 346353493, 345387230, 344732399, 344048462, 343355141, 342733002, 342201424, 341562691, 340481110, 339764977, 339125519, 338412209, 337767868, 337202377, 336437721, 335355759, 334541893, 333536110, 332533150, 331854134, 331342926, 330633812, 329567375, 328436050, 327397728, 327004700, 326493912, 325558701, 324770660, 323915749, 322818604, 321393433, 320432549, 320246048, 319880524, 319100895, 318224068, 316988487, 315925598, 315571918]
3055.1C15571918k34088m85554j034641j290455j240826p95460m89750n06630m50267
3063.8C09044247j040135j107692j002999o05430j95218p76290j032219j122227o49471
3072.5C01512566l82634m19178l90110n98583m07066r43718j210919r10854p19070
3081.2B95530434o38981o62728m47197p87029p32918o29062q77171p21741m40769m55761
3090.8B89137077q51192j021824j002865j88694k34985j029339m67911k75554r16214
3099.5B83148499j582528r15374m8218l67947o61468q47550p61661o03066n96294o26068
3109.1B76138325l47386p76386j191425q11634r00116j22013l28064j245633r42726
3117.8B69472942p80391m40388o58150n83153o24465r16558q19034j325875p72705
$$ y = [315571918, 315337830, 314852276, 313817635, 312527180, 311286354, 310490894, 310001144, 309494514, 309044247, 308004112, 306896420, 305893421, 305287991, 305092773, 304316483, 303284264, 302162037, 301512566, 301129932, 300710754, 300320644, 299722061, 299314995, 298371277, 297160358, 296249504, 295530434, 294891453, 294228725, 293781528, 292994499, 292261581, 291632519, 290755348, 290033607, 289592838, 289137077, 288285885, 287264061, 286261196, 286072502, 285837517, 284808178, 284340267, 284064713, 283148499, 281565971, 280650597, 280602379, 280234432, 279572964, 278725414, 277963753, 277360687, 276764393, 276138325, 275790939, 275014553, 273823128, 273011494, 272111378, 271989365, 271661301, 270415668, 269472942, 268692551, 268252163, 267594013, 267010860, 266386395, 265469837, 264650803, 263324928, 262552223]
3126.5B62552223l43303o28682q19473j340542q23288j66759m78001o18362n76153
3135.2B56757660q50945n89656m75083r23195o92119o18382j072979r99126o59046
3143.9B49877129q23079p33413l81546m29707o89812j009883o74859m41589r11865
3152.5B43781376j114292n60894j50948o28490q59185q07743o59198n64309o25133
3161.2B37811184p39708j105995r73301q10223l83167j48239q25997r30347o02016
3169.9B31292191n42546r70363p91245l85914p88631n94120l78266o03256j013107
3178.6B25224743r15089j37863l56255q15715r28822r60903n54066m91790p51610o55251
3188.2B18657379m53987m79355k61173k70634j044140j080608m80556n52197r15012
$$ y = [262552223, 262208920, 261580238, 260760765, 259420223, 258596935, 258430176, 257952175, 257333813, 256757660, 255906715, 255317059, 254841976, 253918781, 253226662, 252608280, 251535301, 250536175, 249877129, 249054050, 248320637, 247939091, 247509384, 246819572, 245809689, 245134830, 244693241, 243781376, 242667084, 242106190, 241955242, 241326752, 240467567, 239659824, 239000626, 238436317, 237811184, 237071476, 235965481, 234992180, 234181957, 233798790, 233650551, 232824554, 231894207, 231292191, 230749645, 229779282, 228988037, 228602123, 227813492, 227219372, 226841106, 226237850, 225224743, 224309654, 224171791, 223815536, 222999821, 222070999, 221110096, 220556030, 220064240, 219312630, 218657379, 218203392, 217724037, 217462864, 217192230, 216148090, 215067482, 214586926, 214034729, 213119717]
3196.9B13119717q59623l75729l73554m31175j63899o72493q66680m90437m41989j78032
3206.5B08266106l38841p51419p87945m03919J8654q12149j398659p05662j50871k70691
3216.2B02664604q04958p20024k45781q9588l15667q42399n90019m10290q82454o01921
3225.8A97161503l04318o62231m50516K5807k18335m41341k99873l18489o52466p26052
3235.5A93113689n30166n79624k82994k18506m93755n98850p14531m22077k91691k81563
3245.1A88699932l51849m26635j99185l65009p59144q71544k80113o3648k46010j84383
3254.8A84952412n71728n42011l20301l18432m48799m51718j93043l03115l01152l14846
3264.4A81187267m74739o38618j67713K32563k57397m79641o33221k64930j20564k35081
$$ y = [213119717, 212260094, 211884365, 211510811, 211079636, 210915737, 210243244, 209376564, 208886127, 208444138, 208266106, 207927265, 207175846, 206387901, 205983982, 206002636, 205190487, 203791828, 203086166, 202935295, 202664604, 201859646, 201139622, 200893841, 200804253, 200488586, 199646187, 199056168, 198645878, 197763424, 197161503, 196857185, 196194954, 195744438, 195770245, 195551910, 195110569, 194810696, 194492207, 193839741, 193113689, 192583523, 192003899, 191720905, 191502399, 191008644, 190409794, 189695263, 189273186, 188981495, 188699932, 188348083, 187921448, 187722263, 187357254, 186598110, 185726566, 185446453, 185382805, 185136795, 184952412, 184380684, 183838673, 183518372, 183199940, 182751141, 182299423, 182106380, 181803265, 181502113, 181187267, 180712528, 180073910, 179906197, 180138760, 179881363, 179401722, 178768501, 178503571, 178383007, 178147926]
3274A78147926j41983p73143n05887Q3104q2894m91810m74891j84498k94113l2959
3283.7A75248852k11582m91810o16513o05983r8744N9452J75743r8056k89688l08133
3293.3A72763538k52781k22091o65741l56217l76663l77521L19500J94339n59101q99582
3303A69567680j26152K45514j96762l02238l30448n20230l63769j29910k64740J0719
3312.6A67589664m8732k34471j63440n98278m17252j58863l67336l38135l03784m01229
3322.3A64558144m78402k13661p9307k69966j82457l46241p84169m71363m72660q83217
3331.9A60376701m34503r3966j15490l83196n83229j05457l3855m99277o81172m57525
3341.6A56989031k86818l07035j59264n9318l65115n95254k07425K20900j07479n13058
$$ y = [178147926, 178005943, 177232800, 176726913, 176810017, 176727123, 176235313, 175760422, 175575924, 175281811, 175248852, 175037270, 174545460, 173928947, 173322964, 173224220, 173283672, 173459415, 173361359, 173071671, 172763538, 172510757, 172288666, 171622925, 171266708, 170890045, 170512524, 170832024, 171026363, 170467262, 169567680, 169441528, 169687042, 169490280, 169188042, 168857594, 168337364, 167973595, 167843685, 167578945, 167589664, 167540932, 167306461, 167143021, 166544743, 166127491, 165968628, 165601292, 165263157, 164959373, 164558144, 164079742, 163866081, 163786774, 163516808, 163334351, 162988110, 162203941, 161732578, 161259918, 160376701, 159942198, 159848232, 159732742, 159349546, 158766317, 158660860, 158627005, 158127728, 157446556, 156989031, 156702213, 156395178, 156235914, 156176596, 155811481, 155216227, 155008802, 155229702, 155122223, 154609165]
3351.2A54609165l5696J73998l23286n35774m05627J18046M20800J3513m07028j83754
3360.8A53444357M2753l04756l36227p6056K47765M32348J26867k76718n46970k90938
3370.5A52462425J70584q8167n31969j01700N73883M67358m27466o67419K93007L40337
3380.1A52490873l17087l06749K38Q1425l3150K11573K65369N3587K9669O9771q984
3390.7A52536535l12338m00724J16825M70009l9463j0796L28369J05019K1219j45788
3400.4A52668867Q3351r0036l71256J72615M22030M63180J09110j66531j63459n3959
3410A53073912L17173K60915J12553o8712n1346K78473L85704Q2350j09253K79846
3419.7A54561615L77045K44608J55105J02368L25718O12773N83325L29075M14524K75049
$$ y = [154609165, 154573469, 154747467, 154424181, 153888407, 153482780, 153600826, 154021626, 154035139, 153628111, 153444357, 153487110, 153182354, 152846127, 152770071, 153017836, 153450184, 153577051, 153300333, 152753363, 152462425, 152633009, 152544842, 152012873, 151911173, 152485056, 152952414, 152524948, 151857529, 152150536, 152490873, 152173786, 151867037, 151867275, 151948700, 151915550, 152127123, 152392492, 152446079, 152475748, 152545519, 152536535, 152224197, 151823473, 151940298, 152410307, 152370844, 152360048, 152688417, 152793436, 152814655, 152668867, 152752218, 152662182, 152290926, 152463541, 152885571, 153348751, 153457861, 153291330, 153127871, 153073912, 153391085, 153652000, 153764553, 153695841, 153644495, 153922968, 154308672, 154391022, 154281769, 154561615, 154938660, 155183268, 155338373, 155440741, 155766459, 156379232, 156962557, 157291632, 157706156, 157981205]
3429.3A57981205K14262L1815k42272L81184N19542K14978J96247L11041M53033J29719
3439A60190754j05362O92692J173324L3074l624N48286L98693N86548j47438J91231
3448.6A63558178Q63209K17743J40781N17445J028442R34830J65596l25775P7247J125260
3458.2A68302956J262855N31006J00021N58358N96180L04737O11438P47662P15275
3466.9A73730488J00632Q9416O44264O93741P23438L83149N12046Q14629P28989O75945
3476.6A79096737O29082O75392M65240P60803P69310K68059N86663P78770P32174O63414
3486.2A85425644O71539N37205P43275J263923N93224K88296R48257R45511O77605
3494.9A92094479M39148M36611Q51021Q18252O58608J259803J369210K34699K4376
$$ y = [157981205, 158195467, 158227282, 157985010, 158366194, 158885736, 159100714, 159296961, 159608002, 160061035, 160190754, 160085392, 160778084, 161951408, 161984482, 161980858, 162529144, 162927837, 163514385, 163366947, 163558178, 164421387, 164639130, 164779911, 165297356, 166325798, 167260628, 167426224, 167100449, 167177696, 168302956, 169565811, 170096817, 170196838, 170755196, 171351376, 171656113, 172267551, 173015213, 173730488, 173831120, 173920536, 174564800, 175258541, 175981979, 176365128, 176877174, 177691803, 178420792, 179096737, 179725819, 180401211, 180866451, 181627254, 182396564, 182664623, 183251286, 184030056, 184762230, 185425644, 186097183, 186634388, 187377663, 188641586, 189234810, 189523106, 190471363, 191416874, 192094479, 192533627, 192970238, 193821259, 194639511, 195298119, 196557922, 197927132, 198161831, 198186207]
3503.6A98186207P60784J077404J218452R19285R16519M96483J25218R00669Q19740
3512.2B05420761O46343Q84457J363411J299438Q06027J355057J168403L72792N74855
3520.9B13891544J376706J183738K97814N97973R78641J444664J147404Q63876N33142
3529.6B22315502M56963J348324J215553J563377J628742J360398M94365j12304J761188
3538.3B32032108J698628R97715J067447J283226J102257R44748J833840J604633J317387
3547B43881989L40518J355649J859092J192589J932869P73163J430950J381245J602001
3555.6B55750065K356644P72132J271248J503811J770229J074887J568985J673851
3563.4B67741852M84867L610287K088585Q05892J206589J4763K961731J993504J945266
$$ y = [198186207, 198946991, 200024395, 201242847, 202162132, 203078651, 203575134, 203700352, 204601021, 205420761, 206067104, 206951561, 208314972, 209614410, 210420437, 211775494, 212943897, 213316689, 213891544, 215268250, 216451988, 216749802, 217347775, 218326416, 219771080, 220918484, 221782360, 222315502, 222772465, 224120789, 225336342, 226899719, 228528461, 229888859, 230383224, 230270920, 232032108, 233730736, 234728451, 235795898, 237079124, 238181381, 239126129, 240959969, 242564602, 243881989, 244222507, 245578156, 247437248, 248629837, 250562706, 251335869, 252766819, 254148064, 255750065, 258106709, 258878841, 260150089, 261653900, 263424129, 264499016, 266068001, 267741852, 268226719, 271837006, 273925591, 274731483, 275938072, 275952835, 278914566, 280908070, 282853336]
3572B82853336K295132J809559R26266J036663K335624J052609K543068K515869Q83503
3580.7B98251629J518650K147312J909714J104774L927670K378216p35588J936492
3588.4C12438869Q92392K988395L093357L329678K123718R35402L346062N80673K263107
3597.1C31991653L593903J401939K641144J541291J564979K757263K415505K227707
3604.8C50135384K703666L132706R33495K949600N95817Q12836P740402L160706j004143
3613.5C71160469M175530M75540L763656M460793Q76083K492028J53274K238998M189225
3622.2C93985596L272285K741509K617263K819825M027633Q777695M970245r947853
3629.9D13264198K066231N341187O560134K972107o48269K860985L955535L697396
$$ y = [282853336, 285148468, 286958027, 287884293, 288920956, 291256580, 292309189, 294852257, 297368126, 298251629, 299770279, 301917591, 303827305, 304932079, 308859749, 311237965, 310502377, 312438869, 313331261, 316319656, 319413013, 322742691, 324866409, 325801811, 329147873, 329728546, 331991653, 335585556, 336987495, 339628639, 341169930, 342734909, 345492172, 347907677, 350135384, 352839050, 355971756, 356905251, 359854851, 360450668, 361263504, 369003906, 372164612, 371160469, 375335999, 375811539, 379575195, 384035988, 384912071, 387404099, 387557373, 389796371, 393985596, 397257881, 399999390, 402616653, 405436478, 409464111, 418241806, 423212051, 413264198, 415330429, 420671616, 427231750, 430203857, 429555588, 432416573, 436372108, 440069504]
3637.6D40069504J954002K239647L428955L607521K433510J390457L392296N145721
3645.3D63661613O953011J60332k739258O912994K290764j570968m67263N581093N380859
3654D86163177N189515P271118o220017J207886O305695K565727K699966J167107K362633
3662.7E08712807J795654K310219K401466J054230N439110L684616O22406J431770
3670.4E27452278o651993K215424R060402J0538330K454643j6875038M91333Q259506
3678.1E36944885N781822k440795K57225L391800K327880J789666P01027O26525M244080
3686.8E53624115Q270149o560325m825592R309272m416847j607017N071144R18045
3694.5E59782944J684837M66003j07765J318512N69992L063851M572868l881912m059296
$$ y = [440069504, 442023506, 444263153, 447692108, 451299629, 453733139, 455123596, 458515892, 463661613, 470614624, 470774956, 468035698, 474948692, 477239456, 475668488, 475201225, 480782318, 486163177, 491352692, 498623810, 492403793, 493611679, 499917374, 502483101, 505183067, 506350174, 508712807, 510508461, 512818680, 515220146, 516274376, 521713486, 525398102, 526020508, 527452278, 520800285, 523015709, 532076111, 542614441, 545069084, 528194046, 528685379, 536944885, 542726707, 540285912, 540543137, 543934937, 546262817, 548052483, 548753510, 549380035, 553624115, 561894264, 555333939, 550508347, 559817619, 555400772, 553793755, 558864899, 559782944, 561467781, 561933784, 561826019, 563144531, 563714523, 566778374, 571351242, 567469330, 563410034]
3703.2E63410034M309273K127838L42941J219674L157272M566078p912941L035088
3710.9E74255257O286583j3635445L575134N386772Q59604J56746K203560K173920
3718.6E81262131l587799J038055O264153l084259n285874M988747K426185j29776
3726.3E83891563k374000q04672L209686J026344N335694j580735o632728R968185
3734E92039337K632332q820419j387863q7204L17077L410378L974838m043694J890564
3742.7E89925346J2303048o978646j8486328R057770N642319O908989j371499j2621154
3750.4E84379845J0561371l562241q161659N849342N095062M308281n861778J071587
3758.2E93679810O734085o969986l228875L722115J901398Q51898L954544k539558
$$ y = [563410034, 567719307, 569847145, 570190086, 571409760, 574567032, 579133110, 571220169, 574255257, 580541840, 566906395, 570481529, 575868301, 576727905, 576884651, 579088211, 581262131, 577674332, 578712387, 584976540, 581892281, 576606407, 581595154, 584021339, 583891563, 581517563, 580712891, 583922577, 584948921, 590284615, 588703880, 582071152, 592039337, 594671669, 585851250, 584463387, 584376183, 584693260, 588103638, 592078476, 588034782, 589925346, 602228394, 595249748, 576763420, 585821190, 591463509, 598372498, 597000999, 584379845, 594941216, 591378975, 583217316, 589066658, 594161720, 598470001, 592608223, 593679810, 600413895, 593443909, 590215034, 593937149, 595838547, 596690445, 600644989, 598105431]
3765.9E98105431n327568L581428O353188J514701j1198501R11102L654862J20391
3773.6E97715034J015015n31425J415519N89104K413406J307793p606392J991959K080116
3782.3F00390129O03600K227401k680778o00777J442223R81140O20308r04465j11046
3790.9F01967735Q0834M94575k22549J743316M064293n262909m916763K931442M305153
3799.6F05185127O991005m144287j2264900J926918L058586N731773O959267q798828
3807.3F04644661o444016M151040K274894O68679M52270k90031J247749N804176j35688
3816F12373734j5177918L774223O745263O129875L710098j9957085N1728N961189J846123
3824.7F05457230K911949J243362m190979j554985J359711M265976L399353r293823
$$ y = [598105431, 592777863, 596359291, 602712479, 604227180, 593028679, 593939781, 597594643, 597715034, 598730049, 598198624, 599614143, 600203247, 602616653, 603924446, 596318054, 598310013, 600390129, 600993729, 603221130, 600540352, 599939575, 601381798, 602362938, 602983246, 602078781, 601967735, 602048569, 602543144, 602320595, 604063911, 608128204, 602865295, 597948532, 600879974, 605185127, 612176132, 608031845, 595766945, 597693863, 600752449, 606484222, 613443489, 604644661, 598200645, 602351685, 604626579, 605295258, 605747528, 605457497, 606705246, 612509422, 612373734, 597195816, 600970039, 607715302, 613845177, 617555275, 597598190, 597649918, 603611107, 605457230, 608369179, 609612541, 605421562, 603866577, 605226288, 609492264, 612891617, 603597794]
3832.4F03597794P50465P783661o270027j020050J1102829o416207p372741P971344
3840.1F10127068m875031j798859P287751j945267m994621K294044J771736k37579
3847.8F07629242J123505r28536J782532O530990k896118K462540j8584328r43718
3855.6E96176109J2402687k48527k397690K398109K265511K540550n984115j35689
3863.3F07016945P462311o290932p223854L767776N722619P968978n492210j1783409
3871F01148224L068008O700058M268456j1134072n82542M620514L2539K378884M749756
3879.7F15249825n170708r064560N218277K717514J951866N057259j3917160K5138
3887.4F02067451M740754J446342N685501P93572r070015n13344K637329j271667J801986
$$ y = [603597794, 604348259, 612131920, 605861893, 604841843, 615944672, 609528465, 602155724, 610127068, 605252037, 603453178, 610740929, 608795662, 603801041, 606095085, 607866821, 607629242, 608752747, 607824211, 609606743, 616137733, 613241615, 615704155, 597119827, 596176109, 608578796, 608330269, 605932579, 608330688, 610596199, 613136749, 607152634, 607016945, 614479256, 608188324, 600964470, 604732246, 610454865, 618423843, 612931633, 601148224, 604216232, 610916290, 615184746, 604050674, 603468132, 608088646, 608121185, 610500069, 615249825, 610079117, 601014557, 606232834, 608950348, 610902214, 615959473, 602042313, 602067451, 606808205, 608254547, 613940048, 614733620, 605663605, 605150261, 607787590, 606515923, 608317909]
3896.1F08317909J174050J607170K834816j0950966L760834M782371m936027M324684
3903.8F10914841l071518l553658J65253J327286K581520N18417O23245r03244m07219
3912.5F08194923J24665n73807J802330L257561k929001n087700L747673O03065m652977
3921.1F04486732J872254K724876J768036j793022l858414Q66967J605987J528130
3928.8F09201546n16129n76858K282791k963677k398300K258568L74260J18942P74994
3937.5F08556137q5068q12149r59053J758766K114411l679428j135559J530685K29683
3946.2F07518425P58362k099076K16561Q29468k225190J545067M30374p75680M32968
3954.9F06631279N58243L10402p79190L63693l19557K33307K37464j124534N79681
$$ y = [608317909, 609491959, 611099129, 613933945, 602982979, 606743813, 611526184, 606590157, 610914841, 607843323, 604289665, 604454918, 605782204, 608363724, 608882141, 609505386, 608602142, 608194923, 608319588, 607745781, 609548111, 612805672, 609876671, 604788971, 608536644, 609139709, 604486732, 606358986, 609083862, 610851898, 609058876, 605200462, 606067429, 607673416, 609201546, 608685417, 608108559, 610391350, 607427673, 605029373, 607287941, 607662201, 607781143, 608556137, 608471069, 607658920, 606699867, 608458633, 610573044, 606893616, 605758057, 607288742, 607518425, 608276787, 606177711, 606394272, 607223740, 604998550, 606543617, 606973991, 606198311, 606631279, 607189522, 607499924, 606720734, 607084427, 606764870, 606998177, 607235641, 606111107, 606690788]
3963.6F06690788L25814n8670J60293r2811k21367j98632j00021M96101J68496q79860
3973.2F06290131J4610m2572M7607j19247L02582P45353m62036M32129K00195r4451
3982.8F07314301J32865l8261m2953o21491l52592k07901P75604j00479Q5220R30176
3992.5F07874489q61359k37808q0719K53258J44996l71093O01272K93045
4000.2F07616081
$$ y = [606690788, 607016602, 606957932, 607118225, 607025414, 606804047, 606605415, 606505394, 607001495, 607169991, 606290131, 606304741, 606262169, 606309776, 606190529, 606493111, 607238464, 606776428, 607208557, 607408752, 607314301, 607447166, 607408905, 607365952, 606744461, 606391869, 606183968, 606959572, 606859093, 606944313, 607874489, 607013130, 606775322, 606694603, 606947861, 607092857, 606721764, 607323036, 607616081]
##END=$$ End of the data block
