##TITLE=$$ Begin of the data block
##JCAMP-DX=5.00 $$ ACD/SpecManager v 10.08
##SPECTROMETER/DATA SYSTEM=Varian
##DATE=15 Jan 2013 10:20:44
##DATA TYPE=INFRARED SPECTRUM
##DATA CLASS=XYDATA
##ORIGIN=
##OWNER=
##NPOINTS=3735
##FIRSTX=399.26403809
##LASTX=4000.35498047
##MAXX=4000.35498047
##MINX=399.26403809
##MAXY=67.23726654
##MINY=15.20912933
##XFACTOR=1.0000000000
##YFACTOR=0.000000100000000
##FIRSTY=36.39766312
##DELTAX=0.96440572
##XUNITS=1/CM
##YUNITS=TRANSMITTANCE
##XYDATA=(X++(Y..Y))
399.3C63976631m642944l110962L662758J086120O212769j017304j2763137N18188
407C53922119N639992j895866k25983O91376n697098r301949p61871P962418M67147
415.7C50800285n201187r431076q056297J7675476J084862m67835J855126n021057
423.4C43238297l156357M269867J33857j815681O350250L569870j854515l537331l956031
432.1C43242226n940247k033043J0307961J769142o048813J093903J416778k99415
439.8C43508492r25560L458251L36571m693184j791534O981M130440L570976L9902
448.4C47641335n56756j149101k036705m142380j697731J235848N62744K389450K001495
457.1C44248199m546318q71162L803749J956711k676773j336861l95355j805039k31094
$$ y = [363976631, 359333687, 356222725, 359885483, 360971603, 367184372, 366167068, 353403931, 353922119, 359562111, 357666245, 357440262, 358131638, 352434540, 343132591, 342370720, 350333138, 350800285, 345599098, 336168022, 328111725, 345787201, 346872063, 346404228, 348259354, 343238297, 340081940, 344351807, 344485664, 342669983, 349020233, 352590103, 350735588, 347198257, 343242226, 337301979, 335268936, 345576897, 347346039, 341297226, 342391129, 343807907, 343508492, 342582932, 346041183, 346377754, 341684570, 339893036, 339900017, 344030457, 347601433, 347641335, 347084579, 345935478, 343898773, 339756393, 338058662, 339294510, 339857254, 342246704, 344248199, 339701881, 338830719, 342634468, 344591179, 341914406, 340577545, 340182190, 338377151, 338146057]
465.8C38146057k123337j667900J751519j501084k807236p04040r61380O16798P4158
474.5C30823555l462296J866799L03879m054146L683472K030639j534500K1973J06888
483.2C29786263r71756m088936k292328o98891k41470J051826L843727K831307j748238
491.8C27471504k578850j199646l38859J03569K852516L11966l408165m10652q39729
500.5C21963654j787987k182732O06556L019428j405029l347473k96383J860256K505226
509.2C20935516n63926l597527j790199j198597j22299K90088o52351P40433Q17814
517.9C14858952J579399j313401l231315m76837J48372n37986l080483o05488J162358
526.6C08503571j171589J786995J781864j268139n51567L62167j121673L03497J201572
$$ y = [338146057, 336022720, 334354820, 336106339, 334605255, 331798019, 331093979, 330132599, 330749397, 330823555, 327361259, 329228058, 329531937, 325477791, 329161263, 331191902, 329657402, 329679375, 329786263, 328814507, 324725571, 322433243, 321734352, 321492882, 322544708, 326388435, 329219742, 327471504, 324892654, 323693008, 323354149, 323457718, 326310234, 326622200, 323214035, 322803383, 321963654, 320175667, 317992935, 318599491, 321618919, 320213890, 316866417, 316570034, 318430290, 320935516, 320371590, 316774063, 314983864, 313785267, 313662968, 313953056, 313300705, 314041138, 314858952, 316438351, 315124950, 311893635, 311416798, 311565170, 311027184, 307946701, 307341213, 308503571, 307331982, 309118977, 310900841, 309632702, 309081135, 309443302, 308321629, 308625126, 309826698]
535.2C09826698j942348j497841O36368m99039j431465r0504q07266k16255Q86211
543.9C04864559r71527L49999P9612j733970j738682j582375K74735k26193j193924
552.6B98122234J9551O85920P19815k37580k283134j367569k1782n18799j51806n56049
562.3B94410801J899853K517566j117115j639690l47691O63338p85160m4537K053624
570.9B97610989k55204j005554m16298l50837J016197L67450j053333n39055j33571
579.6B95240784j66817o15864l52154l07216m42581J054115Q50162P69272N06153m46567
589.3B96089287K58446J80015N30624O51951q3313l46775M86546k32849j124249J583462
598.9B97993145N60284j283627m53033m13285P93915l55244j701087p72381j88866
$$ y = [309826698, 307884350, 306386509, 307022877, 306523838, 305092373, 305001869, 304194603, 303978348, 304864559, 303893032, 304243031, 304322643, 302588673, 300849991, 299267616, 299542351, 299316158, 298122234, 298141785, 298827705, 299547520, 299309940, 297026806, 295659237, 295637455, 295118656, 294966850, 294410801, 296310654, 298828220, 297711105, 296071415, 295723724, 296387062, 295601902, 295557365, 297610989, 297355785, 296350231, 295933933, 295583096, 296599293, 296966743, 295913410, 295374355, 295240784, 295073967, 294458103, 294105949, 293798733, 293356152, 294410267, 295260429, 296029701, 296535854, 296089287, 296347733, 296527748, 297058372, 297710323, 297627010, 297280235, 297766781, 297533932, 296409683, 297993145, 298553429, 297269802, 296816769, 296403484, 297197399, 296842155, 295141068, 294368687, 294179821]
607.6B94179821l60298p06520n94616o41709l07979j95770k28520j475982j564789
616.3B88103638K98519L51047P04308O87504P73983O59237j70727P76577Q34541p5512
625.9B92943115R42593J481285J002541R66491J214314K450714J440315q1406J339493
634.6C03699455J604443R03320J924610K893181L81737M34208L157196J728878k25830
643.3C16501198r50813Q71887K000007N58739P15523O95762J511078J709404L52021
651.9C23964806J77383J22376m3412M16756P45087q98896q34541R42993n56030j087723
661.6C22948799L10784P35740l1357o90269o55060k484856k402763L918190K366295
670.3C24015503K007980N77698J33514P06711R35135Q44612P06330J112671J566162
$$ y = [294179821, 293819523, 293113003, 292518387, 291876678, 291568699, 291372929, 291144409, 289668427, 288103638, 288402157, 288753204, 289457512, 290145016, 290918999, 291578236, 291407509, 292184086, 293018627, 292943115, 293885708, 295366993, 296369534, 297336025, 298550339, 301001053, 302441368, 302359962, 303699455, 305303898, 306207218, 308131828, 311025009, 311406746, 311840954, 314998150, 316727028, 316501198, 315550385, 316422272, 318422279, 318981018, 319696541, 320392303, 321903381, 323612785, 323964806, 324142189, 324264565, 324221153, 324637909, 325382996, 324484100, 323649559, 324592552, 324036522, 322948799, 323259583, 323995323, 323963966, 323273697, 322618637, 320133781, 317731018, 321649208, 324015503, 326023483, 326601181, 326734695, 327441406, 328376541, 329221153, 329927483, 331040154, 332606316]
678.9C32606316J720962J088562N21927P44743J728135K137260J617393K028733J003189
687.6C45197220p0915O10771M66766R06296R19151m23698K6779J567764J261978R54972
697.3C51417084J053085J09062K84996J116524J084976K24800M10996J071167L51066
705.9C57123756O63109J108361J402168J559143K59437Q9913J069870O49299n2566
714.6C63872490O55174Q40531L23600M85459J206665O93779K30903J465989R78851
723.3C70753441O24847N23720P2899J101990J281089J412430J617966J168442L79905
732C78936729N40734J195640N34287N35965R79118P37877l79028K37884J094589r1171
741.6C84322624K51847R47723J086235J444969J358643J85318M22325J184044l95241
$$ y = [332606316, 334327278, 335415840, 335937767, 336682510, 338410645, 340547905, 342165298, 344194031, 345197220, 345126305, 345737076, 346203842, 347110138, 348029289, 347605591, 347632370, 349200134, 350462112, 351417084, 352470169, 352579231, 352864227, 353980751, 355065727, 355290527, 355701523, 356772690, 357123756, 357786865, 358895226, 360297394, 361856537, 362115974, 362205887, 363275757, 363925056, 363872490, 364527664, 365368195, 365691795, 366177254, 367383919, 368077698, 368308601, 369774590, 370753441, 371378288, 371902008, 371974907, 373076897, 374357986, 375770416, 377388382, 378556824, 378936729, 379477463, 380673103, 381207390, 381743355, 382722473, 383460350, 383081322, 383319206, 384413795, 384322624, 384574471, 385522194, 386608429, 388053398, 389412041, 389597359, 390019684, 391203728, 390808487]
750.3C90808487l03345J130409J764641R16481O20728Q32023O42968J687431R42345
759C99042168J274070J942444J040001N14107N88913J894798N58205m89655J59531
767.7D06524582J103706J413269N31922Q11386j91803l93830j30348k55546J81503
776.4D09594841N2300J8653j65252P08694P04651M86870N08880L35961K02789j082496
786D11365891o11268O65932J668472J155739j57737n01214k41661O91262M95834J17416
795.6D14648666j261787j345329j006813j586266m93317J84555L04223j799317k285232
804.3D05359383j206055k183342k036400j496506j580352k626915k691689k288132
812C89249992j288986K24838r02786j875572j851234j043358n81208p72895J86119
$$ y = [390808487, 390505142, 391635551, 393400192, 394316673, 394937401, 395769424, 396412392, 398099823, 399042168, 400316238, 402258682, 403298683, 403812790, 404401703, 406296501, 406854706, 406365051, 406524582, 407628288, 409041557, 409573479, 410384865, 410193062, 409799232, 409668884, 409413338, 409594841, 409647141, 409665794, 409500542, 410209236, 410913887, 411400757, 411909637, 412245598, 412448387, 411365891, 410754623, 411420555, 413089027, 414244766, 414087029, 413585815, 413344154, 414035416, 414531250, 414648666, 413386879, 412041550, 411034737, 409448471, 408955154, 409139709, 409443932, 407644615, 405359383, 404153328, 401969986, 399933586, 398437080, 396856728, 394229813, 391538124, 389249992, 387961006, 388185844, 387283058, 385407486, 383556252, 382512894, 381931686, 381158791, 381344910]
820.7C81344910P14759J255684K370224L023415K190590J789780K693748K965469L260918
829.4D01609497L520470L536300L144837L201179K846604K606621K891197K985038
837.1D26341743K812615J659546K735481L059502K467537J580963P67364J895256J510506
845.8D44830513K131729J308251M81987J348800J808129K217178O96030J475944K229347
854.5D58527908J765976J176987R64966J676903J699905K015457J209030J595154O17981
863.1D71250267K56844J125412J26152Q2130j179657j119842j060944q44421q73757
871.8D67762184j488190j119270j360321l92837j976319j798706m00925j316871j570931
880.5D56337814j565399p11784j147652j53885k1248n42221o82563j505051m13590
$$ y = [381344910, 382059669, 383315353, 385685577, 388708992, 390899582, 392689362, 395383110, 398348579, 401609497, 405129967, 408666267, 411811104, 415012283, 417858887, 420465508, 423356705, 426341743, 429154358, 430813904, 433549385, 436608887, 439076424, 440657387, 441424751, 443320007, 444830513, 446962242, 448270493, 448752480, 450101280, 451909409, 454126587, 454822617, 456298561, 458527908, 460293884, 461470871, 462435837, 464112740, 465812645, 467828102, 469037132, 470632286, 471250267, 471507111, 472632523, 472758675, 472840805, 471661148, 470541306, 469480362, 468635941, 467762184, 466273994, 465154724, 463794403, 463401566, 461425247, 459626541, 459225616, 457908745, 456337814, 454772415, 454060631, 452912979, 452759094, 452737846, 452195625, 451513062, 450008011, 449594421]
889.2D49594421r59663l07503o77986j175156K60659K40249Q59146N14832M66080k66571
898.8D48548508m65584K3537n30816r73777j019936J067810J597595K262841K859001
907.5D53369179L023491L148803J537590J001587o54564l31115m38805j366081j280861
916.2D58009224k557640k405129k846260k625160k924042l509063l393441l169899
923.9D34578590k680473l683243l334617l373337l730316l765946l131294k309380
931.6D08569984k911224k208061j762161j252404j295623j319886j082458j834030
939.3C94904137j149178j157455q48923r23996j325150p46536j000519n79643l70407
948C86802330K69966N39742j38779n87235m12902L41949o96678j789742k025146j643601
$$ y = [449594421, 448634758, 448327255, 447649269, 446474113, 446734772, 446975021, 447834167, 448348999, 448815079, 448548508, 448082924, 448106461, 447575645, 446601868, 445581932, 446649742, 448247337, 450510178, 453369179, 456392670, 459541473, 461079063, 462080650, 461426086, 461094971, 460656166, 459290085, 458009224, 455451584, 453046455, 450200195, 447575035, 444650993, 441141930, 437748489, 434578590, 431898117, 428214874, 424880257, 421506920, 417776604, 414010658, 410879364, 408569984, 405658760, 403450699, 401688538, 400436134, 399140511, 397820625, 396738167, 394904137, 393754959, 392597504, 391748581, 390824585, 389499435, 388752899, 387752380, 387172737, 386802330, 387072296, 387612038, 387473259, 386886024, 386473122, 386815071, 386118393, 384328651, 382303505, 380659904]
957.7C80659904k391738k949143j775398k139397k284202j987648k069626k336884
965.4C62725868k302818j946106k318497k068939j928139j955833k615738l399925
973.1C44189873l038750l386993l546524l502503m408340m808159m162827m201221
980.8C13134556m978962m867191n047188n447636m959793n092735n065499m826011
988.5B72849541m450169l877449l678493l603058m155960l250161k887115k866402
996.2B44080734k686004l254681k489357k819939k947254l116741k725601j778145
1004B22263012j818523j637784k202777j388760j765709j769638j019001j626720j637574
1012.6B07396526k100067j776066k318592j726970j379567j862068k005863k984028
$$ y = [380659904, 378268166, 375319023, 373543625, 371404228, 369120026, 367132378, 365062752, 362725868, 360423050, 358476944, 356158447, 354089508, 352161369, 350205536, 347589798, 344189873, 341151123, 337764130, 334217606, 330715103, 326306763, 321498604, 317335777, 313134556, 308155594, 303288403, 298241215, 292793579, 287833786, 282741051, 277675552, 272849541, 268399372, 264521923, 260843430, 257240372, 253084412, 249834251, 246947136, 244080734, 241394730, 238140049, 235650692, 232830753, 229883499, 226766758, 224041157, 222263012, 220444489, 218806705, 216603928, 215215168, 213449459, 211679821, 210660820, 209034100, 207396526, 205296459, 203520393, 201201801, 199474831, 198095264, 196233196, 194227333, 191243305]
1020.3A91243305j839599k017117j321468j393605k356567j625595j323509l60451
1028.1A79005394j288452j133442j465874j044273m99211r16900M56085l30524O58302
1036.7A73441105J171036J786632J585198J306533K387734P27863J350117Q1291m58393
1045.4A83379116m9858l74851K12192j552238j166802q05568r3499j068363j673317
1054.1A76806812j084499j970348m5987K5235K98137m57992L71399J924514J072846
1062.8A76940117K247066J890526K437420J642780J498738J635780J128101J471081
1070.5A90891609J95408J381168Q62732M24309L81699R23958J700229p5912J49936
1079.2A96835136m98638Q09593J536065J291256J723403O97403J288224M82540M74033
$$ y = [191243305, 189403706, 187386589, 186065121, 184671516, 182314949, 180689354, 179365845, 179005394, 177716942, 176583500, 175117626, 174073353, 173574142, 172657242, 173113327, 172782803, 173441105, 174612141, 176398773, 177983971, 179290504, 181678238, 182406101, 183756218, 183837509, 183379116, 183329258, 182954407, 183166599, 181614361, 180447559, 179641991, 179548492, 178480129, 176806812, 175722313, 173751965, 173705978, 173731213, 174029350, 173571358, 173942757, 175867271, 176940117, 179187183, 181077709, 183515129, 185157909, 186656647, 188292427, 189420528, 190891609, 191087017, 192468185, 193330917, 193755226, 194136925, 195060883, 196761112, 196685200, 196835136, 196336498, 197146091, 198682156, 199973412, 201696815, 202394218, 203682442, 204164982, 204639015]
1087.9B04639015P58248J394558J515331Q43830J973553J478500J227951J502132J614209
1096.5B16947327K99949N48020J576824J257152K149754J077118J470814J607742J066570
1105.2B28001270J314125O03314J308498J275749R69201L51905P02687J101455N14641
1113.9B36142845R82018R49611R86595L44544N6152o1454k28444n39913p43789j9475
1123.5B37868690j34048P80029R92012J974297K251530Q41827J944580K090416J487484
1132.2B50096817J300068K117290K472439K636948K774505J776486K121200J912022
1139.9B67207775J962395J694336J323585J440850N94616O48307O01483M51965M20
1148.6B75925732K6264Q19397P35836k1439n55973K76756K69547m23222j371193j773681
$$ y = [204639015, 205397263, 206791821, 208307152, 209150982, 211124535, 212603035, 213830986, 215333118, 216947327, 217247276, 217795296, 219372120, 220629272, 222779026, 223856144, 225326958, 226934700, 228001270, 229315395, 229918709, 231227207, 232502956, 233472157, 233824062, 234526749, 235628204, 236142845, 237124863, 238074474, 239061069, 239405613, 239461765, 239400311, 239171867, 238631954, 237888165, 237868690, 237734642, 238514671, 239506683, 241480980, 243732510, 244574337, 246518917, 248609333, 250096817, 251396885, 253514175, 255986614, 258623562, 261398067, 263174553, 265295753, 267207775, 269170170, 270864506, 272188091, 273628941, 274223557, 274871864, 275473347, 275925312, 275925732, 275951996, 276771393, 277507229, 277485790, 276929817, 277206573, 277476120, 277052898, 275681705, 273908024]
1158.3B73908024o87142j56211l35656q45909K25926Q17241J079598J715870J240082
1166.9B76961823K063713K599811K718048K601414K807598L032932K746640L029823
1174.6B98561802L076305L339577L276234L049373K438965K224674K381745K133159
1182.4C20481834K266274K099152J769943J677704J567306J161308J100083O77948
1190.1C32801552J25046q6136o2027p3509j033860p03850k58750q01964r44672j447983
1199.7C27513847j299820r79385j317482j265373j007424p50770p74002q18272n13096
1208.4C18788223m46319m81034j35154l16277q25081n20668j81846r6417m21257o52580
1218C14711590m99516l06053K3480m49620o79645m32339q05683j287594j091270n38636
$$ y = [273908024, 273220882, 273064671, 272729015, 271883106, 272109032, 272926273, 274005871, 275721741, 276961823, 279025536, 281625347, 284343395, 286944809, 289752407, 292785339, 295531979, 298561802, 301638107, 304977684, 308253918, 311303291, 313742256, 315966930, 318348675, 320481834, 322748108, 324847260, 326617203, 328294907, 329862213, 331023521, 332123604, 332801552, 332926598, 332840462, 332778435, 332704926, 331671066, 330967216, 330708466, 329906502, 328961830, 327513847, 326214027, 325234642, 323917160, 322651787, 321644363, 320893593, 320119591, 319301319, 318788223, 318341904, 317860870, 317725716, 317409439, 316584358, 316063690, 315881844, 315785427, 315364170, 314711590, 314212074, 313906021, 313929501, 313479881, 312800236, 312367897, 311562214, 310274620, 309183350, 308644714]
1227.7C08644714q96854r18522p10335r66873p82604o24638k95391m56772o53629n50995
1237.3C01788101n57766m01897m13227l05577m04300k70500l89843k78454O6700n76210
1247B98257027p27635o79340k97432K5520m01344m94862l9100J14155m04797k03343
1256.6B95148849k7160J02691j42860m13589L53145L08323L86791N18895M30641L28865
1266.3B96994591K86045N67169P09476R66473P12166Q09536R62315J005268J090507
1274.9C04103546R52015J242275J259938J173648Q84266Q42896J087379J194020J442375
1283.6C14182358J518535J449910J529216J580143J271744J443138J240006Q67920
1291.3C25082970O25534O34422J240463J157456J155815R99985P92427N77430P6065
$$ y = [308644714, 307747860, 306829338, 306119003, 305152130, 304369526, 303744888, 303449497, 302992725, 302339096, 301788101, 301230335, 300828438, 300415211, 300109634, 299705334, 299434834, 299044991, 298766537, 298833237, 298257027, 297529392, 296850052, 296552620, 296578140, 296176796, 295681934, 295642834, 295756989, 295352192, 295148849, 295121689, 295224380, 295081520, 294667931, 295021076, 295329399, 295716190, 296235085, 296665726, 296994591, 297280636, 297847805, 298557281, 299523754, 300235920, 301045456, 302007771, 303013039, 304103546, 305055561, 306297836, 307557774, 308731422, 309615688, 310458584, 311545963, 312739983, 314182358, 315700893, 317150803, 318680019, 320260162, 321531906, 322975044, 324215050, 325082970, 325708504, 326342926, 327583389, 328740845, 329896660, 330896645, 331689072, 332266502, 332342567]
1300C32342567J36719L62663J62621j30539J08261k60811m86297q087K71759J38359
1309.7C32637215l48587p13158j103935r52950j044388n21087M54521J88866J76429
1318.3C28772926P76253J537209J236686P07589O82449O01272R44520N74150K27203
1327C36060257P2021K06910K11219j48620j21536m95530n35278n29594m23432l22761
1336.7C33973656l12691j13258j3848O53572J057587J235771R14612R70192J097069
1345.3C39462662M68139L30773K27852O78634P8583q3771R613m34265l9558l29170
1355C40369492l43132n12352j12191m26254p43828n10483j136016k98691o94695K39716
1364.6C35831566K07558r78165l22800n55649m30297n64461o41480m72488l65143j81770
$$ y = [332342567, 332479286, 332841949, 333004570, 332874031, 332982292, 332721481, 332235184, 332227097, 332498856, 332637215, 332288628, 331575470, 330471535, 329518585, 328474197, 327953110, 328407631, 328596497, 328772926, 329549179, 331086388, 332323074, 333030663, 333713112, 334314384, 335258904, 335833054, 336060257, 336132278, 336339188, 336550407, 336401787, 336280251, 335784721, 335249443, 334719849, 334296417, 333973656, 333660965, 333547707, 333533859, 334187431, 335245018, 336480789, 337395401, 338365593, 339462662, 339930801, 340261574, 340489426, 341168060, 341246643, 341162872, 341172485, 340738220, 340698662, 340369492, 340026360, 339514008, 339401817, 338975563, 338231735, 337721252, 336585236, 336286545, 335591850, 335831566, 336039124, 335060959, 334738159, 334182510, 333752213, 333187752, 332546272, 332073784, 331708641, 331526871]
1374.3C31526871n99442L08762L11851M24118q5449l53355l92151j012879r69314j658325
1383.9C27500687j411286j208153j252555k420693k019768p53555j615105j833438
1391.6C14986134j913567j729984l013878l675823j443215j733951j674519k973747
1399.3B96827450k632504j427555j936989k024440k070942k814904k931003j640377
1407.1B79348736j526623j773586j585961j793289j241207j597557j191196l06931
1414.8B68332386m88758p41062j586323L2463j476479o04248J422844J81065L07121
1423.4B65379009o92787P82890J324025O71157J350327N16853J045628J121445J784381
1432.1B73282928J500302J580410K619705J888866J824894J183892K833481J862812
$$ y = [331526871, 330927429, 331236191, 331548042, 331972160, 331886711, 331533356, 331141205, 330128326, 329159012, 327500687, 326089401, 324881248, 323628693, 321208000, 319188232, 318434677, 316819572, 314986134, 313072567, 311342583, 308328705, 304652882, 303209667, 301475716, 299801197, 296827450, 294194946, 292767391, 290830402, 288805962, 286735020, 283920116, 280989113, 279348736, 277822113, 276048527, 274462566, 272669277, 271428070, 269830513, 268639317, 268332386, 267843628, 267102566, 265516243, 265548706, 264072227, 263467979, 264890823, 265071888, 265379009, 264686222, 265469112, 266793137, 267464294, 268814621, 269331474, 270377102, 271498547, 273282928, 274783230, 276363640, 278983345, 280872211, 282697105, 283880997, 286714478, 288577290]
1439.8B88577290J903038K273445R63840K258911J657582K264614K176666J247044
1447.6C03322430R89494J791191K559891J208744J994018J548634K096462K002602
1455.3C17513466P76348K110386l31230L701515J893616K516021K491532J599426K515526
1464C34786606J151199K125206K442246L097610K200012K289963L490410K441597L174057
1472.6C57198906K432365L385353K938996K471008L177223L092842K626839J911392
1480.3C79234924K089272J577759J933708J740150J284561J748696J128692J227799
1488.1C91965561J609230j06850n78918L28750L63121n82580r15833o38580m523888
1496.7C86920013l12576j050529l311730n31196j007424j024780j026611K81334J18331
$$ y = [288577290, 290480328, 292753773, 293717613, 295976524, 297634106, 299898720, 302075386, 303322430, 304311924, 306103115, 308663006, 309871750, 311865768, 313414402, 315510864, 317513466, 318289814, 320400200, 320068970, 323770485, 325664101, 328180122, 330671654, 332271080, 334786606, 335937805, 338063011, 340505257, 343602867, 345802879, 348092842, 351583252, 354024849, 357198906, 359631271, 363016624, 365955620, 368426628, 371603851, 374696693, 377323532, 379234924, 381324196, 382901955, 384835663, 386575813, 387860374, 389609070, 390737762, 391965561, 393574791, 393467941, 392889023, 393217773, 393580894, 392998314, 392082481, 391443901, 386920013, 386607437, 385556908, 382245178, 381713982, 380706558, 379681778, 378655167, 378936501, 379054832]
1505.4C79054832m356575m783325P6332J827164n57976L75672m92783j519394k09007
1514.1C69414940o63414m38957j804314k362022K68707Q23669p38716j015854R90753
1522.8C64474792Q92067J795464K13165P71179J052247L25737P34710Q47855R35821
1531.5C72043037L08266K61154n34248J498794J521416J188698J518059l193665k165260
1540.1C72446251K074242J300163o46248J106911J399612q51059J178894N99404J311721
1548.8C79919891k26249j758461P10525K89192J067162k707825j306610R04579K190247
1557.5C79082451K01149r218903k47917j376533O49032j555633j636353l561668l388939
1566.2C58946686j087799k418747q65975r660911k817383j600723l703423l254585
$$ y = [379054832, 374698257, 369914932, 369991264, 371818428, 371260452, 371636124, 371143341, 369623947, 369414940, 368751526, 368312569, 366508255, 364146233, 364414940, 365238609, 364499893, 363484039, 364474792, 365366859, 367162323, 367375488, 368146667, 369198914, 369524651, 370259361, 371107216, 372043037, 372351303, 372612457, 372078209, 373577003, 375098419, 376287117, 377805176, 374611511, 372446251, 374520493, 375820656, 375174408, 376281319, 377680931, 376829872, 378008766, 378608170, 379919891, 379693642, 377935181, 378645706, 378934898, 380002060, 377294235, 375987625, 376892204, 379082451, 379283600, 370064697, 369816780, 368440247, 369089279, 367533646, 365897293, 362335625, 358946686, 357858887, 355440140, 354574165, 344913254, 342095871, 340495148, 336791725, 333537140]
1573.9C33537140l572273j693154j3432731j840535l252163m642257m100800n563793
1581.6B95439434l613338o014405l557186n320930m438992m231319n515805l632507
1589.3B59114952o181450l030758n185451l117848l829384n180606k561951m347229
1597B25680275j875286m573383j979046l330269l244114j815949l888874q63247l447647
1605.7B00662460p77549k620659j293240r24816k568665J14060k654896L31211j816940
1614.4A88450966O41498J92471n532131K052765r77803J657525j204949Q93498O6223
1623.1A86240063j235256J786251k67964K372132j112710J316777K14386N44491J293525
1631.7A91151695K60792K864838K22187K795524j694889K626553J605491R87664K809734
$$ y = [333537140, 329964867, 328271713, 314838982, 312998447, 309746284, 305104027, 301003227, 295439434, 291826096, 285811691, 282254505, 276933575, 272494583, 268263264, 262747459, 259114952, 252933502, 249902744, 244717293, 241599445, 237770061, 232589455, 230027504, 225680275, 223804989, 219231606, 217252560, 213922291, 210678177, 208862228, 204973354, 204110107, 200662460, 199884911, 197264252, 195971012, 195046196, 192477531, 192591591, 189936695, 190267906, 188450966, 189092464, 189284935, 183752804, 185805569, 184827766, 186485291, 185280342, 186173840, 186240063, 185004807, 186791058, 186523094, 188895226, 187782516, 189099293, 189313679, 189858170, 191151695, 191412487, 194277325, 194499512, 197295036, 195600147, 198226700, 199832191, 200819855, 203629589]
1640.4B03629589K22111K705803P73430K264995J756096K54765K975902o94103L986092
1649.1B17874680O40335K772102K415504L726807n63564k533112M313431J300373K619972
1657.8B32566528J312504K171326K517414J700878L427048R52835M051189K205601
1665.5B50905323K824554K993775K973843M346485J431598N164681K282905L872567
1673.2B76795731L953800L986950L588772L056907N166073L267345M492817L491173
1680.9C07799568M853554N779839K444572N208130K785644O435357M875831M401856
1688.6C44584351M806671M850235N433464M510727N541458N270271N056648K540627
1696.4C82594452N903664O599006O741486P148208k556495O416282N585938M990272
$$ y = [203629589, 203851700, 206557503, 207330933, 209595928, 211352024, 211606789, 214582691, 213888588, 217874680, 218515015, 221287117, 223702621, 227429428, 226865864, 224332752, 228646183, 229946556, 232566528, 233879032, 236050358, 238567772, 240268650, 243695698, 244648533, 248699722, 250905323, 253729877, 256723652, 259697495, 264043980, 265475578, 270640259, 272923164, 276795731, 280749531, 284736481, 288325253, 291382160, 296548233, 299815578, 304308395, 307799568, 312653122, 318432961, 320877533, 326085663, 328871307, 335306664, 340182495, 344584351, 349391022, 354241257, 359674721, 364185448, 369726906, 374997177, 380053825, 382594452, 388498116, 395097122, 401838608, 408986816, 406430321, 412846603, 418432541, 423422813]
1704.1D23422813L699265L645897L456917L247680M759713L175125J959419K617378
1711.8D49984207L087273L104400J079903J289368M018326L239746l595620L181382
1719.5D65388985L962249K382431J944504J166840Q12454J695824J965255J426354
1727.2D80744896J724892K299308N39742P20329L709717M347687L18756m334412L415909
1735.9D93486824M124603K679482L598442J227341j207047M790001M072838J417541
1743.6E14190025K384491M378243M036369K953873L392410K279167N020714L041840
1751.3E41677132J370849N201187L862839L739357L671036J233101L114509M055939
1759E67925949L156853L997421L0975j45835L895568K294350K071152K541580K364845
$$ y = [423422813, 427122078, 430767975, 434224892, 437472572, 442232285, 445407410, 447366829, 449984207, 453071480, 456175880, 457255783, 458545151, 462563477, 465803223, 462207603, 465388985, 469351234, 471733665, 473678169, 474845009, 475657463, 477353287, 479318542, 480744896, 482469788, 484769096, 485308838, 486029167, 489738884, 494086571, 494405327, 490070915, 493486824, 497611427, 500290909, 503889351, 505116692, 503909645, 508699646, 512772484, 514190025, 516574516, 520952759, 524989128, 527943001, 531335411, 533614578, 538635292, 541677132, 543047981, 548249168, 552112007, 555851364, 559522400, 560755501, 563870010, 567925949, 571082802, 575080223, 575111198, 574965363, 578860931, 581155281, 583226433, 585768013, 588132858]
1767.7E88132858j010627K485542N182495R15718j615791j593819M361877L138123
1775.4E99996376o80428K141877J537590J999359N51147m90455J726684K277794K119103
1784.1F11179047n70717J25770J853981J283951O29425J898270J139870M57840q75702
1792.8F17121735o69823M020653J725006m34380J082611K167893Q22296j460381K387276
1801.5F26762886N59883Q02574J907349Q59833J649093O86379K39029P56836J417579
1810.2F35641441r70192K17553J501884N72052J524773N00374J173248J86691O28586
1818.8F40976410J286774k43531P15638m55781J179657J826249j594620p4997K031631
1827.5F45647430K549668Q07876k451706k7237K002183L27682n5008M22058Q46405
$$ y = [588132858, 587122231, 589607773, 594790268, 595705986, 594090195, 592496376, 596858253, 599996376, 599315948, 601457825, 602995415, 604994774, 605545921, 605055466, 606782150, 609059944, 611179047, 610608330, 610734100, 612588081, 613872032, 614501457, 616399727, 617539597, 617997437, 617121735, 616451912, 620472565, 622197571, 621763191, 622845802, 625013695, 625835991, 624375610, 626762886, 627322769, 628125343, 630032692, 630892525, 632541618, 633227997, 633467026, 634223862, 635641441, 634671249, 634888802, 636390686, 636962738, 638487511, 638987885, 640161133, 640347824, 640976410, 642263184, 642019653, 642735291, 642279510, 643459167, 645285416, 643690796, 643615799, 645647430, 648197098, 649004974, 646553268, 646526031, 648528214, 648855896, 648800888, 649222946, 650069351]
1836.2F50069351Q44650j34429J385192N13688M64019J92643J680984J808929n871963
1844.9F50953064J761017K566147l0213m28238O25687J439362J65863Q19854J45951
1853.6F58018494M38003J2665m29382N54123L04336O52695k73972O15845M33960N79987
1863.2F60906754Q07800K03476Q25119n20020N77317j377182j249543J695710O79779
1871.9F62549210N59311L53469O46592j64109N42908M95148j74790J60675l65905L95431
1881.5F64997940l67660L44009M60434K83584O95420j97067J012878j5640j396790
1890.2F65817108K63138P01218j679P77741O63299j005630N19256P9956K14157K45743
1899.8F68274307P4539N20935l07998L64761n1880K70462J87912N341R8038J3046K99301
$$ y = [650069351, 650914001, 650779572, 652164764, 652678452, 653142471, 653335114, 655016098, 656825027, 650953064, 652714081, 655280228, 655250015, 654821777, 655447464, 656886826, 657052689, 657872543, 658018494, 658456497, 658469162, 658039780, 658593903, 658898239, 659550934, 659276962, 659892807, 660326767, 660906754, 661714554, 661918030, 662743149, 662223129, 662800446, 661423264, 660173721, 661869431, 662549210, 663108521, 663461990, 664108582, 663944473, 664487381, 664982529, 664807739, 664968414, 664602509, 664997940, 664630280, 664974289, 665434723, 665718307, 666413727, 666216660, 667229538, 667213898, 665817108, 666080246, 666781464, 666779785, 667557526, 668220825, 667215195, 667734451, 667814407, 668028564, 668274307, 668348846, 668869781, 668561783, 668926544, 668874664, 669145126, 669333038, 669338379, 669436417, 669449463, 669748764]
1910.4F69748764o63681O74057K2125n0201P9193J95694J872406j454620j010514P85980
1920.1F70199203O76651N34440j174469m75083N07279N99517j2817K52762k40402L6316
1929.7F70903397K93121l63998O13861k49100k10266m87290n0125O60324R2774M91333
1939.4F71694031k86179R64813j48849j914978L73917J93481j44119j05744M69590
1948.1F71095963q2169j1368K92816J27716J73417n16358l59344l94745O3324l71399
1957.7F70017853j54419M63562J61590L95661k07672K01111l81241l17841q9264q39615
1967.3F69249725q7585m8599N81360K98156K37885L83377J55792n9433m98047P3319
1977F70285950n65949j24359J95313l9826M4022j97754j602j61820M78974k81983k98538
$$ y = [669748764, 669085083, 669759140, 669781265, 669731064, 669810257, 670005951, 671878357, 670423737, 669413223, 670199203, 670875854, 671410294, 670235825, 669760742, 670268021, 670867538, 670854721, 671107483, 670867081, 670903397, 671196518, 670832520, 671446381, 671197281, 670987015, 670499725, 670449600, 671109924, 671202698, 671694031, 671407852, 672372665, 672223816, 670308838, 670682755, 670876236, 670732117, 670626373, 671095963, 671013794, 671002426, 671295242, 671422958, 671596375, 671080017, 670720673, 670325928, 670389252, 670017853, 669863434, 670326996, 670488586, 670884247, 670676575, 670877686, 670496445, 670178604, 670089340, 669249725, 669162140, 669113541, 669694901, 669993057, 670230942, 670614319, 670770111, 670710678, 670212631, 670285950, 669720001, 669595642, 669790955, 669751129, 669795151, 669597397, 669595795, 669433975, 669912949, 669630966, 669332428]
1987.6F69332428l20206q38928K67410m7454k74964l36609N27725N50843J95312J84250
1997.2F69239807n91812o2103m40445l50571n75943k31247L99704j14059L57742M0207
2006.9F67671280K17895m49905m14429p0038l93295Q5449o97097l68271r0332j5259
2016.5F65475998m63944j90811O29959m1198J70211l78112k45362m34570k59781J5869
2026.2F64278259n45578P2937l32794K51007k19498r6282L04336o69784j25809q04596
2035.8F62112198m48227J05514K50397K5559j70441Q5831l50647L78799o02569n77088
2045.5F60809326n2261j30921j4724m11454L36152l07541J08184R2774p1182M0359
2055.1F60398712q12912k6626l46299Q9188Q9416N7145J41678n67780L26920J87759
$$ y = [669332428, 669012222, 668173294, 668440704, 668393250, 668118286, 667781677, 668309402, 668860245, 669055557, 669239807, 668647995, 668585892, 668145447, 667794876, 667218933, 666987686, 667387390, 667273331, 667631073, 667671280, 667889175, 667439270, 667024841, 666954803, 666561508, 666646957, 665949860, 665581589, 665491257, 665475998, 665012054, 664821243, 665451202, 665410004, 665580215, 665202103, 664956741, 664522171, 664262390, 664278259, 663732681, 663805618, 663472824, 663723831, 663504333, 663408051, 663712387, 663042603, 662916794, 662112198, 661663971, 661769485, 662019882, 662045441, 661875000, 661960831, 661610184, 661988983, 661386414, 660809326, 660757065, 660626144, 660611420, 660199966, 660536118, 660228577, 660336761, 660429535, 660358353, 660398712, 659585800, 659559174, 659212875, 659302063, 659391479, 659448624, 659590302, 659022522, 659349442, 659537201]
2064.7F59537201m6845n33905m12902l29209P5836N93415m36173O3400k95867k22092
2074.4F57992859L0517K71073M81567p60116n62744l48359K74048j44729j30463R5520
2084F57199173m71420K69622k32849J297j220p6599m42658o88400J40838k05154J67694
2094.6F55660324n98984n20019K03247J85623j13831p07550K51008k36664j76545k04086
2104.3F53742523k36893O9886n30396N5924j94168M196l63693m03748O9656l4942k9908
2114.9F52148437m52575M12597n07507m00238K05689k98539J41068k61078K52075k24151
2124.5F51015778k06910N4093j00937M3716m80041K67105J11923k0599m79126j95007
2134.2F50009995L92074k28729K05688n7754J37176j06811N1269J32218l16849K6627
$$ y = [659537201, 659490356, 658956451, 658543549, 658214340, 658290176, 658883591, 658447418, 658510818, 658214951, 657992859, 658023376, 658294449, 658776016, 658015900, 657453156, 657104797, 657378845, 657234116, 657103653, 657199173, 656727753, 656997375, 656764526, 656765823, 656764603, 656688004, 656245346, 655556946, 655697784, 655492630, 655660324, 655061340, 654541321, 654744568, 654930191, 654816360, 654108810, 654359818, 654123154, 653946609, 653742523, 653505630, 653575516, 653045120, 653101044, 652906876, 652911072, 652547379, 652143631, 652213287, 652178345, 652148437, 651695862, 652108459, 651600952, 651200714, 651406403, 651107864, 651248932, 650987854, 651239929, 651015778, 650808868, 650862961, 650762024, 650805740, 650325699, 650592804, 650704727, 650684128, 650205002, 650009995, 650402069, 650173340, 650379028, 650321274, 650458450, 650351639, 650402908, 650535126, 650218277, 650244904]
2143.8F50244904k25373M03595k65960l31955J42822J87988L22952l40805K64664k74811
2153.5F50128021l96118k65503k2278M84696j19248N7907k5787M85001j74256k60696
2163.1F49891739K34985n1880O37894j52359k67258l95507p5989N33828Q2627O8588
2172.8F50506668j77841K36511j12915j15585l9902j4343K02408j13678J71203m8752
2182.4F50493774M97132l5095m01230R1018N8060K57797l72162Q7815J69449J64413
2192F51010971j74789Q4381P21283k91291K17820j49765k96402j61667O7367M92707
2201.7F51520615O256N81436l10822j74636R9868o5536K00195k80609k0752l17459
2211.3F51238556M19464P3624J72653O22940l59192J31226m6158J98517j15204q2245
$$ y = [650244904, 650019531, 650423126, 650157166, 649825211, 649968033, 650156021, 650478973, 650138168, 650402832, 650128021, 649731903, 649466400, 649444122, 649928818, 649809570, 649867477, 649841690, 650326691, 650152435, 649891739, 650126724, 650074844, 650712738, 650560379, 650293121, 649897614, 649821625, 650355453, 650438080, 650506668, 650328827, 650565338, 650452423, 650336838, 650296936, 650282593, 650485001, 650371323, 650542526, 650493774, 650990906, 650955811, 650554581, 650645599, 650703659, 650961456, 650589294, 650677109, 650846558, 651010971, 650836182, 650920563, 651641846, 651350555, 651568375, 651418610, 651122208, 650960541, 651027908, 651520615, 651526871, 652108307, 651797485, 651622849, 651722717, 651657181, 651857376, 651576767, 651556015, 651238556, 651658020, 651731644, 651904297, 652527237, 652168045, 652299271, 652253113, 652451630, 652336426, 652254181]
2221F52254181p248m78745K42692R15K36740r7732j05286J22604J45035J72730p36237
2231.6F51749649l90243J5716M66156j755J94245N16052k79999k19498n86166J68457
2241.2F51632614r92o2790L87803P1868n9356n67627J32904j61667J63345J69525l07388
2251.8F51398239J87149m51507p1335k31629j00860K68173N64651K89765l92380L82767
2261.5F51843033k86408k09961j21307O8512N7831n94940Q7051j20087L70331J75629
2271.1F51269684N8060j85013n67322L4561k38495L03116k05688j7929J26953j54190
2280.8F50423737q4458m19159M49066k80914j32522k09961j79902K76642n20782J63879
2290.4F49485626k60010Q2779p6P7286K27966n73196J36719q04520l95813j17722J36185
$$ y = [652254181, 652246933, 651768188, 652010880, 652011795, 652248535, 652150803, 652045517, 652168121, 652313156, 652485886, 651749649, 651359406, 651375122, 651841278, 651839523, 652033768, 652549820, 652269821, 652050323, 651464157, 651632614, 651631622, 651568832, 651956635, 652028503, 651969147, 651401520, 651534424, 651372757, 651536102, 651705627, 651398239, 651585388, 651133881, 651062546, 650830917, 650730057, 650998230, 651562881, 651852646, 651460266, 651843033, 651556625, 651346664, 651225357, 651293869, 651351700, 650756760, 650843811, 650723724, 651094055, 651269684, 651327744, 651142731, 650575409, 650609970, 650371475, 650674591, 650468903, 650450974, 650577927, 650423737, 650339279, 649920120, 650369186, 650088272, 649955750, 649745789, 649565887, 649842529, 649321747, 649485626, 649225616, 649308395, 649308319, 649385605, 649613571, 649040375, 649177094, 648372574, 647976761, 647859039, 647995224]
2301F47995224L11279q16269k11105q9340N98144m00619l59192K62756q45031j07270
2310.7F46338577l10287J3275j18561L39356R2392m13056M48532j116638p14722j69754
2320.3F44389114o4239o9275m61502n58090k41852J105652m26865j24206l33405m58679
2329.9F42756653N49850l60412k74887j048813K77023M5090p28531K518P9116l0975
2339.6F41266632q67309k16828k97546R06601L14331p07474l98331o48002K83546P37457
2349.2F40373077J211853l82156o16531J61972n38941j59301j868363j073151p24220
2357.9F36384239L67775p400m81339O00205r07059O37131m22097M39530K518j129303
2367.6F35484200N39054k83317L967R1972N45502j84402k15416M75235j32180n34667
$$ y = [647995224, 648306503, 647490234, 647279129, 647189789, 647787933, 647387314, 647028122, 647290878, 646445847, 646338577, 646028290, 646041565, 645923004, 646262360, 646354752, 645941696, 646390228, 645273590, 644558868, 644389114, 644324875, 644255600, 643794098, 643236008, 642994156, 644099808, 643672943, 643548737, 643215332, 642756653, 643306503, 642946091, 642671204, 641622391, 641899414, 641944504, 641215973, 641218491, 641297607, 641266632, 640399323, 640182495, 639884949, 640791550, 641105881, 640398407, 640000076, 639352074, 639635620, 640373077, 641584930, 641202774, 640586243, 640748215, 640209274, 640049973, 638181610, 637108459, 636384239, 636752014, 636744614, 636263275, 636863480, 635956421, 636593552, 636171455, 636610985, 636613503, 635484200, 636023254, 635739937, 635743904, 635835876, 636381378, 636196976, 635981560, 636456795, 636324615, 635789948]
2377.2F35789948n85022N17349R8419l77426m06952k09923L11470j90391l63427m49791
2386.8F34134254j81922l48511j82228l0480k82097L0556m50325j95770l05634m72450
2396.5F31715393m20608j99738K28233o29463n67779l73803Q4458o7940l78418k18315
2406.1F29172020p24831k77710o16684k20985R9716k27814j96304o20384k10266k25373
2415.8F25951385O4431l40004n13535m17900o80504j12648q54912n18646j47171M921
2425.4F22435417J44005n10292k25601n77011m70391m33921n32189m15687j68801R957
2435.1F19255486m73061l87650n33943N6076l13987o61736k64740o61163k88887o09818
2444.7F15116577k74963k75917n04494k83089m21104q4000p35588m00047l45459o13213
$$ y = [635789948, 635204926, 635722275, 635820694, 635443268, 635036316, 634826393, 635137863, 634947472, 634584045, 634134254, 633952332, 633603821, 633421593, 633391113, 633109016, 633139572, 632689247, 632493477, 632187843, 631715393, 631294785, 631095047, 631323280, 630693817, 630126038, 629752235, 629836693, 629768753, 629390335, 629172020, 628447189, 628169479, 627552795, 627331810, 627431526, 627203712, 627007408, 626387024, 626176758, 625951385, 626015816, 625675812, 625162277, 624744377, 624063873, 623951225, 623096313, 622577667, 622430496, 622435417, 622579422, 622069130, 621843529, 621266518, 620796127, 620362206, 619830017, 619414330, 619245529, 619255486, 618782425, 618394775, 617860832, 617916908, 617602921, 616941185, 616676445, 616015282, 615726395, 615116577, 614841614, 614565697, 614061203, 613778114, 613357010, 613273010, 612537422, 612137375, 611791916, 611178703]
2454.3F11178703k20527k13280m5013m42925l78685p08237o05659k60506m57840m42161
2464F07403870m99077j64986n27344m44488m40636k00157j1444p22923o35262q51326
2473.6F02906227n57899m24462l48282m32930q42094m57802l16582j792n50156o45180
2483.3E98329048m49104m73442k84767n35546m07295q61626l02200m62456r62448j76086
2492.9E93414078k98577l47595q07266o70166n70641o30912j61934l36685p19452p03431
2502.6E88167419J34736m40712q15545n37605o00242m19007o55861l72696n92270n07469
2512.2E83360748n27687l94516j59378n69916n3787l89023n49125q03528p11365l21731
2521.9E78880692o44532k46124n45578m06036n50309m73442k14615o10046m29001q49571
$$ y = [611178703, 610958176, 610744896, 610699883, 610256958, 609878273, 609170036, 608564377, 608303871, 607846031, 607403870, 606904793, 606739807, 606212463, 605767975, 605327339, 605127182, 605115738, 604392815, 603757553, 602906227, 602348328, 601923866, 601575584, 601142654, 600300560, 599842758, 599526176, 599524384, 598974228, 598329048, 597879944, 597406502, 597121735, 596586189, 596178894, 595317268, 595015068, 594552612, 593590164, 593414078, 593115501, 592767906, 591960640, 591290474, 590719833, 590088921, 589926987, 589590302, 588870850, 588167419, 588302155, 587861443, 587045898, 586508293, 585908051, 585489044, 584833183, 584460487, 583868217, 583360748, 582833061, 582438545, 582279167, 581709251, 581655464, 581266441, 580717316, 579913788, 579202423, 578880692, 578236160, 577990036, 577444458, 577038422, 576488113, 576014671, 575800056, 575190010, 574761009, 573911438]
2531.5E73911438n09186o27403o58302j82152j33209O637o85730o12640l73879p9498
2541.1E70056076m32968r84955n86510m31900k55432n22537j80283k35481m86374o12831
2550.8E65326805o49834l46870r97620l58390k21749o06766n60493m16908l1281o24733
2560.4E60512161j50718n21279p79762P706k84615n64766p89413m89579l34434k08092
2570.1E56397209n90820n64728k33726o09436l71247p34863m12636j86157m52232l79830
2579.7E51861534l75976k54212o99730l19977o25228o63796j24016n28641m26635n84450
2589.4E47258873n23453m07791l37486n41001m37393k65388o15387m46091q77571l58353
2599E42448959j80015n74036k89345m97970m99764q82759p04117o30607m41666j33972
$$ y = [573911438, 573402252, 572774849, 572116547, 571934395, 571801186, 571807823, 571122093, 570509453, 570135574, 570056076, 569623108, 568638153, 568051643, 567619743, 567364311, 566841774, 566661491, 566426010, 565939636, 565326805, 564676971, 564330101, 563332481, 562974091, 562752342, 562145576, 561585083, 561168175, 561136894, 560512161, 560361443, 559840164, 559060402, 559068108, 558783493, 558218727, 557429314, 556939735, 556605301, 556397209, 555806389, 555241661, 555007935, 554398499, 554027252, 553292389, 552879753, 552693596, 552241364, 551861534, 551485558, 551231346, 550531616, 550211639, 549586411, 548922615, 548798599, 548269958, 547843323, 547258873, 546735420, 546327629, 545990143, 545449142, 545011749, 544746361, 544130974, 543684883, 542807312, 542448959, 542268944, 541694908, 541405563, 540907593, 540407829, 539525070, 538820953, 538190346, 537748680, 537614708]
2608.6E37614708o69098q25386n48019L11966l51029j051979o39420m70390m31366
2617.3E32939987p22732m32091n91431n70106n17731m91219l81927q93669p19834o82754
2627E26936493m81567n71518n53284n34058o75049j25885o50596p34139n76362n41878
2636.6E21492157n08423q14972p44972p16591l09410n74646m69627j57204k39182n12695
2646.3E16444435j010284m02642m57954n61790o37780o31675m79546o75316j44081
2654.9E11443367l78799l81432n63965n49583j73722p57064p49588o61087l24097n31578
2664.6E06372452n50194j80740l64228j91230k39144R308k72903o74248q64601o57463
2674.2E02387009j65139l95584j92260n47333l82462j29432p19643o51779m40140l14636
$$ y = [537614708, 536945610, 536120224, 535572205, 535884171, 535533142, 534481163, 533841743, 533371353, 532939987, 532217255, 531785164, 531193733, 530623627, 530105896, 529614677, 529232750, 528339081, 527619247, 526936493, 526454926, 525883408, 525330124, 524796066, 524121017, 523995132, 523344536, 522610397, 522034035, 521492157, 520983734, 520168762, 519423790, 518707199, 518397789, 517823143, 517353516, 517196312, 516957130, 516444435, 515434151, 515031509, 514573555, 514011765, 513373985, 512742310, 512262764, 511587448, 511443367, 511064568, 510683136, 510119171, 509569588, 509395866, 508638802, 507889214, 507228127, 506904030, 506372452, 505822258, 505641518, 505277290, 505086060, 504846916, 504856224, 504583321, 503909073, 503044472, 502387009, 502221870, 501826286, 501634026, 501086693, 500704231, 500574799, 499855156, 499203377, 498763237, 498448601]
2683.9D98448601n39055l08418m67987p02630m09774m59519k55432k71034j99890l54615
2693.5D94480247l41911k89345o29844o20880n19028j54076k76260m69284m32282k83889
2703.1D90463448j90964k37885l95317p22847k94876o19087o32401j96952m32854j88713
2712.8D86551552l77350m79775n61141k38152J42479k51999m37469n18189l30734j63117
2722.4D83336105O7635k30522k74315k33612p78160n15976m63410l68843k36244q4343
2732.1D80218315j99928l52287J6555l99475m31137m05960k36740L6430k556k54058
2741.7D77989159p68738j71013j62354j96723j1521j83983j3008j69716k02408o45179
2751.4D75464516m62494k75994n95321l50037j42631k2354l27302j55906k40364m63066
$$ y = [498448601, 497909546, 497601128, 497133141, 496430511, 496020737, 495561218, 495305786, 495034752, 494834862, 494480247, 494138336, 493848991, 493219147, 492598267, 492079239, 491925163, 491648903, 491179619, 490747337, 490463448, 490272484, 490034599, 489639282, 488916435, 488621559, 488002472, 487370071, 487173119, 486740265, 486551552, 486174202, 485694427, 485133286, 484895134, 485037613, 484785614, 484348145, 483829956, 483499222, 483336105, 483403740, 483173218, 482898903, 482665291, 481887131, 481371155, 480907745, 480538902, 480302658, 480218315, 480018387, 479666100, 479682655, 479283180, 478852043, 478446083, 478209343, 478245773, 478243217, 477989159, 477220421, 477049408, 476887054, 476690331, 476678810, 476494827, 476481819, 476312103, 476109695, 475464516, 475002022, 474726028, 474130707, 473780670, 473638039, 473615685, 473288383, 473132477, 472892113, 472429047]
2761D72429047m76456p01447l23143N8709K17857m47159o48918k81143j44043j99585
2770.7D69483719o05240m03175n01213l67814m44946n88112l69301o12564m84123p61337
2780.3D64345894n46684k66190l89938l33634l66287l22800n61638j36375k25601o25343
2789.9D60571404p43561p60613m81682o74438n91393p08313n36766q67500r49669l50113
2799.6D53907356q68225n21698m08668o62537p27081q89168q00057q51364n09834p03964
2809.2D46964760o03447p95288j028824m69780o14243p06558r39178j073456r28726
2817.9D39805260m80690n31845j208725j196823r62563m27818o71387j108933r37957
2826.6D32278519p10984p95097j272316j024361q73870q36487r73053j102982j213074
$$ y = [472429047, 471952591, 471251144, 470928001, 470986710, 471204567, 470757408, 470108490, 469827347, 469683304, 469483719, 468878479, 468475304, 467974091, 467606277, 467161331, 466573219, 466203918, 465591354, 465107231, 464345894, 463799210, 463533020, 463143082, 462809448, 462443161, 462120361, 461558723, 461422348, 461196747, 460571404, 459827843, 459067230, 458585548, 457911110, 457319717, 456611404, 456074638, 455207138, 454257469, 453907356, 453039131, 452517433, 452108765, 451446228, 450719147, 449829979, 449029922, 448178558, 447668724, 446964760, 446361313, 445566025, 444537201, 444067421, 443453178, 442746620, 441807442, 440733986, 439805260, 439324570, 438792725, 437584000, 436387177, 435424614, 434996796, 434325409, 433216476, 432278519, 431567535, 430772438, 429500122, 428475761, 427601891, 426765404, 425792351, 424689369, 423476295]
2835.3D23476295j490554j273804j439896j199379j298256j858749j763687j721993
2843D11429977j802406j787186j757774k454071k632866k384872j946717j508369j572723
2851.7C93582993j181832j531181q76618j0986n64308l54576K29873L17421n55915
2860.3C89054871p11403l83988l44619o4087o15425j249276r80682n38368r44939r80377
2870C82241707q70361q93555p60575j164855r60770o75011l81012n56564p22313m22249
2879.6C74834442p93877q92410j212730r92584p71561j115036j026039r11446n06096
2888.3C66612663q40759j167946j130142j216965j157265q47625o63033j069565q07800
2897C57711563r96170p13768l19519j282082j093330o90803o85082n79681n03731p62940
$$ y = [423476295, 421985741, 420711937, 419272041, 418072662, 416774406, 414915657, 413151970, 411429977, 409627571, 407840385, 406082611, 403628540, 400995674, 398610802, 396664085, 395155716, 393582993, 392401161, 390869980, 389993362, 389982376, 389418068, 389063492, 389293365, 389610786, 389054871, 388343468, 387959480, 387614861, 387550774, 386935349, 385686073, 384705391, 384167023, 383222084, 382241707, 381371346, 380477791, 379717216, 378552361, 377591591, 376916580, 376535568, 375979004, 375256691, 374834442, 374040565, 373148155, 371935425, 370942841, 370171280, 369056244, 368030205, 367118759, 366612663, 365771904, 364603958, 363473816, 362256851, 361099586, 360251961, 359588928, 358519363, 357711563, 356715393, 356001625, 355682106, 354400024, 353306694, 352615891, 351930809, 351351128, 350847397, 350084457]
2906.6C50084457r31320o39000j119117j452218j438980j214256j208992j411133j316032
2915.3C39353409j456032j437645j387634j167832j365394j298027p86057n53970k22016
2924C29678802l61938K60811M77142j91307n22728p05108l42103m8713N95512P66182
2933.6C29606552L68424M51393N82542O36063M00161M90647Q19168Q54568N34096M16298
2943.3C35159912O11839O68793P01790P80296Q37021O35414R36852Q71506L83224L01704
2952.9C41888351Q0986K72217M33541N38253N59121P73849Q26531L82194L03459K58675
2962.6C46317177N67283N03235Q52814J252289O85272O48460O85425N55802L64227
2971.2C52431984R23805J089287O57463N28183P7591M97322O96678N43366J54457K57759
$$ y = [350084457, 349153137, 348514137, 347395020, 345942802, 344503822, 343289566, 342080574, 340669441, 339353409, 337897377, 336459732, 335072098, 333904266, 332538872, 331240845, 330454788, 329900818, 329678802, 329316864, 329577675, 330054817, 329863510, 329340782, 328635674, 328293571, 328244858, 328840370, 329606552, 329974976, 330426369, 331008911, 331644974, 332045135, 332535782, 333354950, 334209518, 334743614, 335159912, 335771751, 336440544, 337142334, 337922630, 338759651, 339395065, 340331917, 341203423, 341586647, 341888351, 341969337, 342241554, 342675095, 343213348, 343772469, 344546318, 345372849, 345755043, 346058502, 346317177, 346884460, 347387695, 348240509, 349492798, 350178070, 350826530, 351511955, 352067757, 352431984, 353355789, 354445076, 355102539, 355630722, 355708313, 356205635, 356902313, 357445679, 357600136, 357857895]
2980.9C57857895O88705j1863K23312K85110J53885O2561j86996J79520L05748N82313
2990.5C60140190o3515l41568k1553k34603n6153O714j46713n77851l96270k93351
3000.2C58015327n50270m79622n87730p17316q26072m96636m89731m13742l63121p19337
3009.8C52371750p11441n02587j43432o69823q86955o39420q30993q71392q62579n03426
3019.5C45749702n23529r01260q93517l31916m06266q48617p14417r08165q03947o51741
3029.1C38766327n50308q39348r93157p03735q74977o32210j054916j150360o92177
3037.8C31275139n39436l89710r27582j079254j168785j026001o51894o12640q90694
3046.5C23989143j237411r22966o94084m45023q75645j152801q23841p52678n30663
$$ y = [357857895, 358546600, 358534737, 358758049, 359043159, 359197044, 359259605, 359072609, 359252129, 359557877, 360140190, 360076675, 359735107, 359713554, 359478951, 359422798, 359429512, 359282799, 358704948, 358308678, 358015327, 357465057, 356985435, 356397705, 355680389, 354854317, 354357681, 353867950, 353454208, 353091087, 352371750, 351660309, 351157722, 351014290, 350344467, 349457512, 348818092, 347987099, 347115707, 346253128, 345749702, 345226173, 344324913, 343431396, 343099480, 342693214, 341844597, 341130180, 340222015, 339418068, 338766327, 338216019, 337376671, 336383514, 335679779, 334804802, 334172592, 333117676, 331967316, 331275139, 330735703, 330345993, 329418411, 328339157, 327170372, 326144371, 325492477, 324879837, 323989143, 322751732, 321828766, 321134682, 320689659, 319814014, 318661213, 317837372, 317084694, 316554031]
3055.1C16554031r85717r82323o12297n69821p35378j020145q82969p27997n49927
3063.8C09487457q96072q29945p12337o26412l80020r43947r07764o74896m33426p37419
3073.5C02345219q79193l90815p57847l20130k22664j014671j138477q35228p59792
3082.1B96026402p16954m79069q54969p69043p93685r33590o17962m62837k06547o89602
3091.8B89502144r70822q41636p25460m88320m10823m43631o27517o25916j019974
3100.5B83348045r93061p40585q08201o07719n71270o32038r49269o18648m39492p50236
3110.1B76237526p18174q70514q73775q07171l52974o00147j017304o28319p16400
3118.8B69652748o48250n21927m14582o91909j041260q67977p78828p70969r12934
$$ y = [316554031, 315568314, 314585991, 313973694, 313403873, 312668495, 311648350, 310765381, 310037384, 309487457, 308591385, 307761440, 307049103, 306422691, 306042671, 305098724, 304190960, 303516064, 303082638, 302345219, 301466026, 301075211, 300317364, 299997234, 299774570, 298759899, 297621422, 296786194, 296026402, 295309448, 294830379, 293975410, 293206367, 292412682, 291479092, 290861130, 290398293, 290191746, 289502144, 288531322, 287689686, 286964226, 286475906, 286065083, 285621452, 284993935, 284368019, 283348045, 282354984, 281614399, 280806198, 280198479, 279627209, 278995171, 278045902, 277427254, 276987762, 276237526, 275519352, 274648838, 273775063, 272967892, 272614918, 272014771, 270997467, 270369148, 269652748, 269004498, 268482571, 268067989, 267376080, 266334820, 265466843, 264688015, 263917046, 263004112]
3127.5B63004112l82118l68729r72461q88653q93803p85808o98185q08049q09383o90098
3137.1B55706825o73694p74403o56013p63798r87454o40411l6068l18871r33647r57336
3146.8B48965130r12857o66695n75180q84819n22957l75881r82532r04522o19297m47464
3156.4B42072926n94330r10912o36444n85880n74761q59050j042729p36675m05884
3165.1B35726261k90089r58614q12759o92101q53519p47891r41963m13322o25439o58836
3174.7B28731728m78383q19168m51736o62403n61295o13384j033363o87886p35759
3183.4B22688351p14417m29458m13609n00717o08139r05171r50603n91087o18134p89852
3193B16167164n85232m16489m53758o04229p42245m12597p74613q02669k04296p97062
$$ y = [263004112, 262621994, 262253265, 261280804, 260392151, 259498348, 258712540, 258014355, 257206306, 256396923, 255706825, 255033131, 254258728, 253602715, 252838917, 251851463, 251211052, 251174984, 250856113, 249922466, 248965130, 248052273, 247385578, 246810398, 245925579, 245402622, 245026741, 244044209, 243139687, 242520390, 242072926, 241478596, 240567684, 239931240, 239345360, 238770599, 237911549, 236868820, 236132145, 235726261, 235436172, 234477558, 233664799, 232972698, 232119179, 231371288, 230429325, 230016003, 229390564, 228731728, 228253345, 227434177, 226982441, 226320038, 225758743, 225145359, 224111996, 223424110, 222688351, 221973934, 221544476, 221130867, 220630150, 220022011, 219116840, 218166237, 217575150, 216957016, 216167164, 215581932, 215165443, 214711685, 214107456, 213365211, 212952614, 212178001, 211375332, 211171036, 210373974]
3202.7B10373974o05107k83412l39241l60737r74274r67007p61070k88448l97911k15206
3212.3B05181561L34205o06193q45490n56927n21984l96824l84693p64427r59225n48458
3222A99931545q35418m22230n4112m80976o15654p92618j23424K5844n25379m78859
3231.6A95628719m64172n38216n57460m62761l68786n30262p63569n75314l04794k37617
3241.3A90825768n59750q02212l55263j2703o0501l68786l65905n22156o10161k06013
3250.9A86962318l66745k26287l04280o91280n28240o69060m96063M2228j42955n75219
3260.5A83004417n07755n11627k42119J0319l78113n49869l12291m0054l37009m96445
3270.2A79639454n09834m07887j84288l74794j64852m48628n84220m0284l223m13361
$$ y = [210373974, 209768867, 209485455, 209146214, 208785477, 207811203, 206844196, 206083126, 205794678, 205396767, 205181561, 205515766, 204909573, 204064083, 203507156, 202985172, 202588348, 202203655, 201439228, 200480003, 199931545, 199096127, 198673897, 198619785, 198138809, 197523155, 196730537, 196607113, 196632957, 196107578, 195628719, 195164547, 194626331, 194068871, 193606110, 193237324, 192707062, 191943493, 191368179, 191063385, 190825768, 190266018, 189463806, 189108543, 189095840, 189035339, 188666553, 188300648, 187778492, 187168331, 186962318, 186595573, 186369286, 186065006, 185373726, 184845486, 184176426, 183680363, 183722591, 183579636, 183004417, 182496662, 181985035, 181742916, 181753235, 181375122, 180825253, 180512962, 180472908, 180135899, 179639454, 179129620, 178721733, 178537445, 178162651, 177997799, 177549171, 176964951, 176924667, 176921444, 176508083]
3279.8A76508083m42333Q2932k98920k67925o4965m37603m37126m82864q6918j54648
3289.5A73917713m12330j23578J16730m7340p4063j69639p64542K7695M6101n43728
3299.1A71973019l44601o82507j41429M2057k84787m85191n85804m36840l21999K38304
3308.8A68970222r0389m71496k48070M4670n00832j026134J50432K60373m47293n25684
3318.4A66115799j65501o4239l36933m18072n17941K65637j56727q29220k54822n64994
3328.1A63072987q46806p57313j54686K01416R9411k04849r40933j016331p81097k49749
3337.7A58422050o4554j69506m36363n56831J01661q4295l39003l21226m37689j58281
3347.3A55955963J9407l82318p74546k8324L57351j19981k67706J73006L84340k77700
$$ y = [176508083, 176065750, 176148682, 175849762, 175581837, 175516872, 175079269, 174642143, 174159279, 174072361, 173917713, 173505383, 173381805, 173498535, 173451195, 173377132, 173207493, 172442951, 172470646, 172516747, 171973019, 171628418, 170945911, 170804482, 170846539, 170561752, 170076561, 169490757, 169053917, 168731918, 168970222, 168879833, 168408337, 168160267, 168204937, 167704105, 166677971, 166828403, 167088776, 166641483, 166115799, 165950298, 165886059, 165549126, 165131054, 164613113, 164878750, 164722023, 163892803, 163637981, 163072987, 162226181, 161468868, 161314182, 161515598, 161615009, 161410160, 160469227, 159452896, 158671799, 158422050, 158357496, 158187990, 157751627, 157194796, 157296457, 157212162, 156873159, 156551933, 156114244, 155955963, 155975370, 155593052, 154818506, 154790182, 155147533, 155027552, 154759846, 154932852, 155317192, 155039492]
3357A55039492n15747m10958j09081K89783j1348l23210j5163R8953l94592l74585
3366.6A53273544l2110k2554k78206l62683k12593j05056L44419L71437Q6823j34812
3376.3A52928209k50444J7519J50843L01628l9559n55887m61016J5211M34294J22347
3385.9A52663145j09034Q5545K21539J40094K00711L38850l32880o00968J8082j0815
3395.6A52614269j27811L53489L68566j32255j60342J58053K02112k9507k05621k18764
3405.2A52822189r374K42243K83985K5768N9690M18349Q9922n3521K7047j77450K23302
3415.8A53952150L70446K63595N60131M56648J05257Q0271K37780L37324M30488M82207
3425.5A57276297L65362M91438L81870j17550n3940j55163J31274N56783K57292L92189
$$ y = [155039492, 154523745, 154112787, 154003706, 154293489, 154282141, 153958931, 153943768, 154042721, 153648129, 153273544, 153241434, 153218880, 152940674, 152577991, 152365398, 152260342, 152604761, 152976198, 153063021, 152928209, 152677765, 152695284, 152846127, 153147755, 153108196, 152552309, 152091293, 152106504, 152540798, 152663145, 152554111, 152639656, 152861195, 153001289, 153202000, 153540850, 153207970, 152607002, 152625084, 152614269, 152486458, 152839947, 153208513, 153076258, 152915916, 153073969, 153276081, 153246574, 153040953, 152822189, 152812815, 153055058, 153339043, 153364811, 153424501, 153842850, 153932772, 153879251, 153906298, 153728848, 153952150, 154322596, 154586191, 155146322, 155602970, 155708227, 155788498, 156026278, 156363602, 156794090, 157276297, 157641659, 158133097, 158514967, 158397417, 158343477, 158188314, 158319588, 158876371, 159133663, 159525852]
3435.1A59525852J17989J92852L54595J29356N16587J51901L55530O32782J73244J93501
3444.7A62344189P83672J236305j65462J00078P40795J57948O73313K89536k23904
3453.4A65936470L31230J172714Q99640L66783J030864O78845O6013J88408O99768
3462.1A71370735M89159L41663R26056J42670Q182N56469P43637R26247M26254R1591
3471.7A76022663N23014J417961P76749J95751R52931P08770M97151N79929P83520
3480.4A82458439R84497O74496O03752O03103M71325L41854P47643J173401N52349
3489.1A88610859K87743N00030M82445Q62045Q01659O55308Q83884P20310R26609J100731
3498.7A95831623P16457K89479J232853J454734l61843J41144R83505J018258J214046
$$ y = [159525852, 159643841, 159836693, 160191288, 160320644, 160837231, 160989132, 161344662, 161977444, 162150688, 162344189, 163127861, 164364166, 164198704, 164298782, 165039577, 165197525, 165870838, 166160374, 165936470, 166267700, 167440414, 168340054, 168706837, 169737701, 170416546, 170482559, 170670967, 171370735, 171859894, 172201557, 173127613, 173270283, 173278465, 173834934, 174578571, 175504818, 175931072, 176022663, 176545677, 177963638, 178740387, 178936138, 179889069, 180597839, 181094990, 181674919, 182458439, 183442936, 184117432, 184721184, 185324287, 185795612, 186137466, 186885109, 188058510, 188610859, 188898602, 189398632, 189881077, 190743122, 191544781, 192200089, 193083973, 193804283, 194730892, 195831623, 196548080, 196837559, 198070412, 199525146, 199163303, 199304447, 200287952, 201306210, 202520256]
3507.4B02520256J325989J184120M44241P02018M52996Q25462J298847O18725P30419
3516.1B10103073P14665J159973J250057O05965M95185R50318J348839R41410J148033
3524.8B18717518R38473J112442J550998Q07114L98388Q26263J059418P66945J402969
3533.5B27580528J620045J738605J189728J61972R37786J024189J311684R65061R64623
3542.1B37494221J534672J723537K053966R98402J143818N10426J287899J824131J562824
3550.8B50133896K419662J07289O28223J414433J835079K446689J037674J773110J356907
3559.5B63152962J080875R63802J906453K186451R13791L205242J387310Q27923Q06771
3568.2B76431580L76529L736992J989098J284885J726189J974068J590213J745949
$$ y = [202520256, 203846245, 205030365, 205474606, 206176624, 206629620, 207455082, 208753929, 209372654, 210103073, 210817738, 211977711, 213227768, 213833733, 214328918, 215279236, 216628075, 217569485, 218717518, 219655991, 220768433, 222319431, 223126545, 223524933, 224351196, 225410614, 226177559, 227580528, 229200573, 230939178, 232128906, 232290878, 233228664, 234252853, 235564537, 236529598, 237494221, 239028893, 240752430, 242806396, 243804798, 244948616, 245459042, 246746941, 248571072, 250133896, 252553558, 252660847, 253289070, 254703503, 256538582, 258985271, 260022945, 261796055, 263152962, 264233837, 265197639, 267104092, 269290543, 270204334, 273409576, 274796886, 275624809, 276431580, 276808109, 280545101, 282534199, 283819084, 285545273, 287519341, 289109554, 290855503]
3575.9B90855503K661266J000138K458572K010689Q35781J978836J941109K055340
3583.6C05797234J372013L472614K414932k68020J951599P00283K776718K984028L254890
3592.3C24456291K133980P73735L430405O76193K288246M074516J257630K507705K025757
3601C43624458J688576K896195K475166K071495K542038K672081N87234L835144J233750
3609.6C63626137J8158P151031L021622p13234L718376K75383M283104M958801J107941
3618.3C87447319K645569J029930J515694L434105L661384K955322K762261K774391
3626D08225975L223343P212715L756409p624321L224907N181465N600891L054199K32239
3634.7D32087822K896385L725281L700561K521706K178383L003502L084450K581787
$$ y = [290855503, 293516769, 294516907, 296975479, 298986168, 299821949, 301800785, 303741894, 305797234, 307169247, 310641861, 313056793, 312788773, 314740372, 315440655, 318217373, 321201401, 324456291, 326590271, 327364006, 330794411, 331470604, 333758850, 337833366, 339090996, 341598701, 343624458, 345313034, 348209229, 350684395, 352755890, 355297928, 357970009, 358557243, 362392387, 363626137, 363644295, 370795326, 373816948, 373103714, 376822090, 377097473, 381380577, 386339378, 387447319, 390092888, 391122818, 392638512, 396072617, 399734001, 402689323, 405451584, 408225975, 411449318, 418662033, 422418442, 414794121, 418019028, 423200493, 428801384, 431855583, 432087822, 434984207, 438709488, 442410049, 444931755, 447110138, 450113640, 453198090, 455779877]
3642.4D55779877K354202L003502M598884P406693R30786k896309O084595K131233
3650.1D79393463m18129j52321N108147N149040M570465O397553n892029J419449O413002
3658.8E01988640K488174K410660J421127L122330K472038K054177J985435R77135
3666.5E18919716N595245L559838n50042J582680n250778K187958Q302269J0222625
3674.3E44569511L224183j8350487J515693Q671036N392990j913871J38511K910691
3682E46158257K081337J811637R26476J017647M829216P990379p965317n315323J0237732
3690.6E61772041l599205k885818N048904J606751J673622m9477L5210K195930O72989
3699.3E66470947L287964M509163n044403l696709M803849K168159j15013O36940L490715
$$ y = [455779877, 458134079, 461137581, 465736465, 473143158, 474073944, 471177635, 477262230, 479393463, 478975334, 478823013, 483931160, 489080200, 493650665, 500048218, 494156189, 495575638, 501988640, 504476814, 506887474, 508308601, 511430931, 513902969, 515957146, 517942581, 518919716, 524514961, 528074799, 527524757, 529107437, 523856659, 526044617, 534346886, 544569511, 547793694, 529443207, 530958900, 539629936, 545022926, 543109055, 543247566, 546158257, 548239594, 550051231, 550977707, 551995354, 556824570, 564814949, 556849632, 551534309, 561772041, 558172836, 555287018, 560335922, 561942673, 563616295, 563566818, 563602028, 565797958, 566470947, 569758911, 574268074, 569223671, 565526962, 570330811, 572498970, 572383957, 573020897, 576511612]
3708E76511612N788116p118759K466622N567360j4435730L625297N134316O98471Q82492
3716.7E79119797K614898K190438l698654N80253O288872k680473n311203M667511
3724.4E83771439J958046J37138k404404r67369L858757J103935N046502k307778q228683
3733.1E81967583R977035L005867r393501k37351K132607N95589J939964L213005l697891
3741.8E89502907K894478J4500694m750595k2520676Q134232N875282P287788k037849
3749.5E98886261j3029442J1208115l070374q492012N875626N226440M388581o017304
3757.2E94975891K96745O021004o701469k118225M731216J686592J22757M305267k001800
3765.9F01317978n257835L390922N132103J25542j0112381J843681M005356N1498P28989
$$ y = [576511612, 582299728, 575180969, 577647591, 583214951, 568779221, 572404518, 577538834, 578237305, 579119797, 581734695, 583925133, 580226479, 580806732, 587095604, 584415131, 579103928, 583771439, 585729485, 585866623, 583462219, 582494850, 586353607, 587457542, 592504044, 590196266, 581967583, 591944618, 594950485, 585556984, 585319633, 587452240, 588047829, 589987793, 593200798, 589502907, 592397385, 606898079, 602147484, 579626808, 587761040, 593636322, 600924110, 598886261, 585856819, 597064934, 593994560, 585502548, 591378174, 596604614, 600993195, 594975891, 595272636, 601293640, 594592171, 592473946, 597205162, 598891754, 599014511, 603319778, 601317978, 596060143, 599451065, 604583168, 604708710, 594596329, 596440010, 600445366, 600496864, 601225853]
3774.5F01225853k55623J178131O04706K929497M54483q678169K126960K700882R15604
3783.2F03202324K474632k360191j481362Q57430Q91228J213569K10305k08779o86912
3791.9F04112244K33383j8234J437034L849831m040299m768791J997299M251290Q397712
3800.6F15451469l109626j3296929J996956K359161M840546O680107q852310n846443
3808.3F00222931N080948K750664j29204l23792j40419R03664N188255l43513j5016938
3817E98192596M366074O537628N270920L990364j8509712n3406N860863K144890K592849
3825.7F10393066K08664l860206Q7318K092781L374214K541733q933334J240921Q063850
3834.3F15209007n588188p91054R288216q029861p100029P486305m010964j596527
$$ y = [601225853, 600970230, 602148361, 602753067, 605682564, 606137047, 597458878, 599585838, 602286720, 603202324, 605676956, 603316765, 601835403, 602692833, 603584061, 604797630, 605007935, 604799156, 604112244, 604345627, 604327393, 605764427, 609614258, 605573959, 600805168, 602802467, 607053757, 615451469, 612341843, 599044914, 601041870, 603401031, 608241577, 614921684, 606069374, 600222931, 605303879, 608054543, 607925339, 607601547, 607461128, 608364792, 613553047, 613209534, 598192596, 602558670, 609096298, 614367218, 618357582, 599847870, 599794464, 605655327, 607800217, 610393066, 610601730, 606741524, 606828842, 608921623, 612295837, 614837570, 605904236, 607145157, 615209007, 609620819, 608829765, 618117981, 610088120, 602988091, 610474396, 606463432, 604866905]
3842.1F04866905P361756j442376m739914K543793J327629l15895J879769q8158K104111
3850.7F13497620N901146n794793J663018j2979508k463989J0299225j66931k404404
3858.4F07551384J816254K698249L542519n517998n19943P334366n413818o757584
3866.2F04733429L568726N245628O851578q039666j1830787M874611P699279M527817
3873.9F17630615j0769157j183739L925438j86996K235031N463142l507767r257049
3881.6F04349518M605484J804085J498146N978660j3061905k25792M496079J284752
3889.3F10729027N150642J0262q170738m26484K182122j222916J176453P21931K493820
3898F12644119L851700j0315971M141617L559036o643906M683800j215935j805916
$$ y = [604866905, 612228661, 610786285, 606046371, 608590164, 609917793, 609601898, 611481667, 611393509, 613497620, 619398766, 613603973, 615266991, 602287483, 599823494, 610122719, 609955788, 607551384, 609367638, 612065887, 615608406, 610090408, 609570465, 616904831, 611491013, 604733429, 608302155, 613547783, 620399361, 612359695, 600528908, 605403519, 613102798, 617630615, 606861458, 605677719, 609603157, 609416161, 611651192, 617114334, 613606567, 604349518, 608955002, 610759087, 612257233, 618235893, 605173988, 604948196, 609444275, 610729027, 615879669, 615889931, 607719193, 607292709, 609474831, 608251915, 609428368, 610150299, 612644119, 616495819, 606179848, 610321465, 613880501, 607236595, 611920395, 610704460, 608898544]
3905.7F08898544o05850l5057K020912k47993N86433k42157M6005L27759q16917J128845
3915.3F11060524K472076l426246m917298M430848J709899l561019J754722J844216
3923.1F11367722J125412k272912k752227J970215J221084P99866q69904n65567J730271
3931.7F11753960k777024j273498K429619K89383m08059J02501k72674l76854j14823
3940.4F09352531K000008J872711m464416j706009J748047O46553J595115j286773
3948.1F09757767l39051J02272j970291J772347L28255p90978L26347L0327J34773
3956.8F09351768k86788M97016n14602K4681K44827j283874J87034M54293m3946J55335
3966.5F08785744L02162j35117p50465m61884Q69904N26199o48651p0495m48571J27907
$$ y = [608898544, 608292694, 608257637, 610278549, 610030556, 610616989, 610374832, 610420837, 610748596, 609931679, 611060524, 613532600, 610106354, 605189056, 609619904, 611329803, 607768784, 609523506, 611367722, 612493134, 610220222, 607467995, 609438210, 610659294, 611459160, 610589256, 610023689, 611753960, 608976936, 607703438, 610133057, 610422440, 610014381, 610116882, 609844208, 609467354, 609352531, 611352539, 613225250, 608760834, 607054825, 608802872, 609449425, 611044540, 609757767, 609418716, 609520988, 607550697, 609323044, 609651299, 608860321, 609186668, 609216995, 609351768, 609064980, 609561996, 609047394, 609072075, 609316902, 608033028, 608220062, 608674355, 608630409, 608785744, 609087906, 608952789, 608202324, 607740440, 608610344, 609136543, 608487892, 608417397, 607968826, 608096733]
3976.1F08096733L36533J71585l1204m62380P25861J09062N09529L62740m52271L76129
3985.7F09742317j33934l97949q11157J75895K98310o37360K7008l2043L70636K66952
3995.4F08868675K00119J76468l46260m47731l7079
4000.2F08414192
$$ y = [608096733, 608433266, 608604851, 608573647, 608111267, 608837128, 608946190, 609455719, 609818459, 609366188, 609742317, 609608383, 609210434, 608399277, 608575172, 608873482, 608236122, 608263130, 608231087, 608601723, 608868675, 609068794, 609245262, 608899002, 608451271, 608414192]
##END=$$ End of the data block
