##TITLE=$$ Begin of the data block
##JCAMP-DX=5.00 $$ ACD/SpecManager v 10.08
##SPECTROMETER/DATA SYSTEM=Varian
##DATE=15 Jan 2013 10:20:40
##DATA TYPE=INFRARED SPECTRUM
##DATA CLASS=XYDATA
##ORIGIN=
##OWNER=
##NPOINTS=3735
##FIRSTX=399.26403809
##LASTX=4000.35498047
##MAXX=4000.35498047
##MINX=399.26403809
##MAXY=67.38371277
##MINY=15.29274178
##XFACTOR=1.0000000000
##YFACTOR=0.000000100000000
##FIRSTY=34.79318237
##DELTAX=0.96440572
##XUNITS=1/CM
##YUNITS=TRANSMITTANCE
##XYDATA=(X++(Y..Y))
399.3C47931824P69920J0803642L978615j0056724n033379M042206J0181351l387375
407C59230080p935830j452980j579818K262420p37495L234634M632111J152763p26356
415.7C58079529n350571K430534O696969j7980767k082061O514434l44276l086166
423.4C44877625j806870J600800O709289K893677l41683m736404k718773k074394k769699
432.1C41633568M079246L800202L10287o428642l893547M883690K242355q71506l188247
440.7C42567406m44184M081688J861496P60842M13208o76041L70941k588997m701729
449.4C41644630M922867N459595n483055q964386Q6250M132004K05383j005935j674195
458.1C39323158L004227N60570K91557L523750m805603m403228J597938K238998k63175
$$ plain form
399.3 347931824 348701744 359505386 363484001 353427277 348393898 352436104 362617455 359230080
407 359230080 351294250 349841270 348261452 350523872 349786377 353021011 357653122 358805885 358079529
415.7 358079529 352728958 355159492 361856461 343875694 341793633 348308067 347963791 344877625
423.4 344877625 343070755 344671555 351380844 354274521 353932838 349196434 346477661 344403267 341633568
432.1 341633568 345712814 349513016 349823303 343394661 339501114 344384804 346627159 345755653 342567406
440.7 342567406 342123222 346204910 348066406 348827248 349240456 348564415 348935356 346346359 341644630
449.4 341644630 346567497 352027092 346544037 337579651 337665901 341797905 342003288 340997353 339323158
458.1 339323158 342327385 342887955 343179512 346703262 341897659 337494431 339092369 341331367 341068192
466.8C41068192L0899k78092m807052R76409J143303l529968M013367O41136n178528
475.5C34079666j329765o38619k361869L045311m2382k665596m10118r93309Q27255
484.1C29510574l71971j148186k812843j197166L681678K120743j263542j599846j600990
492.8C25318451k349587O91491J436576j050262j933975n81703J119804K65770J667862
501.5C24584427m32396j993942j75629j667175k70996O06575J606483J337662j480980
510.2C22114029k495728k826728o30341l81393j229229P66391k1248k417373o35853
518.9C12242527J262569J464711J4782j535111m34494n22613j848660j081390m70848
527.5C09091473O33850J960163J144466j45111j648121j540813k09789l84732O81706
$$ plain form
466.8 341068192 341099091 340820999 336013947 336990356 338133659 334603691 338617058 339258194 334079666
475.5 334079666 332749901 332111282 329749413 332794724 332752342 330086746 329676628 328683319 329510574
484.1 329510574 329138603 327990417 325177574 323980408 327662086 329782829 328519287 326919441 325318451
492.8 325318451 322968864 323660355 325096931 324046669 322112694 321530991 322650795 322916565 324584427
501.5 324584427 324152031 322158089 321982460 320315285 320044289 320650864 322257347 323595009 322114029
510.2 322114029 319618301 316791573 316161232 315779839 314550610 315317001 315295753 312878380 312242527
518.9 312242527 313505096 314969807 314984589 313449478 313014984 312492371 310643711 309562321 309091473
527.5 309091473 309725323 311685486 312829952 312684841 311036720 309495907 309286118 308901386 309583092
536.2C09583092K47192k098484j224804M06037M66232j157589p10049J059590M33216
544.9C07004433j127720k210045j190090n47867n82790k59877r8247n86262m14734
553.6B99986801J14899j621208j43223N02186j751862r77402K54536n2052k68821J522407
563.2B97566261K08321o78272J068248L02525J9722L58067J47933j323890o43559N05524
572.9B97530880m38271m55303j113586O98757J432018j06773o62365P39002J287880
581.5B98912239j612434r91707l33634q0986J067868O65741j23482j559811n4817Q13179
591.2B96702156R03091L97130l40767J350746N23529K74200j52454j070995q8902M4880
600.8B98542614K88391j005993r34105Q18615N31082l44867j869984k513618j013279
$$ plain form
536.2 309583092 309830284 307731800 306506996 306913033 307379265 306221676 305511627 306571217 307004433
544.9 307004433 305876713 303666668 302476578 301928711 301345921 301086044 300987797 300401535 299986801
553.6 299986801 300101700 298480492 298337269 298839455 297087593 296110191 296364727 296312675 296043854 297566261
563.2 297566261 297774582 297096310 298164558 298467083 298486805 298844872 298992805 297668915 297025356 297530880
572.9 297530880 297092609 296637306 295523720 296222477 297654495 297547722 296885357 297624359 298912239
581.5 298912239 297299805 296308098 295974464 295893478 296961346 297627087 297503605 295943794 295888977 296702156
591.2 296702156 297605247 298002377 297661610 299012356 299535885 299810085 299657631 298586636 298497734 298542614
600.8 298542614 298831005 297825012 296890907 297709522 298240604 297895737 296025753 293512135 292498856
609.5B92498856m89045j264228L23753J356907J4801m75884m63848j252155j072006
618.2B89177151N94349R44328k72713r33952J334305J952896L52325J023464J175957
626.9B95348110J002293P77035J171074J583347R49802J164608J466160K319565J691894
635.5C07473888M48075Q77743J228256K210655K207565J125889O12679L56006P71542
644.2C17312298R99470O29444P17392J281833J195412Q96568P44171J051445J091919
652.9C25919952n74722m61693J044312N19562m26102m32663l662k35291l13987r20792
662.5C24114914q44917P19223M16641n15022j811066k121677K997531J680870J178017
671.2C25814514J133576J746139J914940O67915q50448M06799J878090J399307J198235
$$ plain form
609.5 292498856 292009811 290745583 291069336 292426243 292441044 291965160 291501312 290249157 289177151
618.2 289177151 289771500 290715828 290443115 289509163 290843468 292796364 293148689 294172153 295348110
626.9 295348110 296350403 297127438 298298512 299881859 300831661 301996269 303462429 305781994 307473888
635.5 307473888 307921963 308799706 310027962 312238617 314446182 315572071 316184750 316540756 317312298
644.2 317312298 318311768 318941212 319658604 320940437 322135849 323032417 323776588 324828033 325919952
652.9 325919952 325345230 324883537 325927849 326447411 326021309 325588646 325584984 325349693 325035706 324114914
662.5 324114914 323269997 323989220 324405861 323890839 322079773 319958096 322955627 324636497 325814514
671.2 325814514 326948090 328694229 330609169 331277084 330426636 330833435 332711525 334110832 335309067
679.9C35309067M58717Q31719J857070K235756J680718J053772J791115J041679O03027
688.6C46862640K07367K99530Q57773l18298M48494J340561J551170R28116N0964O48308
698.2C52876625J054916J521149n59463q89321J353340J057129R60732J172447R91173
706.9C59538727L53737Q57887J677322M43955K64969J131134J019973N82238N88455
715.6C66458397j17760J61019J521568J049919J07117J32942O48651R80377J344452
724.3C72286682R67446M90684R53636J198120J022415Q79593J293679J142196J103516
733C81337967Q72536N35278O14128Q62923J206360o47202n4817R92241J55639R67560
742.6C86842613J121407J036567j03492M60586J373482R80492J151313m0626P01408
$$ plain form
679.9 335309067 335767784 336599503 338456573 340692329 342373047 343426819 345217934 346259613 346862640
688.6 346862640 347070007 347369537 348227310 347909012 348357506 349698067 351249237 352177353 352228317 352876625
698.2 352876625 353931541 355452690 354893227 354003906 355357246 356414375 357375107 358547554 359538727
706.9 359538727 359892464 360750351 362427673 362871628 363136597 364267731 365287704 365869942 366458397
715.6 366458397 366340637 366501656 368023224 369073143 369180260 369313202 369961853 370942230 372286682
724.3 372286682 373254128 373744812 374698448 375896568 376918983 377798576 379092255 380234451 381337967
733 381337967 382210503 382745781 383359909 384222832 385429192 384781990 384727173 385719414 385875053 386842613
742.6 386842613 387964020 389000587 388897095 389357681 390731163 391711655 392862968 392822342 393523750
751.3C93523750N06554L0785O02188N84526J517448R37920Q28285J309662J911278
760D01752396J568946J232186K029381J085701Q50906L8986o25610M98047J488075
768.6D09919014O93054j05705P69653j15013o34651k23999m0283j69869K73476Q53767
778.3D11219444J4878l128J78642R06029L66096J18141M87213q27713m62837P25212
787.9D12721977J939888N03197l72009N96008N65453N11398j389885q42781k22855
796.6D14010391n59883k16675q50029p98340p91130o65817j689644j290054j746216
805.3D05402603k873611k006226k336464j754646k477951k087555o20155j395493j729240
814C88121262j721993n81589n18722r75685p27120m73098J44042M29726P93915O61964
$$ plain form
751.3 393523750 394030304 394061089 394663277 395247803 396765251 397703171 398531456 399841118 401752396
760 401752396 403321342 404553528 406582909 407668610 408519516 408558502 407932892 408430939 409919014
768.6 409919014 410612068 410506363 411276016 411161003 410526352 410302353 410262070 410092201 410365677 411219444
778.3 411219444 411234322 411231194 411409836 412315865 412681961 412800102 413287315 412459602 411996765 412721977
787.9 412721977 414661865 415165062 414793053 415389061 415954514 416465912 415076027 414233246 414010391
796.6 414010391 413450508 413233833 412383804 411585464 410794334 410128517 408438873 407148819 405402603
805.3 405402603 402528992 400522766 398186302 396431656 393953705 391866150 391245995 389850502 388121262
814 388121262 386399269 385817680 385298958 384323273 383596153 383123055 383267097 383696823 384490738 385152702
823.6C85152702J733818L145981L471184K999420K892456L699112L424645L544845
831.3D10064163K753868K898217L393859K648087K857857L102722L647880K141228
839D33507881J467171K124367K035560J384735J427956K664223J913032J377297n074
847.7D47897148N79567J855545J630325K360802J190872J587563K093582K137299J163063
856.4D62495766R20105K700576J462784R45206J544571K471847Q19970l59765M71001
865.1D73472061k22969j12190r89075p52563j254998p81097k59285j769638j452293
873.8D65877953j455765q97751j678772r18922m10843j910553j873284j558723j05744
882.4D55067596m93011j05209r63059j842308Q2512m24004p94983j001129l0861l15094
$$ plain form
823.6 385152702 386886520 390032501 393503685 396503105 399395561 403094673 406519318 410064163
831.3 410064163 412818031 415716248 419110107 421758194 424616051 427718773 431366653 433507881
839 433507881 434975052 437099419 439134979 440519714 441947670 444611893 446524925 447902222 447897148
847.7 447897148 448476715 450332260 451962585 454323387 455514259 457101822 459195404 461332703 462495766
856.4 462495766 463415871 466116447 467579231 468524437 470069008 472540855 473360825 473001060 473472061
865.1 473472061 473249092 473136902 472147827 471395264 470140266 469359169 469099884 467330246 465877953
873.8 465877953 464422188 463524437 461845665 460926743 460515900 458605347 456732063 455173340 455067596
882.4 455067596 454574585 454469376 453506317 451664009 451746521 451322517 450527534 449526405 449495544 449180450
892.1D49180450j328620p55387l23791R44709N33791K96745P5875r2926l25852o00929
901.7D47604065j70517m07829O08978J317558K748146K777787K569694K730980P87125
910.4D60565987R62982k0561l86162k52915p35244j453095k829056k265663k593612
919.1D50992661k719231l234635l083915l251992l812026l242798l743134l005485
926.8D24899445l430481l330384l407058l915482k659874k602692j751632j615219
934.5D02186623j518326j328850j407394r54934j568031j153946j231231q70820p28187
943.2C91424904j439819j063004o01387N4703l66097O1989L67050n5160l4714n91850
952.8C87756615n81589j210365j677590j922912j674424j441154k268372k655868k661057
$$ plain form
892.1 449180450 447851830 447096443 446772652 447717361 448251152 448547897 448623772 448530846 448204994 447604065
901.7 447604065 447433548 447025719 447634697 448952255 451700401 454478188 457047882 459778862 460565987
910.4 460565987 461528969 461508408 461122246 460869331 460134087 458680992 455851936 453586273 450992661
919.1 450992661 448273430 445038795 441954880 438702888 434890862 431648064 427904930 424899445
926.8 424899445 421468964 418138580 414731522 410816040 408156166 405553474 403801842 402186623
934.5 402186623 400668297 399339447 397932053 396977119 395409088 394255142 393023911 392153091 391424904
943.2 391424904 389985085 388922081 388320694 388375397 388009300 388071289 388438339 388383179 388348465 387756615
952.8 387756615 387175026 385964661 384287071 382364159 380689735 379248581 376980209 374324341 371663284
961.5C71663284k061882k220955k471656k414704k079201j638183k556915k261429
969.2C53958359j591568j901360k205925k942238l447532l481789l402443l719330
976.9C31266174m191360m561196m674816m614124m960937m735070m496383n134354
984.7B93897934n319862n304375n098286n060482m712486m216652l797569l133984
992.4B57254238l946380l537903k847958k419510k537613l555031k835331l128128
1000.1B32446384k885265k536068k131920k028351k596454j503964j685466j256714
1007.8B15822182j664143k126541j790638j646366j175575k198239j781559k137832
1015.5B01301289j676407j299248j958237k099037l041687k097835k485447j190834
$$ plain form
961.5 371663284 369601402 367380447 364908791 362494087 360414886 358776703 356219788 353958359
969.2 353958359 352366791 350465431 348259506 345317268 341869736 338387947 334985504 331266174
976.9 331266174 327074814 322513618 317838802 313224678 308263741 303528671 299032288 293897934
984.7 293897934 288578072 283273697 278175411 273114929 268402443 264185791 260388222 257254238
992.4 257254238 253307858 249769955 246921997 244502487 241964874 238409843 235574512 232446384
1000.1 232446384 229561119 227025051 224893131 222864780 220268326 218764362 217078896 215822182
1007.8 215822182 214158039 212031498 210240860 208594494 207418919 205220680 203439121 201301289
1015.5 201301289 199624882 198325634 196367397 194268360 191226673 189128838 186643391 185452557
1023.2A85452557j275845k513351r67713j233330m17423j040153j261959j214886p96948
1031.9A74730949J90392q21018n22690m67262P44171O49986J361580K275200J867695
1040.6A80009003J763363o066J392613R55085l74088m18396k70100O1322j603050p83539
1050.2A80726147j230107j330757q25233q30860m71764j294022m56676m25701J37691
1058.9A73998718q8501P25956J645336J611500K429428J697541K320156J079883J470948
1067.6A86890965J717166J128254J864777N50384J219044M51260L74069K10457J67255
1076.3A94573631J264496L69015J145077M72774N45445O82602O26945O51779P55844
1085B01087608K372265J071911O25534L44524J239243J963425J127224J380481R75171
$$ plain form
1023.2 185452557 184176712 181663361 180695648 179462318 179044895 178004742 176742783 175527897 174730949
1031.9 174730949 174921341 174100323 173577633 173110371 173854542 174504528 175866108 178141308 180009003
1040.6 180009003 181772366 181766300 183158913 184113998 183739910 183321514 183051414 183112736 181509686 180726147
1050.2 180726147 179496040 178165283 177340050 176509190 176037426 174743404 174286728 173861027 173998718
1058.9 173998718 173910217 174636173 176281509 177893009 180322437 182019978 184340134 185420017 186890965
1067.6 186890965 188608131 189736385 191601162 192151546 193370590 193821850 194195919 194406376 194573631
1076.3 194573631 195838127 196207142 197352219 197824993 198370438 199053040 199679985 200331764 201087608
1085 201087608 203459873 204531784 205157318 205501842 206741085 208704510 209831734 211212215 212187386
1093.6B12187386J644897Q76236J455708J518554M51069J885491J948642J309567Q02917
1102.3B24080467J696568J326809Q85410J147118O52275J588287J574307J372928J05190
1111B34429359n01136P31029J431999J274414R17378J539917N62992n9013l86410o59084
1120.6B39281445n35450n84679L01704L25547J368675J011085N79224J344452J362018
1129.3B44454021K244988J586857J742687K289124J938324K022228K207317K285843
1137B60771389K426872K653408J588154J493549J757699J372184J348496J429882O44016
1145.7B75485649k72579M43706N04437P13310N05142l00426N9070J34049O8397o73999
1155.4B76666756m63333l79105j142407p21550n86376n68886m67777K29931O40278
$$ plain form
1093.6 212187386 213832283 214708519 216164227 217682781 218133850 220019341 221967983 223277550 224080467
1102.3 224080467 225777035 227103844 227989254 229136372 229788647 231376934 232951241 234324169 234429359
1111 234429359 233928223 234659252 236091251 237365665 238283043 239822960 240385952 240326939 239940529 239281445
1120.6 239281445 238745995 238161316 238463020 238788567 240157242 241168327 241747551 243092003 244454021
1129.3 244454021 246699009 248285866 250028553 252317677 254256001 256278229 258485546 260771389
1137 260771389 263198261 265851669 267439823 268933372 270691071 272063255 273411751 274841633 275485649
1145.7 275485649 275213070 275656776 276161213 276874523 277379665 277079239 277138309 277272358 277340755 276666756
1155.4 276666756 276203423 275824318 274681911 273960361 273373985 272805099 272337322 272567253 273207531
1164B73207531J272373J889763J851769K013454J563358K405644K633114K688369L226509
1172.7B92751884L289872L477649K973233L008937K768937K443008K352142K699070
1180.4C15764732K785511K039509J980629K229767K235260J787987J586571J236000
1188.1C31645966R06181N44586p8621l57399l32489l4180l35502p32422p61871n88951
1197.8C29875298n02663r34410j375694j589737j386414j131096j062965j037636r35001
1206.5C19919682n95208m71763j79425O9199j46637m29001r45339j051464n64594q9035
1216.1C15516415k91977l75881K3307m05693l73401j68553o19430o13823r30405j039658
1225.8C10720901p21855r91401j066075r50584o25382l11908q23174j152687q93936
$$ plain form
1164 273207531 274479904 276369667 278221436 280234890 281798248 284203892 286837006 289525375 292751884
1172.7 292751884 296041756 299519405 302492638 305501575 308270512 310713520 313065662 315764732
1180.4 315764732 318550243 320589752 322570381 324800148 327035408 328823395 330409966 331645966
1188.1 331645966 332552147 333096733 333018112 332660713 332328224 332294044 331958542 331226120 330464249 329875298
1197.8 329875298 329372635 328438225 327062531 325472794 324086380 322955284 321892319 320854683 319919682
1206.5 319919682 319324474 318852711 318673286 318742485 318595848 318166847 317221508 316170044 315605450 315516415
1216.1 315516415 315224438 314848557 314871864 314466171 314092770 313924217 313304787 312690964 311760559 310720901
1225.8 310720901 309999046 309007645 307941570 306990986 306365604 306053696 305230522 304077835 303183899
1234.4C03183899o19545l99723m66538j83162k59590p48120m93679l18718j36184k23942
1244.1B99334698l88165m31537m72622k99683n66025n17006m81109k28958K26230J3733
1253.7B96189556k48432k04983K728m23966j09882K39773q5678K1858j8578N67913
1263.4B95930309O72798L28885L80249N18856O42357O22921P60974O65226J002694
1272C01525269J084137R98096J146488Q12130Q50983J310634J186238Q73146Q35647
1280.7C10622768N18399J346969K317066J895924J263218J473427J730213R18732J229553
1289.4C23316269J208801O60134P29942Q97484J282158J210937J016426L41797P04613
1298.1C31368561P78885J28975M30336K68974Q2397j37748R3879k2621k67067J6823
$$ plain form
1234.4 303183899 302564354 302164631 301698093 301514931 301255341 300507221 300013542 299694824 299558640 299334698
1244.1 299334698 298946533 298514996 298042374 297742691 297176666 296659660 296178551 295949593 296175823 296189556
1253.7 296189556 295941124 295736141 295738869 295314903 295205021 295444794 295359116 295380974 295362396 295930309
1263.4 295930309 296603107 296931992 297312241 297831097 298473454 299096375 299857349 300522575 301525269
1272 301525269 302609406 303607502 304753990 305566120 306417103 307727737 308913975 309787121 310622768
1280.7 310622768 311141167 312488136 314805202 316701126 317964344 319437771 321167984 322086716 323316269
1289.4 323316269 324525070 325185204 325915146 326812630 328094788 329305725 330322151 330663948 331368561
1298.1 331368561 332147446 332276421 332706757 332975731 333058128 332920380 333014259 332991638 332724571 332741394
1307.7C32741394k15187k36473m85878o82945r04160p53326k18010o9123O3820j47743
1317.4C29092369K54364R49631J195717J137085R90219P67746O02722O08520K66495
1326C35864868M10462L51524L48549o0806l37983L8071n25169l97606m30336m00543
1335.7C34861031j34507l53164P3242J40152J85051N42221J351890J399155R68628
1344.4C39033699Q90694L99894O87027L28598J24894K36168J65901j86386o03791m33197
1354C40643501n13572j7128j40114k49253p56721n10330k13204j077766k976p65838
1363.7C36396599l51753k2812n87197k8534r06143o28242k42081l24974m14696m25415
1373.3C32464752l79219n29442Q43888K68554N5352k97013p00760n56297j120682r73701
$$ plain form
1307.7 332741394 332526207 332289734 331803856 331120911 330216751 329463425 329245415 329176292 329240112 329092369
1317.4 329092369 329346733 330296364 331492081 332629166 333619385 334387131 334989853 335598373 335864868
1326 335864868 336275330 336626854 336975403 336914597 336576614 336614685 336089516 335691910 335261574 334861031
1335.7 334861031 334726524 334373360 334446602 334586754 334771805 335314026 336665916 338065071 339033699
1344.4 339033699 339924393 340324287 341011314 341339912 341464806 341700974 341866875 341680489 341076698 340643501
1354 340643501 340129929 340112801 339972687 339723434 338966713 338456383 338243179 337165413 337162437 336396599
1363.7 336396599 336044846 336022034 335434837 335406303 334500160 333871918 333629837 333304863 332890167 332464752
1373.3 332464752 332085533 331556091 332399979 332668533 332723885 332426872 331726112 331169815 330049133 329075432
1382.9C29075432j649742j393357r75990j257553j822891j425438r20296j820831j937828
1391.6C15871506k271328j910687k542400l467827j622391j863594j879978l630905
1399.3B96682396k755585r50660j842576j989555k080212k938709k890625j575374
1407.1B79659100j358548k057819j461182j535167j661110j428395j002788q28419
1414.8B68325672j402283r37309n74627O12335j270160j076012J020756L94611R28669
1423.4B66021652j59187N95417Q53386L78113J273441O26411J132393P36141K082749
1432.1B73540516K228756J374054K207260J829624K401180J058293K354202J882267
1439.8B88876152J947651K443600J497612K041988J147232J864643J576386J668396
$$ plain form
1382.9 329075432 327425690 326032333 325056343 323798790 321975899 320550461 319630165 317809334 315871506
1391.6 315871506 313600178 311689491 309147091 305679264 304056873 302193279 300313301 296682396
1399.3 296682396 293926811 292976151 291133575 289144020 287063808 284125099 281234474 279659100
1407.1 279659100 278300552 276242733 274781551 273246384 271585274 270156879 269154091 268325672
1414.8 268325672 266923389 265986080 265411453 266023788 264753628 263677616 264698372 265092983 266021652
1423.4 266021652 265862465 266457882 267311268 267689381 268962822 269589233 270721626 271457767 273540516
1432.1 273540516 275769272 277143326 279350586 281180210 283581390 284639683 286993885 288876152
1439.8 288876152 290823803 293267403 294765015 296807003 297954235 299818878 301395264 303063660
1447.6C03063660J819744J329269K354260J414547K199440J405449J925258K439347
1455.3C17950974J732120K444210m56810L484497J372070K430687K244950J551628
1463C32754326K875976O68717K101211K233849K924042K987518K504196L107147K338257
1471.7C54495239L642998J870003L247375L538857K561722K797164K595978K431336
1479.4C77180672K353096K347374J636200J914939J837616J512261J791077P77893
1487.1C91351128Q85887J837616J34124l03230M68865J09977r95178j219406p00569
1495.8C91569214m214325l26614j127167l115196n14527j055946j220665j180344K99874
1504.5C79114304k57302l936310k786331j040115J042976k55890P14074o48537j439972
$$ plain form
1447.6 303063660 304883404 306212673 308566933 309981480 312180920 313586369 315511627 317950974
1455.3 317950974 319683094 322127304 321670494 325154991 326527061 328957748 331202698 332754326
1463 332754326 335630302 336299019 338400230 340634079 343558121 346545639 349049835 352156982 354495239
1471.7 354495239 358138237 360008240 363255615 366794472 369356194 372153358 374749336 377180672
1479.4 377180672 379533768 381881142 383517342 385432281 387269897 388782158 390573235 391351128
1487.1 391351128 392237015 394074631 394208755 393905525 394374390 394484367 393489189 392269783 391569214
1495.8 391569214 387354889 387028275 385901108 382785912 382271385 381215439 379994774 378814430 379114304
1504.5 379114304 378857002 374920692 372134361 371094246 372137222 371881332 372595406 371946869 370506897
1513.1C70506897r7542j098633r69047j710816j705742P34902J627808m41628l233566
1521.8C63612633N58357J922607K198983n17044M45671J395797Q16727O86264R28116
1530.5C72048111J022758J89667P19795r99679J168442J302147J050796K451859j411820
1539.2C77542076m013100J445542J851883l96157J260491J619873j452446J384125
1546.9C79242287P72171J102943k23656j772003O87409J18866R81750k437668m97513
1555.6C77974586J543236J942520l117218j3103256M393501J34087N19524j511689
1563.3C68775291j567497l708114l781510j408501k404212p52564q885879k694092
1571C43572922k062187m145699l331871l536644j267662j2257195k763862l911057
$$ plain form
1513.1 370506897 370409355 369310722 368341675 366630859 364925117 365660019 367287827 366846199 363612633
1521.8 363612633 364170990 366093597 368292580 367775536 368221207 369617004 370433731 371119995 372048111
1530.5 372048111 373070869 373260536 373980331 372980652 374149094 375451241 376502037 378953896 377542076
1539.2 377542076 373528976 374974518 376826401 376430244 377690735 379310608 377858162 379242287
1546.9 379242287 380014458 381117401 380893745 379121742 379809151 379928017 380909767 378472099 377974586
1555.6 377974586 379517822 381460342 378343124 365239868 369633369 369767456 370286980 368775291
1563.3 368775291 367207794 363499680 359718170 358309669 355905457 355152893 346267014 343572922
1571 343572922 341510735 337365036 334033165 330496521 329228859 316971664 314207802 310296745
1578.7C10296745m415855l906365n736942l685455o027794l497868n136795m558563
1586.4B73331108m593925n485154l293800o079521l217411n139408l050633l926697
1594.1B38544559m907512k729931m852276j793823m451122j853219l219585l330250
1601.9B11406841k114792m396839p64351k929306n52005k742806j229610r21212k835712
1610.5A92920208K54269k484646J89876k017746P12586P48195n553741J699581j122951
1619.2A85345631J488132j328010J238269P02496j659298J180153n93548K478409j355248
1627.9A87496986J292515J018315P29713J168480N8021K477742L10535K739296j469517
1636.6A95822086K896099J360856P84702K780342N10216K767143O60934K633152K112751
$$ plain form
1578.7 310296745 305880890 301974525 296237583 292552128 286524334 283026466 277889671 273331108
1586.4 273331108 268737183 263252029 259958229 253878708 250661297 245521889 242471256 238544559
1594.1 238544559 233637047 230907116 226054840 224261017 219809895 217956676 214737091 211406841
1601.9 211406841 209292049 204895210 204130859 201201553 200649548 197906742 196677132 195755920 192920208
1610.5 192920208 193174477 190689831 190879707 188861961 189574547 190322742 184769001 186468582 185345631
1619.2 185345631 186833763 185505753 186744022 187446518 185787220 186967373 186373825 188852234 187496986
1627.9 187496986 188789501 189807816 190537529 191706009 191764030 194241772 194552307 197291603 195822086
1636.6 195822086 198718185 200079041 200863743 203644085 204154301 206921444 207582378 210215530 212328281
1645.3B12328281L25489L464604j255036L292733Q55140L095608J957455k785626K783966
1653.9B24062614Q68512M441719J161232K637195J396313K072964K427730K006073
1661.6B41074352L781472K71797L435688K482147L484783L314266L194371M130325
1669.4B65169201J181087N512677K586002L623142L522167L543129L848629L144131
1677.1B92130165N039139L393345M833088L905906N090485N577526K113934N840912
1684.8C27924500K266273O090965M775505M692841M864426M538612N439300M521332
1692.5C65113754N397263N232963N121079K594147O214523O674080O138763N674629
1700.2D08161201j348876P329559N985107M735985L429871L554649L724480L478927
$$ plain form
1645.3 212328281 212653770 216118374 214863338 218156071 219011211 222106819 224064274 221278648 224062614
1653.9 224062614 224931126 229372845 230534077 233171272 234567585 236640549 239068279 241074352
1661.6 241074352 244855824 245127621 248563309 251045456 254530239 257844505 261038876 265169201
1669.4 265169201 266350288 271862965 274448967 278072109 281594276 285137405 288986034 292130165
1677.1 292130165 297169304 300562649 305395737 309301643 314392128 319969654 322083588 327924500
1684.8 327924500 330190773 336281738 341057243 345750084 350614510 355153122 360592422 365113754
1692.5 365113754 370511017 375743980 380865059 383459206 389673729 396347809 402486572 408161201
1700.2 408161201 406812325 414141884 420126991 424862976 428292847 431847496 435571976 439050903
1707.9D39050903M446869K966385K084084K899894L005295K941551J514168J299477
1715.6D60208626M069214K866745m134217L513413L699837K189369J903610J299973
1723.4D75616570J096916J570434J721459J715316K145157K214432L80173O85119L617249
1732D90762825M087219n111l875771L627739M331818K629928L423500J273384j066208
1740.7E05189323M673844L826866J747971K469406M122696M023742K877198L299179
1748.4E32230225K290649N272713L108291J268692N314637L530845L482476M035873
1756.2E60534401J438255K773323L768654K970162M056205O29654L72734L913536K121468
1764.8E82578392K015038K584190K507935j148263K136117M972114N88989j404190
$$ plain form
1707.9 439050903 443497772 446464157 448548241 451448135 454453430 457394981 458909149 460208626
1715.6 460208626 464277840 467144585 463010368 466523781 470223618 472412987 474316597 475616570
1723.4 475616570 476713486 478283920 480005379 481720695 483865852 486080284 486460457 487145576 490762825
1732 490762825 494850044 494844933 490969162 494596901 498928719 501558647 504982147 506255531 505189323
1740.7 505189323 509863167 513690033 515438004 517907410 522030106 526053848 528931046 532230225
1748.4 532230225 534520874 539793587 542901878 544170570 549485207 553016052 556498528 560534401
1756.2 560534401 561972656 564745979 568514633 571484795 575541000 576170654 576543388 580456924 582578392
1764.8 582578392 584593430 587177620 589685555 588537292 590673409 595645523 596234512 594830322
1772.5E94830322j092567M289627K788162o32248K460938J398430J919708P87506j41258
1781.2F06608620J625213J723900K136727j62392J77765J806602J069489N34630J849212
1789.9F17369766J000939P48405k76070n54428L753815J339951j24169J426621J801681
1798.6F26486511Q21762j094551K320404L56636K86217J893997J046639J386413P26357
1807.3F34230385L25088P73201J481514j178932K65160J668701O69670J467667O47888
1815.9F40350342J459122j8158M86526J246796l54233P04574l41720J303100J632004
1824.6F46468353j770324J24435K252121K535400O44226k643203j01700K182312O11191
1833.3F50302811M04663K13394L02353Q57467k74963J346817N05753P70187P75909
$$ plain form
1772.5 594830322 593737755 598027382 600815544 600183296 602644234 604042664 605962372 606749878 606608620
1781.2 606608620 608233833 609957733 612094460 611932068 612109833 613916435 614985924 615520554 617369766
1789.9 617369766 618370705 619119110 618843040 618288612 622042427 623382378 623258209 624684830 626486511
1798.6 626486511 627308273 626213722 628534126 628890762 629176979 631070976 632117615 633504028 634230385
1807.3 634230385 634555473 635328674 636810188 635631256 635896416 637565117 638234787 639702454 640350342
1815.9 640350342 641809464 641791306 642277832 643524628 643170395 643874969 643533249 644836349 646468353
1824.6 646468353 644698029 644822464 647074585 649609985 650254211 647611008 647509308 649691620 650302811
1833.3 650302811 650707474 650920868 651223221 652080688 651805725 653152542 653658295 654428482 655204391
1842F55204391J520386J530838n873794J541595K369537J19172k81601O42013J435547
1850.7F58208084J50604R73511j92184L13110J98822k78320R88464M9133O74820O7520
1860.3F61153564Q8807J25961Q46252J079026K41165P07779r40399M07638p49130j494827
1869.9F61465836J249084J105347R75799K46048N24216j64566N64880L95050k40936
1878.6F66120758K10419l86353M95682l47900M03289N24674K69089Q36792k21634J005706
1888.3F68910522j84173j659622K44903P22962J63574O36902P00989p11060M88205
1896.9F69313202J38321K38800J95618J2817L67432l13645L29132k30942N73578M52042
1906.6F71076355j33133J46484k61688N2262l81318R22699Q8501r3536J26114J89743
$$ plain form
1842 655204391 656724777 658255615 652381821 653923416 656292953 656412125 656130524 656772537 658208084
1850.7 658208084 658358688 659332199 659140015 659453125 659651947 659373627 660362091 660411224 661086044 661153564
1860.3 661153564 661242371 661368332 662214584 663293610 663534775 664242554 663302155 663709793 662960663 661465836
1869.9 661465836 662714920 663820267 664796066 665042114 665566330 665401764 665966644 666361694 666120758
1878.6 666120758 666331177 665944824 666440506 666092606 666495895 667020569 667289658 668126450 667904816 668910522
1888.3 668910522 668726349 667066727 667311630 668034592 668198166 668835068 669536057 668824997 669313202
1896.9 669313202 669451523 669690323 669885941 669898758 670266190 669952545 670281677 670050735 670624313 671076355
1906.6 671076355 670943222 671089706 670828018 670880280 670498962 671421661 671510162 671416626 671542740 671732483
1916.2F71732483J940155j485596j119613O32019Q2550L49960p38144j98135O25915
1924.9F71821594O71997j22757K45667J83945K34375l82p01675M01916k26440J68915
1934.6F72677155k73819l00675N95932J64871N66941l29361P36084j05362k123032
1943.2F71608734K61307N80521j02921l23334M61960r3841l5782K16598R5673L23181
1952.9F72992096l49884l11203o43387j29776k62985j21308K89994O561N83038N0354
1962.5F72103500L09677l00292l37296j70441q08181M196o1112O36826K13241R1782
1972.2F71681900L77197K10572J91192n41687r2773o67496l88870N1956m807K11182
1981.8F71028366r8801L47748J1597K10190k30484q5449q7586j039581K899P5455l68195
$$ plain form
1916.2 671732483 673672638 672187042 671067429 671699448 671781998 672131958 671393814 671195679 671821594
1924.9 671821594 672493591 672370834 672616501 672800446 673034821 673034439 672332764 672734680 672508240 672677155
1934.6 672677155 672403336 672102661 672698593 672863464 673430405 673101044 673837128 673731766 671608734
1943.2 671608734 671870041 672450562 672347641 672024307 672486267 672392426 672356644 672573242 672668915 672992096
1952.9 672992096 672642212 672331009 671687622 671557846 671294861 671173553 671463547 671470108 672053146 672103500
1962.5 672103500 672413177 672112885 671775589 671605148 670796967 670801163 670740051 671376877 671590118 671681900
1972.2 671681900 672059097 672269669 672460861 671919174 671826401 671158905 670770035 670821991 670817184 671028366
1981.8 671028366 670929565 671277313 671288910 671499100 671268616 671183167 671095581 670056000 670058899 670134354 669766159
1992.4F69766159m67682L29971M18091K03095J49078m30450M2114n70068l06473l57514
2002.1F68776321k47192M37546m3488L00827J07117L26691m21372o51855j3962l06320
2011.7F68264313n39933p83309J19018j08795O6757M3030K9449M47998j44271K37197
2021.3F67631454p40051n02395j87073k99912j00631m39988L20588k40632J03684l23334
2031F65221710l34625K43912q29239j99204r0789o4698k06527q6823j14670j9302J83182
2041.6F63702927n52750L11508l97491m43573j84479k93427K5330m56543N30014J00784
2051.2F62342300K12326p2479n43136j42899p16400J7700k62070P7897K8457j02005
2060.9F60839691L46527k98614J69143J21918j3504o62842m55627j10703m3716M23279
$$ plain form
1992.4 669766159 669298477 669628448 670046539 670249634 670398712 669968262 670010376 669440308 669133835 668776321
2002.1 668776321 668529129 668966675 668923187 669224014 669331131 669657822 669236450 668584595 668570633 668264313
2011.7 668264313 667724380 666941071 667060089 666951294 667018051 667061081 667090530 667538528 667394257 667631454
2021.3 667631454 666891403 666389008 666201935 665902023 665801392 665361404 665681992 665441360 665545044 665221710
2031 665221710 664887085 665130997 664301758 664102554 664011765 663947067 663740540 663653717 663539047 663519745 663702927
2041.6 663702927 663150177 663461685 663064194 662620621 662436142 662142715 662168045 661711502 662241516 662342300
2051.2 662342300 662554626 662482147 661939011 661796112 661079712 661097412 660835342 660913239 660941696 660839691
2060.9 660839691 661186218 660887604 661056747 661178665 661165161 660502319 660046692 659935989 659892273 660315552
2070.5F60315552m81644m2114J01166N1956j39466j13067K10266n00336r2239j36643
2080.2F59173431k6168l02811l08609k43225k77939O58569j23443m23432k78167J54190
2089.8F58002396k98005o27212M3335l45306K37197k27279Q3847K32773m48532k71836
2099.5F56381378m70505J23139k86789J11923m6921l89938J7853l85056m959m14429
2109.1F54635696n874k50168m80805j52359j89285L19290j74560K19726k18124k08054
2118.7F53495483k25067o60095J70441O4621K77633m82940j15967M56924j03149j45264
2128.4F52732620l87268o7825m12979J71356l5248k32086J07117l44925K11181l1280
2138F51710663K87704j80893j40915L91312j49612J33285l35769j23291k34528J32675
$$ plain form
2070.5 660315552 659833908 659791794 659892960 659944916 659805450 659692383 659902649 659402313 659310074 659173431
2080.2 659173431 659147263 658844452 658535843 658292618 658014679 658673248 658549805 658126373 657848206 658002396
2089.8 658002396 657704391 657077179 657120514 656775208 657012405 656785126 656868973 657101746 656653214 656381378
2099.5 656381378 655910873 656034012 655747223 655859146 655812225 655422287 655440140 655055084 655050125 654635696
2109.1 654635696 654629822 654379654 653898849 653746490 653557205 653876495 653701935 653921661 653703537 653495483
2118.7 653495483 653270416 652610321 652780762 652845383 653123016 652640076 652524109 652981033 652877884 652732620
2128.4 652732620 652345352 652277527 651864548 652035904 652000656 651768570 651875687 651530762 651741943 651710663
2138 651710663 651998367 651817474 651676559 652067871 651918259 652051544 651715775 651592484 651357956 651490631
2147.7F51490631O01730K14768O1035o00281k32315k87628J05133K70538J56174K0600
2157.3F51800385n74341L91235M60739L06778k74582l80020J50604j26342O7138j12152
2167F51709442K82898M807j8769J19629j65100K03171o9580J26953k7313O332J18332
2177.6F52290802R0561q8120j15509L98484P934K43988l32107j35804L39051k87476
2187.2F52411804K06070J03455p8049j08108M71191N1880L4866N40390l91083K2812
2196.9F53265228k93350l27454j14746M12751N78689l30276L40271m7837J72425L21731
2206.5F53977432K9145l39737o97098L83224J34278L00064k3194l5247K83355J7472
2216.1F54029694J83410m77066Q6975K07672K53601k85339k60849M53186l63159M00391
$$ plain form
2147.7 651490631 652092361 652307129 652368164 651767883 651535568 651247940 651353073 651623611 651779785 651800385
2157.3 651800385 651226044 651617279 652078018 652384796 652110214 651730194 651880798 651754456 651821594 651709442
2167 651709442 651992340 651997147 651978378 652098007 651932907 652136078 652066498 652193451 652166138 652172470 652290802
2177.6 652290802 652381363 652293243 652177734 652576218 652584152 652828140 652496033 652360229 652699280 652411804
2187.2 652411804 652617874 652721329 652643280 652535172 653006363 653058243 653093109 653633499 653242416 653265228
2196.9 653265228 652971878 652644424 652529678 652942429 653521118 653190842 653531113 653483276 653655701 653977432
2206.5 653977432 654006577 653666840 652969742 653352966 653487244 653787308 653764114 653728867 654012222 654029694
2216.1 654029694 654213104 653736038 653823013 654030685 654284286 653998947 653738098 654191284 653828125 654228516
2225.8F54228516J69601o5231l69110m17328M09240k67257l70560m75616O17828O34460
2235.4F54094543m1809P8888k10800o5307n52826K3956k45133m7454M58908R0027J22146
2246F53705139n54428J65634P1182L29285K5559q43048m0513J3581O50863n1040m55857
2256.7F53016357m2114M72183O15769n28259l06321m36020M349m5013j97067J39694
2266.3F52693558J21536L51181l36151K81296p1717j32751J5945n73196k1439m34875
2275.9F51893387m9133o4545K71606K87857k59552N2338l47748j6022j24282M1198
2285.6F51685104l79715r5520L05405n51681J88598j89895N7144R4452P629O5460m35028
2296.2F50751953K51236o13632k40784m4021k47269p6752n49469J21384j96686o8359
$$ plain form
2225.8 654228516 654398117 654332886 653963776 653546448 653955688 653688431 653317871 652842255 653460083 654094543
2235.4 654094543 654052734 654131622 653920822 653855515 653302689 653326645 653081512 653034058 653492966 653582993 653705139
2246 653705139 653150711 653316345 653387527 653716812 653742371 652899323 652858810 652872391 653523254 653472214 653016357
2256.7 653016357 652974243 653446426 654062195 653533936 653227615 652791595 652795944 652750931 652553864 652693558
2266.3 652693558 652815094 653166275 652830124 653111420 653039703 652906952 652922897 652349701 652328262 651893387
2275.9 651893387 651844254 651779709 652051315 652339172 652079620 652131958 651784210 651768188 651643906 651685104
2285.6 651685104 651305389 651209869 651515274 650963593 651152191 650962296 651019440 651113892 651121521 651186981 650751953
2296.2 650751953 651003189 650389557 650148773 650104752 649857483 649780731 649231262 649352646 649155960 649087601
2305.8F49087601p1259Q6212k44903o91986N0888J08261K05459r72900j80740J7090
2315.5F47393723k45286L39203q04672j06430n75638m91104k45437j72349l47671m12140
2325.1F44332199J748352P8888n33829n76400k52610M2267n60608O17829r02787j55029
2334.8F43838272k52304p81021m21448n07889P29218j09329O3095k36435M70581J03760
2344.4F42896500o57273J89820m01307J14670L84369O18286m19464p89108j47247q04215
2354.1F40985031j56402j164856q69675l46451k098M50249K25410O83823k30332j421280
2363.7F38153419j006622J523705m11225j236496j66511j10626J004943K33765j60713
2372.4F37823639m9706K86637n69763j24817M01764k83699M04129l86200l17994l88069
$$ plain form
2305.8 649087601 649016342 649102554 648857651 648165665 648216553 648324814 648530273 647557373 647376633 647393723
2315.5 647393723 647148437 647487640 646682968 646576538 646000900 645509796 645264359 645092010 644744339 644332199
2325.1 644332199 646080551 646159439 645625610 645049210 644796600 644838867 644278259 644896088 643993301 643838272
2334.8 643838272 643585968 642804947 642383499 641875610 642604828 642495499 642558594 642322159 642792740 642896500
2344.4 642896500 642239227 642429047 642027740 642142410 642526779 643145065 642725601 641936493 641789246 640985031
2354.1 640985031 640828629 639663773 638794098 638447647 638445549 638895798 639121208 639805031 639574699 638153419
2363.7 638153419 637146797 638670502 638259277 637022781 636856270 636745644 637750587 637984352 637823639
2372.4 637823639 637773933 638060570 637490807 637365990 637767754 637484055 637888184 637501984 637183990 636795921
2382F36795921n27115J9951j58958J59492n88150m35905k1515J1978q5296o44837q6899
2392.6F34438667j06582j79367m32282p7553j57585p76367k98233n03502k07939k20146
2402.3F31479111r8305k45018l43704J19781n18722m71344o16226k51847q5678k19650
2411.9F28748398o6185m38347k37503m42467j19171k39639j56174l34892q94242k57492
2421.6F25562286p29217l30887k13051l23143O256l55415l36418m99993j30195m68407
2431.2F22181816m69284n17654q06313j61400j51329j04599m08592k25792k41356k71873
2440.8F18823624m66729q69636l72429o46515l1357j64337m08745j60789p24220m40941
2450.5F14537926m60282j49192n25208o28090l04985l19214j1215n76324m13552n42259
$$ plain form
2382 636795921 636268806 636288757 636129799 636289291 635701141 635265236 635243721 635255699 635170403 634525566 634438667
2392.6 634438667 634332085 634152718 633720436 633642883 633485298 632708931 632410698 631907196 631699257 631479111
2402.3 631479111 631380806 631135788 630792084 630911865 630393143 629921799 629305573 629053726 628968048 628748398
2411.9 628748398 628682213 628243866 628006363 627563896 627444725 627205086 627048912 626714020 625819778 625562286
2421.6 625562286 624833069 624502182 624289131 623965988 623972244 623616829 623280411 622780418 622650223 622181816
2431.2 622181816 621712532 621194878 620388565 620227165 620075836 619971237 619562645 619336853 619095497 618823624
2440.8 618823624 618356895 617487259 617114830 616468315 616436958 616272621 615863876 615703087 614978867 614537926
2450.5 614537926 614077644 613928452 613403244 612775154 612470169 612150955 612139740 611563416 611149864 610607605
2460.1F10607605n14030k65427k48566l02620q21914m24424n15403l59230l89672k47345
2469.8F06518974j04522q23327o24160p32994m06456l72048l68690l49388p56379l91540
2479.4F01589470l27530o0158o13823o99577k91367m57725n63812p89109l70674n98106
2489.1E96817589l99323n81093r57565l97949l3379K7237q67767n33676m20876n04608
2498.7E92148590l67584j079826p60422l82118P8392l79372o96716m20380o42166o70433
2508.3E86827965q02841l88947n86433k67563j50261m81568k27394o97403n58967n60036
2518E82106552m94423o22558n31693j92146p47757n99632j77689J42746m63600n40543
2527.6E77879257l99284p16629m59061q32519m99192o63452q55484n26886k54631K05231
$$ plain form
2460.1 610607605 610093575 609828148 609579582 609276962 608455048 608030624 607515221 607155991 606766319 606518974
2469.8 606518974 606414452 605591125 604966965 604233971 603827515 603455467 603086777 602737389 601981010 601589470
2479.4 601589470 601261940 601201782 600587959 599888382 599597015 599139290 598575478 597786369 597415695 596817589
2489.1 596817589 596418266 595837173 594879608 594481659 594448280 594475517 593607750 593074074 592653198 592148590
2498.7 592148590 591781006 590701180 589940758 589558640 589637032 589257660 588560944 588140564 587498398 586827965
2508.3 586827965 586025124 585636177 585049744 584782181 584631920 584150352 583922958 583225555 582666588 582106552
2518 582106552 581612129 580989571 580457878 580265732 579517975 578918343 578740654 578883400 578419800 577879257
2527.6 577879257 577479973 576763344 576304283 575471764 574972572 574309120 573453636 572926750 572672119 572877350
2537.3E72877350l87154m50935l94554j66359k76070q15735p12852o16760m44603o59256
2546.9E67953072j69716j50986n65376n80826n02167j81503n90897n22880o18706l63312
2556.6E63706703k60773n72357k11601m10347l87154q84819m35562J34850q14362r22165
2566.2E58942413n10788l67431n73960q0948o8092k55279k47689n78651m45824q84819
2575.9E54928932n60570l64532m33426k16598m10996m89540p37915j99585l15476o50444
2585.5E50549850o19545n90095k83928m34380m02946o64864k76947m38957p57522l28942
2595.1E45751724n52711j63231m49639o19277m39835m98962l91884o00739l67927n20401
2604.8E41147118n84488p03011n73501k33193n96237p01752m58870k76375o25686n60188
$$ plain form
2537.3 572877350 572490196 572039261 571644707 571478348 571202278 570386543 569673691 569056931 568612328 567953072
2546.9 567953072 567783356 567632370 567066994 566486168 565984001 565802498 565211601 564688721 564070015 563706703
2556.6 563706703 563445930 562873573 562661972 562251625 561864471 560979652 560544090 560678940 559864578 558942413
2566.2 558942413 558431625 558064194 557490234 557409286 557341194 557085915 556838226 556259575 555813751 554928932
2575.9 554928932 554368362 554003830 553570404 553353806 552942810 552453270 551715355 551515770 551200294 550549850
2585.5 550549850 549930305 549340210 549056282 548621902 548218956 547554092 547277145 546838188 546080666 545751724
2595.1 545751724 545199013 545035782 544586143 543966866 543527031 543028069 542636185 542035446 541667519 541147118
2604.8 541147118 540562630 539859619 539286118 539052925 538456688 537754936 537296066 537019691 536394005 535833817
2614.4E35833817q06466p57484l33519o63109j94206k11868o26564p23000l31993m30641
2624.1E30754967r11675n35698r67636p07931n73693p37991n8479k03171o43768r56917
2633.7E24458008o87790m32663k79579l25585p08084r33799p72858k99454q22906o86608
2643.4E18508682j77803l35884m55856n79949l96804m67720o20499p54242l53088m24920
2653E13941917n33485m64287r69314k42272l47862n31998l11660o50864l74527n40772
2662.6E08974876m05540l81203m45404l94783n41916m38919m03404l74107m80957l01743
2672.3E04806900n29556n75714n47638k26403R1782p08580n14679n58319l91197m5586
2681.9E00801010j30768j41220j088180p53174l31192l93639l15285k91786l09944
$$ plain form
2614.4 535833817 535027351 534269867 533936348 533273239 533079033 532867165 532240601 531517601 531185608 530754967
2624.1 530754967 529843292 529307594 528339958 527632027 527058334 526320343 526261864 526058693 525414925 524458008
2633.7 524458008 523770218 523337555 523057976 522732391 522024307 521090508 520317650 520018196 519195290 518508682
2643.4 518508682 518330879 517994995 517539139 516959190 516562386 516094666 515474167 514719925 514366837 513941917
2653 513941917 513408432 512944145 511974831 511732559 511384697 510852699 510541039 509890175 509515648 508974876
2662.6 508974876 508569336 508188133 507742729 507347946 506806030 506367111 505963707 505589600 505108643 504806900
2672.3 504806900 504277344 503701630 503153992 502927589 503019371 502310791 501796112 501237793 500846596 500801010
2681.9 500801010 500670242 500529022 499440842 498687668 498356476 497962837 497647552 497355766 497045822
2690.6D97045822o37092j22872l55148m35372l23448n31807m29153p72209m10500j18217
2700.3D92910004j78566o20575q28705m05922n7182j70250p16400k29340k17056l78228
2709.9D89107780m31289n28565r7465k13585j19972m47579n61905l66897j60446j55259
2719.5D86024818n93261j96915l77274m01191j48125N0163j61590j049233p16438J4458
2729.2D82445412K90718m58832o84891k85949k62681j36032l24554j84364l62511k99721
2738.8D79736595l96767p1487L49503n72510n76821m86564k76070k50854j05706K95334
2748.5D77644653m3792n7908n71670m62837l08800j85280K7466l26653m08783n25932
2758.1D74780464J24016l55911p47528m99878o54755k98500m07982l2997l33633j60561
$$ plain form
2690.6 497045822 496408730 496285858 495930710 495495338 495171890 494640083 494210930 493438721 493028221 492910004
2700.3 492910004 492731438 492110863 491282158 490876236 490819054 490648804 489932404 489703064 489486008 489107780
2709.9 489107780 488676491 488147926 488050461 487836876 487716904 487269325 486707420 486340523 486180077 486024818
2719.5 486024818 485431557 485234642 484857368 484456177 484308052 484358215 484196625 483147392 482430954 482445412
2729.2 482445412 482736130 482277298 481592407 481306458 481043777 480907745 480583191 480398827 480036316 479736595
2738.8 479736595 479339828 479268341 479617844 479045334 478468513 477981949 477705879 477455025 477349319 477644653
2748.5 477644653 477600861 477542953 476971283 476508446 476199646 476014366 476041832 475715179 475306396 474780464
2758.1 474780464 474904480 474548569 473801041 473301163 472646408 472347908 471939926 471906929 471573296 471412735
2767.8D71412735J0147q37822m06227r6893j55297o40068l39393l27988q52432k59133
2777.4D67507629m67605n37491l24631m24881o14090m27742l40919n05104l45269m34112
2787D63085785j87454o63491o72798n12962q38089m60205l09220j41525r39598j054649
2796.7D57305794p45049o49185m51622j138267o03333o52390p87162m67797p54623
2805.4D51056366p47108q80547l72810m32816o33392o59294q32139r79309j096077
2814D44422874n47065p87430o41098o08368j136322q29239n33676r18541j343613p79609
2823.7D36297913j000634r50660m52042r25140j122551j100083q09478r56078r69887
2832.4D28011360j062012j330490j084480r38683p92198j318969j566163j810569k001953
$$ plain form
2767.8 471412735 471422882 470585060 470178833 470081940 469926643 469286575 468947182 468619194 467766762 467507629
2777.4 467507629 467040024 466502533 466177902 465753021 465138931 464711189 464370270 463865166 463519897 463085785
2787 463085785 462898331 462234840 461562042 461049080 460210991 459750786 459441566 459300041 458360443 457305794
2796.7 457305794 456560745 455911560 455459938 454321671 453718338 453065948 452278786 451810989 451056366
2805.4 451056366 450309258 449428711 449055901 448623085 447989693 447330399 446498260 445518951 444422874
2814 444422874 443875809 443088379 442447281 441838913 440702591 439873352 439339676 438421135 437077522 436297913
2823.7 436297913 435297279 434346619 433894577 432969437 431846886 430746803 429937325 428981247 428011360
2832.4 428011360 426949348 425618858 424534378 423595695 422803497 421484528 419918365 418107796 416105843
2841.1D16105843j674576j667366j672631k217407k394256k110482j971817k175102
2848.8D00222206k251396k025070j763268q93020r51424r52034o28700l79410L3607
2857.4C90411491k00691R2392k441k84081n42335n76706l61481q52013o82411j038704
2867.1C85963020j219444o76651r91631r93537n31235k48413n80597j054154p76977
2875.8C78890381o29082j094475r33952o42433n20477n46303j124687r60465q51822
2884.4C71586685j121216j358032j101684r07097j269493o58417r96971j237374q08029
2893.1C62128372j078453p75070q70438j012306q65211p55577j036950q38813k67487
2901.8C54628067o21262m92439p55768r66530r65232j042519o16264o19202r49249
$$ plain form
2841.1 416105843 414431267 412763901 411091270 408873863 406479607 404369125 402397308 400222206
2848.8 400222206 397970810 395945740 394182472 393289452 392338028 391385994 390757294 390377884 390411491
2857.4 390411491 390210800 390303192 390300751 390016670 389474335 388897629 388536148 387684135 387001724 385963020
2867.1 385963020 384743576 384066925 383075294 382081757 381550522 381302109 380721512 379667358 378890381
2875.8 378890381 378261299 377166824 376232872 375590439 375069962 374523659 373398972 372438507 371586685
2884.4 371586685 370465469 369107437 368005753 367098656 365829163 365170746 364173775 362936401 362128372
2893.1 362128372 361049919 360274849 359404411 358392105 357526894 356771317 355734367 354895554 354628067
2901.8 354628067 354006805 353514366 352758598 351792068 350826836 349784317 349168053 348548851 347599602
2910.5C47599602j569290j114808j082916j603126j538887j766968j259918j247025
2918.2C36416664j178703j161919j270332r60770j180763j87302J70784m92744k82288
2926.9C29872627j27983j76048L6278J27411J17263O06919N29594M38042M24499L46070
2936.5C32194672Q36334O02608K80189O32706Q64486M74091K90413P60002J112480
2945.2C38047981N98297O4736N43861O80695P41653O60248N23529L96233K13051P87925
2954.8C43258209O40450P72285Q70972M17862K89993L39890P47451L49846N87845Q04863
2964.5C49079666O02493R03550P36541P88460O10352N63125O85654Q67615O25877L47824
2974.1C55811157O25763K47955N97649O75354N25284N47867J83105O06194L26767j76735
$$ plain form
2910.5 347599602 346030312 344915504 343832588 342229462 340690575 338923607 337663689 336416664
2918.2 336416664 335237961 334076042 332805710 331844940 330664177 330476875 330647659 330154915 329872627
2926.9 329872627 329744644 329568596 329604874 329732285 329849548 330456467 330986061 331424103 331848602 332194672
2936.5 332194672 333031006 333633614 333913803 334546509 335410995 335885086 336175499 336935501 338047981
2945.2 338047981 338646278 338711014 339254875 339935570 340677223 341337471 341861000 342257233 342470284 343258209
2954.8 343258209 343898659 344670944 345541916 345959778 346249771 346589661 347337112 347686958 348274803 349079666
2964.5 349079666 349682159 350585709 351322250 352110710 352721062 353284187 353969841 354837456 355463333 355811157
2974.1 355811157 356436920 356684875 357282524 357957878 358483162 359031029 359214134 359820328 360147095 359970360
2983.8C59970360q6785K25907L07159K77786L19443l2463R5291N4932L2425J9607j45645
2994.4C61038017k13470l77159k66991l53165j34315m23546p18956l40271m87175o40068
3004C57082901q75931r98153o83785K6016Q9608o12641r18922m81148l81165j313705
3013.7C50933075o31714j26038r78927r20982o61736l64571m26254p01179q49915o60400
3023.3C44611359o97365j116676q45719p11441n47256l01819k70348r27811j431503
3032C37761421j096153j061668n78919p63435j082077m77906l24630q12798j215744
3040.7C30348091o93664n84984j190224j302757p60651p66945r89952o21948q19473
3049.4C22617493o89392p65267r96361o05239p59316q61168q16898q32463n92823o30264
$$ plain form
2983.8 359970360 359883575 360109482 360416641 360694427 361013870 360981407 361076698 361131630 361164055 361183662 361038017
2994.4 361038017 360824547 360447388 360180397 359827232 359692917 359269371 358550415 358210144 357722969 357082901
3004 357082901 356206970 355208817 354525032 354551048 354640656 354028015 353109093 352627945 352246780 350933075
3013.7 350933075 350301361 350175323 349196396 348275414 347613678 347249107 346822853 346121674 345271759 344611359
3023.3 344611359 343913994 342797318 341951599 341240158 340692902 340391083 340120735 339192924 337761421
3032 337761421 336665268 335603600 335024681 334261246 333179169 332701263 332376633 331563835 330348091
3040.7 330348091 329654427 329069443 327879219 326576462 325815811 325048866 324058914 323436966 322617493
3049.4 322617493 321928101 321162834 320166473 319561234 318801918 317940750 317123852 316291389 315698566 315068302
3059C15068302j478081j319122m70161o13423o63967q98666r12895r24607p77244j34011
3068.6C06876125k28271o34518r53998o45104q27675r95941n14202n21564l70179q32729
3078.3C00351944j277237r21154j41087q3389r51691p04555n87482j074849r70993
3087B93639507o00490p79724q41618k08302k93178r23004j151181p53498n64308n66101
3096.6B86958103p39174j213188o49357j71280m59690p11136r16900r34372o25820
3105.3B80537186n46646p87411n70793o25077q40759j025619q26607j70365m17022
3114B74726887n88665m61502q31509j175518r35383p49702o87123m68673r43318q42304
3123.6B67043190m54903p33032o48079m54941p33814p80029m69799r54628j126423
$$ plain form
3059 315068302 313590221 312271099 311800938 311187515 310523548 309624882 308711987 307787380 307010136 306876125
3068.6 306876125 306647854 306013336 305059338 304414234 303586559 302590618 302076416 301554852 301184673 300351944
3078.3 300351944 299074707 298153553 298012466 297929077 296977386 296272831 295685349 294610500 293639507
3087 293639507 293039017 292259293 291417675 291209373 290916195 289993191 288842010 288088512 287524204 286958103
3096.6 286958103 286218929 285005741 284356384 284185104 283725414 283014278 282097378 281163006 280537186
3105.3 280537186 279990540 279203129 278632336 278007259 277166500 276140881 275314274 275143909 274726887
3114 274726887 274138222 273676720 272845211 271669693 270734310 269984608 269297485 268828812 267885494 267043190
3123.6 267043190 266588287 265855255 265207176 264752235 264018421 263238392 262768593 261813965 260687542
3132.3B60687542p46594o12068o48098q95519p72934q79116o94408l19291m99763p39346
3141.9B53880405r69085q88062q83503q09078n31883m89388q21933p76883p42530q51193
3151.6B46116867m32892r31301p27711k04448o91662q73604r26704l97511o62937q21343
3161.2B39446754l22189p13501j156387j083431n21203o61277m21658m35924r39064
3169.9B33192120n23377q30784q89358o04515m05999n34954q60767p41062p97882l65143
3179.5B26638279o67305q08449l47061p02763q57791r11999n96390k48699n88169r33724
3189.2B19975929o03542m30527n89428o06880j017723o78959j58462l75843o85940
3197.9B14828625q07610q10242q70113m42066j92223m32815p50218l94573k93293q32863
$$ plain form
3132.3 260687542 259940948 259328880 258680782 257785263 257012329 256133213 255438805 255119514 254619751 253880405
3141.9 253880405 252911320 252023258 251139755 250330677 249798794 249309406 248487473 247710590 246968060 246116867
3151.6 246116867 245683975 244752674 244024963 243820515 243128853 242255249 241328545 240931034 240268097 239446754
3161.2 239446754 239124565 238411064 237254677 236171246 235650043 234988766 234567108 234131184 233192120
3169.9 233192120 232668743 231837959 230948601 230344086 229938087 229403133 228542366 227801304 227003422 226638279
3179.5 226638279 225970974 225162525 224815464 224112701 223254910 222342911 221746521 221497822 220909653 219975929
3189.2 219975929 219372387 218941860 218352432 217745552 216727829 216048870 215890408 215514565 214828625
3197.9 214828625 214021015 213210773 212340660 211898594 211706371 211273556 210523338 210128765 209835472 209002609
3207.5B09002609n69286o95629o90346l83739k42844k08740p85618p69882o70109n23873
3217.2B03462543k55889m31862q08029p59602k89936m74796o46401n49450j98440j83888
3226.8A98864250k04315j99738j010551o77071l81336o88305m54788j53427k19288
3235.5A94875431q69980n88608l08418n00660n11703k16141j06506o16093q5716l98121
3245.1A90673485q90827k43531n53112n29346l4008n4932p78007r83963l87249k96975
3254.8A85921535k72426k78416k51961o41670q46653j06525L2100k68840l14102m76666
3264.4A82496376n96466m41189l01514j14250P4120l77979q12931l90091j5183r7580
3274A79423313J4210k2907n30205q05550m07429k24933l54576r6j68399o90403m88396
$$ plain form
3207.5 209002609 208433323 207737694 207047348 206663609 206420765 206212025 205426407 204656525 203986416 203462543
3217.2 203462543 203206654 202774792 201966763 201207161 200917225 200442429 199796028 199246578 199048138 198864250
3226.8 198864250 198659935 198460197 197449646 196772575 196391239 195702934 195248146 195094719 194875431
3235.5 194875431 194005451 193416843 193108425 192607765 192096062 191879921 191773415 191157322 191071606 190673485
3245.1 190673485 189782658 189539127 188986015 188456669 188422661 188367729 187589722 186605759 186218510 185921535
3254.8 185921535 185649109 185370693 185118732 184477062 183630409 183523884 183555984 183287144 182973042 182496376
3264.4 182496376 181899910 181458721 181157207 181042957 181117077 180739098 179926167 179536076 179520893 179423313
3274 179423313 179437523 179414616 178884411 178078861 177671432 177446499 177091923 177091827 176923428 176233025 175744629
3284.7A75744629k33460k16884m9267O123k94953l13167j76697k90718m08535k38743
3294.3A73528328Q8615M1161k82974n97458o22635l94402j85394k20795l54499j64757
3303.9A70835190R6111m6444n75981l41511K26898j74465m25377l1280r2259o16245
3313.6A68854637m62341k16808l07923l52497l65620l61442p97291m41380L12424P9537
3323.2A65941296l94230o69117k95029J6403m01516r90944q51669j97296r6912j37196
3332.9A61923790m21391n39379n0010j16368n47485m45604n29366p05986l39222k44398
3342.5A57984581k67973m25348l27511q01j01862L2654k88649l18108k73466l67050
3352.2A55646467J95961k59981l38097J01738q3427j20182r4433m473m12235p3833
$$ plain form
3284.7 175744629 175511169 175294285 175245018 175251141 174956188 174643021 174466324 174175606 173767071 173528328
3294.3 173528328 173616943 173658104 173375130 172777672 172155037 171760635 171575241 171354446 170999947 170835190
3303.9 170835190 170931301 170884857 170308876 169967365 170194263 170019798 169594421 169563141 169470882 168854637
3313.6 168854637 168392296 168175488 167867565 167515068 167149448 166788006 165990715 165549335 165861759 165941296
3323.2 165941296 165547066 164877949 164582920 164599323 164197807 163206863 162355194 162157898 162060986 161923790
3332.9 161923790 161502399 160963020 160913010 160796642 160249157 159803553 159274187 158568201 158228979 157984581
3342.5 157984581 157716608 157291260 156963749 156962948 156861086 156893740 156605091 156286983 156013517 155646467
3352.2 155646467 155842428 155582447 155244350 155346088 155262661 155142479 155048046 155043573 154631338 154557505
3361.8A54557505N18083l64294o32515L0022l33080o92845N62258J038427j65596p88765
3371.4A53729200n49917q4724R5586q4676Q268J32456J86348J98059k91224k04410
3381.1A53134966M68511L20893k82955m82455j35355J45960L72668L47328j24293l65181
3390.7A53400087M1657N55343r5834l68510J76659K48938j10169m95100M5338L45678
3400.4A53744087J26610K84634L8147p30019n36041N63450L25288n5770M01916N46122
3410A54708424L17239r6025J5449K66695L18165r7589j60837J80149l4914J26810K16102
3420.6A55759668P98283R55896m9753j3599K23388L9778J39513M21438L66621L72353
3430.3A59013586L81823O8702K59123K80085J50795M43096N84259J29108K29550M35200
$$ plain form
3361.8 154557505 155075588 154711294 154078779 154108801 153775721 153082876 153645134 154683561 154517965 153729200
3371.4 153729200 153179283 153094559 153190145 153105469 153113737 153246193 153432541 153630600 153339376 153134966
3381.1 153134966 153603477 153924370 153641415 153158960 153023605 153169565 153542233 153889561 153765268 153400087
3390.7 153400087 153441744 153997087 153901253 153532743 153709402 153958340 153848171 153353071 153398409 153744087
3400.4 153744087 153870697 154155331 154193478 153463459 152927418 153490868 153816156 153760386 154162302 154708424
3410 154708424 155025663 154929638 154945087 155211782 155529947 155432358 155271521 155451670 155416756 155543566 155759668
3420.6 155759668 156557951 157513847 157464094 157450495 157673883 157713661 157853174 158274612 158641233 159013586
3430.3 159013586 159395409 159464111 159723234 160003319 160154114 160597210 161181469 161310577 161540127 161975327
3439.9A61975327J81617P89166M27093n3215J96629M04777R28116L81680N16815N57747
3449.6A66305752J30310K98557J52836N05848Q73184Q45184q6898j44692Q92830O27995
3459.2A70400906M76074N46875O71787M97341L89767M45709K54269O95762L22934N86338
3468.8A75287762J110305N29252N52330N10673P97653R32141N46684Q47187Q10661
3477.5A81924648M59633L03860J28689O62613Q76236L73363P38163N99747O08654R97600
3487.2A87673206N61219Q20884R34201O44016P15656J050816Q82358J13545L61480
3495.8A93757381Q54264R67045J001243Q70896P91969J186581J179504K57320O61526
3504.5B01527729J040306K62299O9980J397057J814480O32534Q71906R05666P97387
$$ plain form
3439.9 161975327 162156944 162946110 163373203 163319988 163516617 163921394 164849510 165231190 165748005 166305752
3449.6 166305752 166436062 166734619 166887455 167393303 168266487 169111671 169024773 168880081 169772911 170400906
3459.2 170400906 170876980 171423855 172095642 172592983 172982750 173428459 173682728 174378490 174701424 175287762
3468.8 175287762 176398067 176927319 177479649 177990322 178787975 179720116 180266800 181113987 181924648
3477.5 181924648 182384281 182688141 182816830 183479443 184355679 184729042 185467205 186066952 186675606 187673206
3487.2 187673206 188234425 189055309 189989510 190633526 191349182 192399998 193282356 193395901 193757381
3495.8 193757381 194611645 195578690 196579933 197450829 198242798 199429379 200608883 200866203 201527729
3504.5 201527729 202568035 202830334 202900314 204297371 206111851 206744385 207616291 208521957 209319344
3513.2B09319344O15482M14848O78940Q09879J204300O35700O42014J258507J657142
3521.9B17236156J547738N04551P78198Q64963R89914R05895P44458Q88595J166020
3530.6B25626488J462421P93553J216735J081276J563092J724491J84860J082592J153412
3539.2B35888920J106243J075916J140061J595001J482887J635494Q68416J189099
3547B45982037O03256J393547J859188J426144K175235K81468J285000J956195J818314
3555.6B58780384J947384O70109J796169J673679J442509R25312J798821J823673P25288
3564.3B71583328L826390J962509J168003P51056p90939L155327K395134J863346J669140
3573B87583294J738243J750984J693821K471829J117057K182122J795120R42898J870289
$$ plain form
3513.2 209319344 209934826 210349674 211028614 211838493 213042793 213678493 214320507 215579014 217236156
3521.9 217236156 218783894 219288445 220066643 220931606 221921520 222827415 223571873 224460468 225626488
3530.6 225626488 227088909 227882462 229099197 230180473 231743565 233468056 233652916 234735508 235888920
3539.2 235888920 236995163 238071079 239211140 240806141 242289028 243924522 244792938 245982037
3547 245982037 246585293 247978840 249838028 251264172 253439407 253720875 255005875 256962070 258780384
3555.6 258780384 260727768 261397877 263194046 264867725 266310234 267235546 269034367 270858040 271583328
3564.3 271583328 275409718 277372227 278540230 279291286 278500347 281655674 284050808 285914154 287583294
3573 287583294 289321537 291072521 292766342 295238171 296355228 298537350 300332470 301275368 303145657
3581.7C03145657K157764K230186J828900M416714L122501o59790R93614K97680K460995
3590.4C19994221K814960L165016J868859J153412L596458J266937K649346L065643
3598.1C39574852O37703K888832K113686J438064L107033K623558K207565L141060
3605.8C57732353L088799K52189L331795J680107K83013O953239K616653r15832M758377
3614.5C79780693M79813L700409M971428J567726K945480M88205J350632L349456L531762
3623.1D02165604L160019L122100L224488L550071P378693K691536q181152L579406
3630.9D20690765N086365N690613L109589M49409L272553L979797L429909K102203
3638.6D47811203K285538L168411L469391K389603J638412L377762M909553O542473
$$ plain form
3581.7 303145657 305303421 307533607 309362507 313779221 316901722 316241932 317235546 317533226 319994221
3590.4 319994221 322809181 325974197 327843056 328996468 332592926 333859863 336509209 339574852
3598.1 339574852 340212555 343101387 345215073 346653137 349760170 352383728 354591293 357732353
3605.8 357732353 360821152 361073341 364405136 366085243 366368256 373321495 375938148 375022316 379780693
3614.5 379780693 380260506 383960915 388932343 390500069 393445549 393933754 395284386 398633842 402165604
3623.1 402165604 405325623 408447723 411672211 415222282 422600975 425292511 417111359 420690765
3630.9 420690765 425777130 431467743 434577332 435026741 438299294 442279091 445709000 447811203
3638.6 447811203 450096741 453265152 456734543 459124146 460762558 464140320 469049873 475592346
3646.3D75592346N50308k012024O040154J997910p05262j61972N294457N821724N136642
3655D97554283N856819o253280J407814O305847K420578K117615J139526K983704K520637
3663.6E16053543J999779K434616J336670N066910L722419P36695J416282o964759
3671.4E25802155K345695Q613548J0012398L296890j6930847J865769Q076133N197068
3679.1E48278809k514229m76074L381347K116280J649551J342049J792869N187073
3686.8E60757675P389221q612518n348167R617538l971786j617241N662040J303139
3694.5E65179901J843987N98755l27454J400299Q60443K917557L662987m573441l577347
3703.2E67985687M383316K084275J034126J480484K469177M168778p160912L880997
$$ plain form
3646.3 475592346 476142654 474130630 480170784 482168694 481463432 481301460 486595917 492417641 497554283
3655 497554283 503411102 497157822 498565636 504871483 507292061 509409676 510549202 513532906 516053543
3663.6 516053543 518053322 520487938 521824608 526891518 530613937 531350632 532766914 525802155
3671.4 525802155 528147850 536761398 546773796 550070686 533139839 535005608 543081741 548278809
3679.1 548278809 545764580 545288506 548669853 550786133 552435684 553777733 555570602 560757675
3686.8 560757675 568146896 559534378 554186211 563803749 559831963 558214722 563876762 565179901
3694.5 565179901 567023888 567622643 567295189 568695488 569555931 572473488 576136475 571563034 567985687
3703.2 567985687 572369003 574453278 575487404 576967888 579437065 583605843 576444931 580325928
3710.9E80325928P225609j3510247K455063M174309L66096O20995K217484J999168
3718.6E85874405l204613P48673O703491j682015n252609M413757J674233j67198l314018
3727.3E85794106o51055M239502N74074M942818k170678p064323J0162926K859306
3735E98686676q088455r28345R86405O1035K740059L736152m394531J980400J2531548
3743.7F07310944o742134k0456849R145432O514206O517906k099075j1886788J0834351
3751.4E99137993j930542p516518N150566M503746L819733n781059J275940O645813
3759.1F05305672o652146l134613L720627J635819L70521L926430k334519m844512
3766.8E97993279M070205O015778P64045j0139999J209641L576965M33884O84433r95636
$$ plain form
3710.9 580325928 587551537 574041290 576496353 580670662 581036758 581657753 583875237 585874405
3718.6 585874405 582669792 583418465 590121956 588439941 583187332 587601089 589275322 589108124 585794106
3727.3 585794106 585143051 589382553 589956627 594899445 592728767 585664444 595827370 598686676
3735 598686676 590598221 589669876 590656281 590717316 593457375 597193527 592798996 594779396 607310944
3743.7 607310944 600568810 580111961 589257393 595771599 602289505 600190430 588303642 599137993
3751.4 599137993 597207451 589690933 594841499 599345245 603164978 597383919 598659859 605305672
3759.1 605305672 598653526 595518913 599239540 600875359 601245880 605172310 602837791 597993279
3766.8 597993279 602063484 608079262 608843307 598703308 599912949 603489914 603923798 604608231 603612595
3775.5F03612595J240463J465378L094368O22291q385200J138992K078705Q54187K732506
3784.2F08454285k058030j742935R97887Q78181N54581k33726J44958n80330K51808
3792.9F06666679M44565J081886L968773k939186m744720J709785L555718P222519
3800.6F16966019m496003j2244606K843171K779693N069123O321144p887001n443192
3808.3F03908348M153404K133942K02560J46981k73018R56421N500755Q24165j5527420
3817F02026138L471985P099037M931298L732681j6514855j081008M881591J772995
3824.7F10319862K982674M15955m332238k56424J191140K992096L447074q305015J121673
3833.4F09576797Q575364n451546k084465Q994598o941528n885239P635117n493927
$$ plain form
3775.5 603612595 604853058 606318436 609412804 610035095 601649895 602788887 604867592 605721779 608454285
3784.2 608454285 606396255 604653320 605651207 606529388 607083969 606850243 606995201 606414871 606666679
3792.9 606666679 607111244 608193130 612161903 609222717 604477997 606187782 609743500 616966019
3800.6 616966019 612470016 600225410 603068581 605848274 610917397 617238541 609351540 603908348
3808.3 603908348 608061752 610195694 610398254 610545235 610272217 611228638 616729393 617553558 602026138
3817 602026138 605498123 612597160 617528458 621261139 604746284 603665276 608546867 610319862
3824.7 610319862 613302536 613718491 609386253 609129829 610320969 613313065 616760139 608455124 609576797
3833.4 609576797 618152161 612700615 610616150 619610748 612669220 606783981 614419098 608925171
3841.1F08925171j422653P859840j593933m759483K364959J619263k75955J283035
3848.8F14000244o36330K219239O694984n174484K535629j4767074k800255J1304550
3856.5F13376503n88799k931022K212486K659645K720032n909805N3939P490235n643501
3865.2F13439713o438370M023666N408287P412071p473831j2660866L986245O605568
3872.9F14302483M959068r581566r13238M706535j63613K027131M980545m222145q243676
3881.6F07851524N093422J560517L88908N408325j2107277l94592M334297J187935
3889.3F13323059M869232j07689q617515M91485L543549j490212O90232J017837K540779
3898F16260757K836266j0785789M790878L341980o494446M714432j934014j776619
$$ plain form
3841.1 608925171 607502518 615362358 613768425 609008942 611373901 612993164 612717209 614000244
3848.8 614000244 613363914 615583153 622278137 617103653 619639282 604872208 602071953 613376503
3856.5 613376503 612787704 609856682 612069168 614728813 617448845 611539040 611592979 619083214 613439713
3865.2 613439713 607001343 611025009 616433296 623845367 616371536 603710670 607696915 614302483
3872.9 614302483 619261551 609679985 608766747 613473282 613309669 615336800 620317345 616095200 607851524
3881.6 607851524 612944946 614505463 614894371 620302696 608195419 607800827 612135124 613323059
3889.3 613323059 618192291 618084602 609467087 609958572 613502121 612011909 612702141 613719978 616260757
3898 616260757 619097023 608311234 613102112 616444092 609949646 614664078 612730064 610953445
3905.7F10953445k57225J86387K155227K11754L22914n24635M22287o3629p81632J605606
3915.3F14230499K604904k826080m572143M172782R60846m155769K196770K052192
3923.1F14664001N95818j348000k704086O56395J130791M63371j314163l67928J992264
3931.7F13768463k117882j534690J861228L15400L47366N35126o80886m79278j86463
3940.4F11828384J854668J957436l888626j192131J429367L12233J213035j817894
3948.1F11696472O32401Q43200k685318J503487j15585q27713R60083O49376O34079
3956.8F13290482r52034J57966l70254J3199L82652j687355J31988Q01392M38919M58527
3966.5F12665482J46064n26504r92546m16146K72942J77689p83921J80168L03536l30467
$$ plain form
3905.7 610953445 610696220 610882607 613037834 613249588 613572502 613047867 613470154 613406525 612624893 614230499
3915.3 614230499 616835403 614009323 609437180 613609962 614570808 610415039 612611809 614664001
3923.1 614664001 615259819 613911819 611207733 611864128 612994919 613458290 612144127 611776199 613768463
3931.7 613768463 611650581 610115891 611977119 612292519 612639885 613175011 612494125 612014847 611828384
3940.4 611828384 613683052 615640488 611751862 610559731 611989098 612301331 613514366 611696472
3948.1 611696472 612328873 613172073 610486755 611990242 611874657 611046944 612007027 612656403 613290482
3956.8 613290482 612338448 612496414 612126160 612139359 612522011 610834656 610966644 611768036 612206955 612665482
3966.5 612665482 612811546 612285042 611292496 610876350 611149292 611326981 610543060 610723228 611026764 610696297
3976.1F10696297J67923O40068M38728l00102L90358J01547n87120m39758O06765Q35991
3985.7F12550697n47142n36308o09322M04664Q10394K02713m2610m32816Q5907o13670
3995.4F11272507j44310K3842m79393K64854P37801
4000.2F11675301
$$ plain form
3976.1 610696297 610864220 611504288 611943016 611642914 612033272 612134819 611547699 611107941 611714706 612550697
3985.7 612550697 612003555 611467247 610857925 611262589 612072983 612275696 612233086 611800270 611886177 611272507
3995.4 611272507 611128197 611152039 610672646 610937500 611675301
4000.2 611675301
##END=$$ End of the data block
