##TITLE=$$ Begin of the data block
##JCAMP-DX=5.00 $$ ACD/SpecManager v 10.08
##SPECTROMETER/DATA SYSTEM=Varian
##DATE=15 Jan 2013 10:20:36
##DATA TYPE=INFRARED SPECTRUM
##DATA CLASS=XYDATA
##ORIGIN=
##OWNER=
##NPOINTS=3735
##FIRSTX=399.26403809
##LASTX=4000.35498047
##MAXX=4000.35498047
##MINX=399.26403809
##MAXY=67.62628937
##MINY=15.37631989
##XFACTOR=1.0000000000
##YFACTOR=0.000000100000000
##FIRSTY=36.63840866
##DELTAX=0.96440572
##XUNITS=1/CM
##YUNITS=TRANSMITTANCE
##XYDATA=(X++(Y..Y))
399.3C66384087k311058J378555p253952n559464L766213K751350p57141o284561j306343
407.9C50807686O022796K891312J901016m039154l683014R57718l74222j133461l158340
416.6C50192337k661247L936386K610054n220337k986603n129165k938271O106224
424.3C43909378O498680J551972K115135K77290l254433l552322n118942Q41675K765274
433C46033707K601509J451874m771157n52444J403656K210464Q76236j49231L695526
441.7C52800140j839752r69620k114105k870559L126258K495919k868271j850090O474151
450.4C52384071L39203n943184k373390j816635J324654J60904O45713Q27942p2174
459.1C45477104j100120o179352J515465N745124l521843n294113J988640R15413j218491
$$ y = [366384087, 364073029, 365451584, 358197632, 352638168, 356404381, 359155731, 358398590, 352114029, 350807686, 356830482, 359721794, 361622810, 357583656, 353900642, 354858360, 354484138, 353350677, 350192337, 347531090, 351467476, 354077530, 348857193, 345870590, 340741425, 337803154, 343909378, 350408058, 351960030, 354075165, 354352455, 351098022, 347545700, 342426758, 343268433, 346033707, 348635216, 350087090, 345315933, 344763489, 346167145, 348377609, 349253845, 349104614, 352800140, 350960388, 349990768, 347876663, 345006104, 348132362, 350628281, 347760010, 345909920, 352384071, 352723274, 346780090, 344406700, 342590065, 343914719, 344075623, 344721336, 345549278, 345477104, 344376984, 338197632, 339713097, 345458221, 341936378, 336642265, 338630905, 339546318, 338327827]
467.7C38327827m01496l253670K29149J275444n59426J739350P85827j678428m005585
476.4C32458992j571503K483101m01192l787651J540108Q72231k612877L29971J096077
485.1C30407257o0577l001747k14882M214325M60167l863640l423500L87420J263581
493.8C26168404j85585j443520n94635Q68645J134262p22275r31816O84433j804466
502.5C23173447r1439N72968q08487K46277k80876J835975J677780k243881m716244
511.1C19365520k633514R06296o36940k587414j327152K542019K529983j315632j864910
519.8C14978256r59911N57175J600837m7569j065559r86557l055020p91378R14231
528.5C11144505l22972J153183N32742j862679j678715k53448P06291J63937j187382
$$ y = [338327827, 337926331, 334672661, 334901810, 336177254, 335617828, 337357178, 338143005, 336464577, 332458992, 330887489, 333370590, 332969398, 329181747, 330721855, 331594086, 328981209, 329311180, 330407257, 330346680, 327344933, 327130051, 331344376, 331804543, 327940903, 324517403, 324904823, 326168404, 325982819, 324539299, 323944664, 324813309, 325947571, 325225296, 324293480, 324977913, 323173447, 323082008, 323654976, 322846489, 323092766, 322811890, 324647865, 326325645, 324081764, 319365520, 316732006, 317638302, 317001362, 314413948, 313086796, 315628815, 318158798, 316843166, 314978256, 314018345, 314575520, 316176357, 316128788, 315063229, 314076672, 311021652, 310230274, 311144505, 310821533, 311974716, 312507458, 310644779, 308966064, 308712616, 309418907, 309582844, 308395462]
537.2C08395462k33612J562519N05848l39947j323757o33011O22826j107693j272640
545.9C06175995p94850K20280r3460k015953k243633l74165K449856P65667j143265
554.5C02946472q29010j833191r80758L72886o66942q02842L52002n42393K62813K128926
564.2C00407963J060638j243305j249981Q07743K5711p06825M20647r156j499538o18382
573.8B97395515Q38318N33295J531525J09234k109662k182159j458359K82898O66733
582.5B95607338R01909R51328Q3161p67842J25828P43675j19877J56918J10283P82776
592.1B98575497J4782q72479J207237J922436L33367k72847P82032q38756j952210
600.8B98899059J46065J269589N77812j602612j110439r23863j772270l01304P553
$$ y = [308395462, 308161850, 309724369, 310230217, 309890270, 308566513, 307933502, 308556328, 307448635, 306175995, 305381145, 305601425, 305507965, 303492012, 301248379, 300874214, 303324070, 304089737, 302946472, 302117462, 300284271, 299303513, 299676399, 299009457, 298206615, 298558617, 298016224, 298279037, 300407963, 301468601, 300225296, 298975315, 299783058, 299808769, 299101944, 299522591, 299513435, 298013897, 297395515, 298233833, 298767128, 300298653, 300407887, 298298225, 296116066, 294657707, 294940605, 295607338, 296509247, 297460575, 297543736, 296775894, 296901722, 297645397, 297525520, 297682438, 297792721, 298575497, 298590279, 297717800, 298925037, 300847473, 301180840, 300907993, 301690025, 300851269, 298899059, 299045124, 300314713, 300892525, 299289913, 298179474, 297255611, 295483341, 295182037, 295189590]
609.5B95189590K29588j2341j506671j103421J85852l69854o66122j92661j450J04885
619.2B91857395o75335R003P18002J025582J104393J45130N54161Q37097J573372K756824
628.8B99905624K158623P13959L88203J051120J727600J635209L01284M54922J772137
637.5C10108681K119999J530189J316357K076969J304302l93791J74618J261635K45227
646.2C19744186O79818K159500J148567R21097J746826R42383n64766m18053O19354
654.8C26978912k69661j070518N13801J155129l67012l95851J71966q73489m51012
663.5C25392265K69013p20444p80640j89209O73371J542015J792641J081619J100120
672.2C30160751J268769q3199Q12111O06575k01454J783562J392059J3809J037293
$$ y = [295189590, 295419178, 295406837, 293900166, 292796745, 292982597, 292612743, 291946621, 291753960, 291752510, 291857395, 291182060, 291191063, 291909065, 292934647, 294039040, 294184170, 294738331, 295575428, 297148800, 299905624, 302064247, 302778206, 303166409, 304217529, 305945129, 307580338, 307881622, 308336544, 310108681, 312228680, 313758869, 315075226, 317152195, 318456497, 318062706, 318237324, 319498959, 319744186, 320424004, 322583504, 323732071, 324653168, 326399994, 327342377, 326777611, 326359558, 326978912, 326709251, 325638733, 326152534, 327307663, 326940651, 326544800, 326716766, 325843277, 325392265, 325661278, 324940834, 324160194, 323970985, 324644356, 326186371, 327979012, 329060631, 330160751, 331429520, 331346321, 332158432, 332765007, 332563553, 334347115, 335739174, 335752983, 336790276]
680.9C36790276J784935J460228J764869J516686J029167J586990J043244R15374M24881
689.6C48316650m5089J049843O73446O36788J243591J395378J236534J061554P32155
698.2C56300850o30760l25508N70945J009713R50126M01535J147957J053124K61001
706.9C60738983O08368J414299J316719R46884Q54721M51966N48973Q01620J207009
715.6C68889542M15268o19622N90935J521683L88412j71165R07745P89223P04841J153107
725.2C74569969P16286N95245R63059J525039J907158J589623M33540P22580J072846
733.9C84095345P32345J069870k30141l9405R46960N44167N69114M05693O87600J018104
743.6C89799652M51126J86386J000061N54657R53980J860122J06202m52462O43120
$$ y = [336790276, 338575211, 340035439, 341800308, 343316994, 344346161, 345933151, 346976395, 347891769, 348316650, 348271561, 349321404, 349994850, 350631638, 351875229, 353270607, 354507141, 355568695, 356300850, 355670090, 355344582, 355915527, 356925240, 357875366, 358276901, 359424858, 360477982, 360738983, 361347351, 362761650, 364078369, 365025253, 365879974, 366331940, 366880913, 367682533, 368889542, 369304810, 368685188, 369276123, 370797806, 371186218, 371015053, 371922798, 372712021, 373416862, 374569969, 375286255, 375881500, 376844559, 378369598, 380276756, 381866379, 382299919, 383022499, 384095345, 384827690, 385897560, 385667419, 385628014, 386574974, 387119141, 387688255, 388093948, 388781548, 389799652, 390250778, 390437164, 391437225, 391991882, 392945862, 394805984, 394912186, 394459724, 395102844]
752.2C95102844J560784P33413N23453J180420Q69064Q73566M91028J709137J409759
760.9D04453468R49936J914978O85997O43883J329155J135559L89366J438179Q83026
769.6D13823547j168861O8245K62489j08299p99446l26729M55971K69737P37953l44047
779.2D12870560k95754J71852Q47016O25496n80101k01645L59726J271057Q99887P12585
788.9D16680679K5482j42974Q89625O73294L78418o65207l15017j060181j452179p36580
798.5D14275360j666489r78431o13709j173782j640625j027489j134529k029800k236328
807.2D01774178k283287j146508j528015j917534k239494j962166r51691j637840j164780
815.9C86942863r09538q19435p13921k06375R82590R2354J36032J437302J789169K132111
$$ y = [395102844, 396663628, 397397041, 397920494, 399100914, 399969978, 400843544, 401334572, 403043709, 404453468, 405403404, 407318382, 408004379, 408648262, 409977417, 411112976, 411502342, 412940521, 413823547, 412654686, 412722931, 412985420, 412877121, 412077675, 411750946, 412206917, 412476654, 413214607, 412870560, 412574806, 412746658, 413593674, 414219170, 413639069, 413437424, 413797150, 415068207, 415968094, 416680679, 416706161, 416563187, 417452812, 418126106, 418504524, 417839317, 417524300, 416464119, 415011940, 414275360, 412608871, 411630440, 411016731, 409842949, 408202324, 407174835, 406040306, 404010506, 401774178, 399490891, 398344383, 396816368, 394898834, 392659340, 390697174, 389745483, 388107643, 386942863, 386033325, 385213890, 384499969, 384293594, 385276184, 385368538, 385504570, 386941872, 388731041, 390863152]
825.5C90863152L614349L818893L010292L746949L936004L259774K058372K857437
833.3D17165222L476105K774582K628250K409668K931557K227325K453117K384568
841D38450394K393493J859398L75366J661797J746635K333413J744842O12335R12781
849.6D52090454J590309L023453J722107Q72116Q82797K233124J354179K09008K947387
858.3D66924934K226830J370811R81827M35982P80792J013451O98623k95372o46667
867D73491211n25627N13153j173973j365776o86684j108055j108818k461395j398468
875.7D64175568j730576r50317j05973j312179j039925j987266j351548o93626l66783
884.4D54637375n28336l95355l23257j198349o10466j564637m60739l73459j159362
$$ y = [390863152, 394477501, 398296394, 401306686, 405053635, 408989639, 412249413, 414307785, 417165222, 420641327, 423415909, 426044159, 428453827, 431385384, 433612709, 436065826, 438450394, 440843887, 442703285, 443078651, 444740448, 446487083, 448820496, 450565338, 451177673, 452090454, 453680763, 456704216, 458426323, 459298439, 460181236, 462414360, 463768539, 463977547, 466924934, 469151764, 470522575, 471504402, 471940384, 472721176, 473734627, 474433250, 474137878, 473491211, 472965584, 473478737, 472304764, 470938988, 470252304, 469144249, 468035431, 465574036, 464175568, 462444992, 461494675, 461388702, 460076523, 459036598, 457049332, 455697784, 455004158, 454637375, 454109039, 453713684, 453390427, 452192078, 451581612, 450016975, 449556236, 449182777, 448023415]
893D48023415L51066L11432N74455J27716L70217J29928m00085l04108j168480p94830
902.7D47220726L24631J311607J537132K621231K098465J903267K809067J659279J590424
911.4D63075829l89634q65860j33628j341439j915970j855049j565056k733039k936669
920D49339485l355064l548470l306618l166351k796135l965263l882866l520927l285256
928.7D18512535l560371l500634k445640k596474k554970k362518j380424p49436r17091
937.4C98444977j081963j153526r54475j693802j214142q05969j385498j133614k82402
946.1C88739586j2055k4185O48270R7580m27323j038513o62689M9362j605682j794090
955.7C83970261j380844j325112k098694k980919k353935k126160k369728k505912
$$ y = [448023415, 448374481, 448685913, 449260368, 449388084, 449758301, 449888229, 449488144, 449184036, 448015556, 447220726, 447545357, 448856964, 450394096, 453015327, 455113792, 457017059, 459826126, 461485405, 463075829, 462686195, 461820335, 461686707, 460345268, 458429298, 456574249, 455009193, 452276154, 449339485, 445984421, 442435951, 439129333, 435962982, 433166847, 429201584, 425318718, 421797791, 418512535, 414952164, 411451530, 409005890, 406409416, 403854446, 401491928, 400111504, 399362068, 398444977, 397363014, 396209488, 395255013, 393561211, 392347069, 391541100, 390155602, 389021988, 388739586, 388727531, 388703346, 389351616, 389449196, 389021873, 387983360, 387320671, 387370033, 385764351, 383970261, 382589417, 381264305, 379165611, 376184692, 373830757, 371704597, 369334869, 366828957]
963.4C66828957j571770j761971k300796j908684k488251k411041j923561k227135
971.2C50235748k863159k625503k760010l843994m069519l744889l626671m223938
978.9C22478065m428863m651222n274945m859294m901638n277710m495011m771766
986.6B83817616n620499n523796m723358m009648l936558l512764l565330k746544
994.3B50179119k527771k876968k950688l761158k861900k684460k585449k623958
1002B27306767k676964j811314k101383j818619j903744j437244j248474j747780j897659
1010.7B10663586j779404j442089k063751j718617j849136j722202k103730k181568
1018.4A95803089j335716k111263k240143k684288j318970j508236k411728j445331
$$ y = [366828957, 365257187, 363495216, 361194420, 359285736, 356797485, 354386444, 352462883, 350235748, 347372589, 344747086, 341987076, 338143082, 334073563, 330328674, 326702003, 322478065, 318049202, 313397980, 308123035, 303263741, 298362103, 293084393, 288589382, 283817616, 278197117, 272673321, 267949963, 263940315, 260003757, 256490993, 252925663, 250179119, 247651348, 244774380, 241823692, 238062534, 235200634, 232516174, 229930725, 227306767, 224629803, 222818489, 220717106, 218898487, 216994743, 215557499, 214309025, 212561245, 210663586, 208884182, 207442093, 205378342, 203659725, 201810589, 200088387, 197984657, 195803089, 194467373, 192356110, 190115967, 187431679, 186112709, 184604473, 182192745, 180747414]
1026.1A80747414j449795l45860j178856j104011j054497p75223L6850j027336n41687
1034.8A73306999k24190J260376J103020J548824K161217R17492J729508J116161R16424
1043.5A83835831N41248j42021q54244j007100l80897o80008k8667j058407j614571
1052.2A78611164j715946n71385m1942j488152p48443p57981M41342M68979O23531
1060.9A74821167J461716J618099K429066J642303J764870J444492K142449J648197
1068.6A88972359J191692J303291m0588R20010P42588J216488J036586N45998Q8272
1077.2A95976696m08154Q72841O08712J625709J091709P96738M05178n6896J353092
1085.9B02265625J115589K042942R09805J140328J825848J002616J405430J125222
$$ y = [180747414, 179297619, 178951759, 177772903, 176668892, 175614395, 174839172, 174876022, 173848686, 173306999, 173082809, 174343185, 175446205, 176995029, 179156246, 180073738, 181803246, 182919407, 183835831, 184377079, 184235058, 183380814, 182373714, 181992817, 181312809, 181284142, 180225735, 178611164, 176895218, 176323833, 176281891, 174793739, 174045296, 173287315, 173728657, 174197636, 174821167, 176282883, 177900982, 180330048, 181972351, 183737221, 185181713, 187324162, 188972359, 190164051, 191467342, 191426754, 192346764, 193089352, 194305840, 195342426, 195888424, 195976696, 195568542, 196441383, 197050095, 198675804, 199767513, 200564251, 200969429, 200912533, 202265625, 203381214, 205424156, 206333961, 207474289, 209300137, 210302753, 211708183, 212833405]
1093.6B12833405J666221J238613J566906O80733P68433J901455J364555J190052j99547
1102.3B23010826J623821K095032J515827J675339M36420J487732J171132K12764J09883
1111B33338776J025657J130829P83692J283645O91605R25083O51722M54006o52885
1119.7B39632130o57711N35831k75803k83451l0136P45182M42448J291580K132034
1128.4B43532104J479664K354470J853485J840725J512623J675910K637482K423821
1136.1B59310284K002620J867047K911663K589378K084713J423416P00264P26814O04229
1144.8B74220428R59702K27909j7185O92310O84509J96629M74014N15557K7294N77373
1154.4B78558540n81512j309719n65510p66487j008072o43196n05333j215706J48697
$$ y = [212833405, 214499626, 215738239, 217305145, 217985878, 218754311, 220655766, 222020321, 223210373, 223010826, 224634647, 226729679, 228245506, 229920845, 230357265, 231844997, 233016129, 233228893, 233338776, 234364433, 235495262, 236278954, 237562599, 238254204, 239179287, 239831009, 240285015, 239632130, 238974419, 239510250, 239234447, 238950996, 238920860, 239666042, 240108490, 241400070, 243532104, 245011768, 247366238, 249219723, 251060448, 252573071, 254248981, 256886463, 259310284, 261312904, 263179951, 266091614, 268680992, 270765705, 272189121, 272889385, 273616199, 274220428, 275180130, 275408039, 275390854, 276083164, 276767673, 276964302, 277438316, 277953873, 277981167, 278558540, 277977028, 276667309, 276101799, 275335312, 274327240, 273684044, 273178711, 271963005, 272111702]
1163.1B72111702J310902J498699J880302J461468J784248J974926K344246K354393
1170.8B86720886K953511L396072L024597L128758L084774L196926K944851L219738
1178.5C11670113K381439J685257K406597K340107J969490J913834K224464J946678
1186.2C28537979J741829J205902Q54302R36431K48642k38647j82762R6245o85044
1194.9C32514877j283493o37207m91867n36461n12809j300850j909180j221886q00743
1203.6C23820381r27238q76198j139221j144657q64888n28087j09845K06261r7465
1212.3C18339043o44760l14541m95186o01311k39887n47314o39019m18033k13051k70691
1221.9C13955250l80402n55191r16023j053848q10719p98855j271095q89893o42414
$$ y = [272111702, 273422604, 274921303, 276801605, 278263073, 280047321, 282022247, 284366493, 286720886, 289674397, 293070469, 296095066, 299223824, 302308598, 305505524, 308450375, 311670113, 314051552, 315736809, 318143406, 320483513, 322453003, 324366837, 326591301, 328537979, 330279808, 331485710, 332340012, 333276443, 333525085, 333286438, 333103676, 333199921, 332514877, 331231384, 330594177, 330102310, 329565849, 329053040, 327752190, 325843010, 324621124, 323820381, 322893143, 322016945, 320877724, 319733067, 318868179, 318340092, 318230247, 318436508, 318339043, 317694283, 317379742, 316884556, 316283245, 316043358, 315496044, 314857025, 314438992, 314225941, 313955250, 313574848, 313019657, 312103634, 311049786, 310239067, 309440212, 308169117, 307279224, 306636810]
1230.6C06636810q50315p76329j019649p38888l86009l93486n47905m30832m32644
1239.3C01060753k38342M31633j35613n88856q67576o50101j31645l10574l24669q78486
1248.9B97366524m86756L1186j965N6000j78681k14710n13973j48812r2315j6747r5405
1259.5B95704346m16451M94175M55017J84593K8763K23351O81515Q32691J088695Q87356
1269.2C00164051P77187N33925P79685Q97828Q67004J100044J137638J305561R94854
1277.8C08557777R62181R44176Q39443Q75645J321640J845989J505242J480255J594009
1286.5C19926357J521511J353073J133042Q44536J020202J123009P79266Q47702Q20656
1295.2C29369354R50241Q86841P17316O71120M43916J27220J61667N34706K04430k37275
$$ y = [306636810, 305786495, 305010166, 303990517, 303251629, 302865620, 302472134, 301924229, 301493397, 301060753, 300822411, 301254044, 301118431, 300529575, 299661999, 299011898, 298880253, 298569679, 298245010, 297366524, 296879768, 296910954, 296908989, 296964989, 296786308, 296571598, 296057625, 295908813, 295816498, 295799751, 295704346, 295287895, 295782070, 296237087, 296421680, 296450443, 296673794, 297355309, 298188000, 299276695, 300164051, 300941238, 301475163, 302254848, 303152676, 304019680, 305119724, 306257362, 307562923, 308557777, 309519958, 310464134, 311303577, 312179222, 313500862, 315346851, 316852093, 318332348, 319926357, 321447868, 322800941, 323933983, 324778519, 325798721, 326921730, 327700996, 328548698, 329369354, 330319595, 331206436, 331923752, 332594872, 333038788, 333166008, 333327675, 333862381, 334066811, 333829536]
1304.8C33829536n29403j58081L30734N2834m46854o90842m38423o26221n39283l17955
1314.5C30466042n37262n53246k34909N71136J127587J467399J200600O38771N28107
1323.2C34674225O92978O60362K64091M22898M20265M14543M3144m30030n57099n97992
1332.8C36007385n7792o8207k00043p65915l82423N24215J0949L48014O91872J253586
1342.4C37361641J259651Q64792J100998Q93402N29366k96326J84479M94156J83677
1351.1C42575836l47824o89201j51062l28217R5673r2507k04086n68275p96357q62503
1360.8C38631477j577682m41742k73552N31540K18429j107826o76994n88379j97983
1369.4C34517288m57916n49736l57552L72467M68140j011887R16J96037J38626n70945
$$ y = [333829536, 333300133, 333142052, 333472786, 333525620, 333078766, 332387924, 331949501, 331323280, 330783997, 330466042, 329928780, 329375534, 329140625, 329711761, 330839348, 332306747, 333507347, 334146118, 334674225, 335367203, 336027565, 336291656, 336714554, 337134819, 337549362, 337592506, 337162476, 336605377, 336007385, 335949593, 335881386, 335681343, 334915428, 334533005, 335057220, 335068169, 335416183, 336108055, 337361641, 338621292, 339486084, 340587082, 341480484, 342009850, 341713524, 341898003, 342392159, 342575836, 342228012, 341538811, 341387749, 341059532, 341155205, 341062698, 340858612, 340290337, 339493980, 338631477, 337053795, 336612053, 336338501, 336870041, 337088470, 335980644, 335303650, 334715271, 334517288, 334059372, 333509636, 333152084, 333524551, 333992691, 332980804, 332981720, 333177757, 333316383, 332745438]
1379.1C32745438l87535l04604j059723r53598j797295j477928j440544j355743j993370
1387.8C21975098j617051l95660j719627k054997k081203j678753k597942l868104
1395.5C05961761j770877j818123j339932l204803l069000j455822k068272j536846
1403.2B89698086j861229l077870k692852j451320j432190j930542j429749j659260
1410.9B74163074j377296j340713j190377j011696j377372p34101q03413L72562j295852
1419.6B65404816j067753Q92868K90985J144848j67771K96193Q11309N13306J170387
1428.3B69289188N45330J612587J068249J838684J785050J414051K364731J729412
1436B81647282J925640J060562K845344K278748J926861K077274J338043K256813J254483
$$ y = [332745438, 332357903, 332053299, 330993576, 330039978, 328242683, 326764755, 325324211, 323968468, 321975098, 320358047, 319962387, 318242760, 316187763, 314106560, 312427807, 309829865, 305961761, 304190884, 302372761, 301032829, 297828026, 294759026, 293303204, 291234932, 289698086, 287836857, 284758987, 282066135, 280614815, 279182625, 277252083, 275822334, 274163074, 272785778, 271445065, 270254688, 269242992, 267865620, 267131519, 266328106, 266700668, 265404816, 264337063, 265229931, 265520916, 266665764, 266497993, 266794186, 267605495, 268118801, 269289188, 269834518, 271447105, 272515354, 274354038, 276139088, 277553139, 279917870, 281647282, 283572922, 284633484, 287478828, 289757576, 291684437, 293761711, 295099754, 297356567, 298611050]
1444.7B98611050J986999J608238J525307J935902J485290K283764J104355K036247
1452.4C12577152J747647K131939K064743Q59165J192093l34092M321137K094841K574043
1461.1C29228668K299881J827240K549668P62939K937965K216187K532158K355079
1468.8C46709785K881165L673096J769027L401833K616692L347511L095703K298622
1476.5C69793434K957535K616310K651253K322159K302131J684189J860161J791801
1484.2C87978973J324196J925392J151009J015892K341652O25000j570473j44348K74735
1492.9C94922028q68493j081504m38424m443130l88031r89151l045845l12500j309891
1501.6C82045059j532440r91898Q0262p61185m166183k594376j77078P87124n19561
$$ y = [298611050, 300598049, 302206287, 303731594, 305667496, 307152786, 309436550, 310540905, 312577152, 314324799, 316456738, 318521481, 319380646, 320572739, 320238647, 324559784, 326654625, 329228668, 331528549, 333355789, 335905457, 336668396, 339606361, 341822548, 344354706, 346709785, 349590950, 353264046, 355033073, 358434906, 361051598, 364399109, 367494812, 369793434, 372750969, 375367279, 378018532, 380340691, 382642822, 384327011, 386187172, 387978973, 389303169, 391228561, 392379570, 393395462, 395737114, 396362114, 394791641, 394647293, 394922028, 394053535, 392972031, 392533607, 388090477, 387702446, 386713295, 383667450, 383354950, 382045059, 380512619, 379520721, 379600983, 378839798, 374673615, 372079239, 371902161, 372689285, 372169724]
1510.2C72169724J137657j93749j545868j44958q61817j073951k358170j759720R18312
1518.9C66287460J666413L43895k918282k77748J791916K615089Q8883K91977J346626
1527.6C71236229K78053M45175J236191J121903L81317L88565j115761J525841J216011
1536.3C76713524J181412K750625r62677m174461J625252K006988q74176M52843P08580
1545C79427910o68717J842728P36580Q22525p80144j433792J037941L96958P59544
1553.6C82141533l008728j70288J317100J296997k484092q393746J299629j273727
1561.4C70724678Q42972j336212j726265l697968l461380j187820k636833j267891
1569.1C56253281q528710k614403k449455m090233l046264l247834r45205j3255043
$$ y = [372169724, 373307381, 373113632, 371567764, 371422806, 370560989, 369487038, 367128868, 365369148, 366287460, 367953873, 368297768, 365379486, 365101738, 366893654, 369508743, 369597626, 369889603, 371236229, 371514282, 371959457, 373195648, 374317551, 374698868, 375087433, 373971672, 375497513, 376713524, 377894936, 380645561, 379682884, 375508423, 377133675, 379140663, 378266487, 378719330, 379427910, 378759193, 380601921, 381338501, 382161026, 381380882, 379947090, 380985031, 381381989, 382141533, 379132805, 378962517, 380279617, 381576614, 379092522, 370698776, 371998405, 370724678, 371567650, 370231438, 368505173, 364807205, 361345825, 360158005, 357521172, 356253281, 347724571, 345110168, 342660713, 338570480, 335524216, 332276382, 331331177, 318076134]
1576.8C18076134k659722l505535m546489m171792n775203l661862o053447l746052
1584.5B83956032n396157m410839m342002n395413l274364n978604l272724n348225
1592.2B46537704l194484m247856m979039k534160m975300j869869m274178k040214
1599.9B18422604l487320k933674j835747m174957o40011l459644q96817k753391j330395
1608.6A96910648q98399k823753K68497k361412L43590j937924L50762J89419m684239
1617.3A85357189K000542j354962R89361j532516J166897L78818j047478J638470k46372
1626A87349949K447033j571293R72843K37846J008378J664543m4327K697544L78685
1634.6A95141201L307686j703758K384090J653175J024685K474575J29261K973137
$$ y = [318076134, 315416412, 311910877, 307364388, 303192596, 297417393, 293755531, 287702084, 283956032, 278559875, 274149036, 269807034, 264411621, 261137257, 255158653, 251885929, 246537704, 243343220, 239095364, 234116325, 231582165, 226606865, 224736996, 220462818, 218422604, 214935284, 212001610, 210165863, 205990906, 205350895, 201891251, 200994434, 198241043, 196910648, 196012249, 193188496, 193456993, 191095581, 191439171, 189501247, 189852009, 190041428, 185357189, 187357731, 186002769, 186992130, 185459614, 186626511, 187005329, 185957851, 187596321, 187349949, 189796982, 188225689, 189198532, 189436378, 190444756, 192109299, 192064972, 194762516, 195141201, 198448887, 196745129, 199129219, 200782394, 201807079, 204281654, 204410915, 207384052]
1642.4B07384052Q56972K356071J722146L16257L770981r58309L469085Q33340L134861
1651B22885456K386856J579285N54142j157055M182777J032410K575779J325035K052803
1659.7B37417488K301006K002392L827992N80692L712463K006207L499508L530845
1667.4B58878593K385788L956032J890278N147686K266617M144707L762455L311672
1675.1B85743828M293060L329277N081864L409690M951897L663101M580384N311355
1682.9C20364456K324562P244301J951332N913277M543266M517479N204773M300995
1690.6C56364441N201988M956589N571289N224342N753517K303544N523490O704636
1698.3C97603836O367416P134629j940613O561775N896301M657669L147660L489227
$$ y = [207384052, 208241024, 210597095, 212319241, 212635498, 216406479, 215448170, 218917255, 219750595, 222885456, 225272312, 226851597, 227405739, 226248684, 230431461, 231463871, 234039650, 235364685, 237417488, 239718494, 241720886, 245548878, 246129570, 249842033, 251848240, 255347748, 258878593, 261264381, 265220413, 267110691, 272258377, 274524994, 278669701, 282432156, 285743828, 290036888, 293366165, 298448029, 301857719, 306809616, 310472717, 315053101, 320364456, 322689018, 329933319, 331884651, 337797928, 342341194, 346858673, 352063446, 356364441, 361566429, 366523018, 372094307, 377318649, 383072166, 385375710, 390899200, 397603836, 403971252, 411105881, 409165268, 415727043, 421623344, 426281013, 429428673, 432917900]
1706D32917900L519096L519059M693222L022461K150497K855988L106002L066712J499557
1714.7D60350494J523590L305207K485618k841186L279228L782463K165985J760369
1722.4D75811768J199531R71680J885681K022552J342698J745567K361946K75345P87239
1731.1D88404007M067841L744125n98068k224350L254051L613281K593231L580170
1738.8E06434288J232071p82280M505959L537826J807976K583351L943710L994484
1746.5E27257385L285828L371353J938820M992752L015480J623650N641784L864899
1754.2E54991951L601379L912926J118507K754021L891258K869683L910217O55174
1761.9E77705116L05863L781471K133064J996079K568817K514419j119270K291603
$$ y = [432917900, 436436996, 439956055, 444649277, 447671738, 449822235, 452678223, 455784225, 458850937, 460350494, 461874084, 465179291, 467664909, 464823723, 468102951, 471885414, 474051399, 475811768, 477011299, 477982979, 479868660, 481891212, 483233910, 484979477, 487341423, 487616768, 488404007, 492471848, 496215973, 495617905, 493393555, 496647606, 500260887, 502854118, 506434288, 507666359, 506884079, 511390038, 514927864, 516735840, 519319191, 523262901, 527257385, 530543213, 533914566, 535853386, 540846138, 543861618, 545485268, 551127052, 554991951, 558593330, 562506256, 563624763, 566378784, 570270042, 573139725, 577049942, 577705116, 578010979, 581792450, 583925514, 585921593, 588490410, 591004829, 589885559, 592177162]
1769.7E92177162N487290J751861j815681k070389M496727K910652q96988K136002
1777.4F04176636J504783K371140Q93707p08618J252098J807404K043838j90353L20549
1786F13471184J729507J295624R71909K016792P90367N32341k09885l87725M032554
1794.7F24242668J538963m15420R83124J774292O12793j397782K734299N05867M16603
1803.4F30995407J921654P02400J397705R05113N80178O13250J433487m79049L01246
1812.1F38371391J407471K94609J332779O79703J199493K10190O44760J124420k12936
1820.8F45051880Q08716m49677J225205J797027j687546J86310K271958K413559O00280
1829.4F52217712k674331M0741K132263M3182J83335P64923N10254Q55102p3166J293259
$$ y = [592177162, 597664452, 599416313, 597600632, 595530243, 600026970, 602937622, 602040634, 604176636, 605681419, 608052559, 608946266, 608237648, 609489746, 611297150, 613340988, 613150635, 613471184, 615200691, 616496315, 617468224, 619485016, 620275383, 620807724, 620597839, 620210114, 624242668, 625781631, 625366211, 626349335, 628123627, 628736420, 627338638, 630072937, 630578804, 630995407, 632917061, 633619461, 635017166, 635922279, 636502457, 637115707, 638549194, 638070145, 638371391, 639778862, 640073471, 641406250, 642085953, 643285446, 643495636, 644140396, 645264816, 645051880, 645860596, 645410919, 646636124, 648433151, 646745605, 646931915, 649203873, 651617432, 652217712, 649543381, 649584122, 651716385, 651759567, 651942902, 652707825, 653218079, 654073181, 654000015, 655293274]
1839.1F55293274N35965N98984N89218J558075J588287n537262J451264K374420J12304
1847.8F58564529l96118O50101J589508J65253P54242J31836K91748J29470R079M33197
1857.4F62322845k45590Q97599K12554L05863K68249P12281M41208L8147R92584p19452
1867.1F65226288P14416p51419j499862J369552R63516P76749L69949Q11539j78223
1875.7F67802505L60413J89362n78766J29394P0343R06983k98386J04447N7907l128
1885.4F68741074R48257J7700J072769L357j435852L06092P14111r1553N00717O91986
1895F71468658q56094M91943K45438L51257L47367k68936K12631M3411M57687j42898
1904.7F72350464K12860K24457J97525J2512n2872K55814n62058Q89893p7744R9640
$$ y = [655293274, 655829239, 656428223, 657017441, 658575516, 660163803, 654626541, 656077805, 658452225, 658564529, 658168411, 658818512, 660408020, 660573273, 661327515, 661459351, 661751099, 661880569, 661889648, 662322845, 662077255, 662974854, 663187408, 663493271, 663761520, 664473801, 664915009, 664953156, 665945740, 665226288, 665940704, 665189285, 663689423, 665058975, 666022491, 666799240, 667169189, 667980728, 667802505, 668162918, 668352280, 667773514, 667902908, 667973251, 668880234, 668581848, 668686295, 668744202, 668741074, 669689331, 669707031, 670779800, 670783157, 669347305, 669653397, 670367508, 670275955, 670776672, 671468658, 670612564, 671104507, 671349945, 671701202, 672048569, 671779633, 671992264, 672035675, 672493362, 672350464, 672563324, 672787781, 672985306, 672997818, 672944946, 673200760, 672638702, 673528595, 673450851, 673550491]
1914.3F73550491K47040j29318J703186j513901r81293R61991L54004J48620p06482
1923F73634338o2713N23987N89981k95487L21655J77079M6005J01166o02036M14276
1932.6F74848251j71814m8828m74853j2055O65741j22299O81534P7896Q19321l78723
1942.3F75884171k199479L89710O24466k51847n50689M66461k0294J7319M97512J79062
1951.9F75036392R1248l76358m47846p11364J14364j61819j06278K53144J32980N34058
1961.6F74358521m16718L81317K44293k27737l83682q35266l3799j90887L19595J75400
1971.2F73391037P46841M78287m89578k74353l58963K23999n55573k05917L8376j42365
1980.8F72851791J52970P1182O10962l0441J93557k82669q9874P8354q99582J1520
$$ y = [673550491, 673797531, 673668213, 675371399, 673857498, 672876205, 673838196, 674192200, 674340820, 673634338, 673571625, 674095612, 674685593, 674390106, 674711761, 674888840, 674934845, 675036011, 674433975, 674848251, 674676437, 674627609, 674152756, 674140701, 674806442, 674684143, 675365677, 675443573, 676262894, 675884171, 673684692, 674074402, 674698868, 674447021, 673896332, 674362793, 674342499, 674359818, 674857330, 675036392, 675127640, 674751282, 674303436, 673592072, 673706436, 673544617, 673438339, 673691483, 673824463, 674358521, 673941803, 674323120, 674567413, 674339676, 673955994, 673120728, 673086929, 672896042, 673215637, 673391037, 674137878, 674616165, 674126587, 673852234, 673493271, 673717270, 673161697, 672955780, 672994156, 672851791, 673004761, 673075943, 673686905, 673656464, 673850021, 673567352, 673477478, 673555832, 672656250, 672667770]
1990.5F72667770j99051n22079l62244M84772M93622L42560L26614n75256K2659m98352
2000.1F72181015m53262o08139l17841M19235k83279L37601K07061L21885l02353m73099
2009.8F71028824n8060n16434j18789o34995k23312M6997J70593k26517l99246L76282
2019.4F69445343q1863J82342m70657m13819k90451m59213o6223k68250L42637Q6670
2029.1F68006516J47399l58047l80097j55563m95834l968n57937J4648m1809k0218
2038.7F66155090P1717j87607L06473k84043j47629q15506m28924k3041k71911O0501
2048.4F64435120j20240M84620j47553J33438N188l07999j8463n66787n8594l78266
2058F63460464K19727O6605l56064o3782k59018K55051j69144J3962k31857j23215
$$ y = [672667770, 672468719, 671946640, 671584396, 672069168, 672562790, 672905350, 673231964, 672656708, 672679367, 672181015, 671727753, 671119614, 670801773, 671221008, 670937729, 671275330, 671482391, 671804276, 671501923, 671028824, 670970764, 670454330, 670335541, 669700546, 669477234, 669524231, 669694824, 669468307, 669069061, 669445343, 669363480, 669545822, 669075165, 668661346, 668370895, 667911682, 667845459, 667577209, 667919846, 668006516, 668153915, 667795868, 667415771, 667260208, 666764374, 666760406, 666202469, 666217117, 666175308, 666155090, 666226807, 666039200, 666345673, 666061630, 665914001, 665098495, 664669571, 664646530, 664374619, 664435120, 664314880, 664799500, 664651947, 664785385, 664790573, 664482574, 664464111, 663897324, 663838730, 663460464, 663680191, 663746796, 663390732, 663326950, 663067932, 663322983, 663153839, 663167801, 662935944, 662812729]
2067.6F62812729k3880q0185J61438n84107K0829l9139J39236n9814j78223J09177
2077.3F62278061p69653r0638l1814P5455o5232j41296p8049m37546N32151J35040
2086.9F61406479l85056l74527P3777j54267n54046j58921l16925K04239k36893j79977
2096.6F59323883j78375l29361k40555n58777N4474j04599K70844k43760j99661J20621
2106.2F57914734n16052n7373l78266J65177k41242k86407l281k64664L20053l02200
2115.9F56350479J87531l56980o13174j60752k28881K28424l24784J61515J33590p629
2125.5F55369339j56097j56784J28784k01493J63422j92413o87l54462j00402L32870
2135.1F54832077j40076K33841k28882M044k71835l7461J03226j78146K19955k02942
$$ y = [662812729, 662788849, 662708664, 662870102, 662285995, 662306824, 662267685, 662406921, 662347107, 662168884, 662278061, 661508408, 661417770, 661385956, 661461411, 661396179, 661254883, 661176834, 660739288, 661271439, 661406479, 661021423, 660646896, 660720673, 660566406, 660012360, 659853439, 659536514, 659740753, 659503860, 659323883, 659145508, 658816147, 658575592, 658016815, 658071289, 657966690, 658237534, 657993774, 657794113, 657914734, 657398682, 657341309, 656963043, 657128220, 656886978, 656600571, 656597290, 656332626, 656652679, 656350479, 656538010, 656181030, 655567856, 655407104, 655178223, 655406647, 655081863, 655243378, 655376968, 655369339, 655213242, 655056458, 655185242, 654983749, 655147171, 654954758, 654954071, 654599609, 654499207, 654832077, 654692001, 654925842, 654696960, 654701004, 654429169, 654391708, 654494934, 654316788, 654536743, 654333801]
2144.8F54333801M30527j51901k04773J13601r460K41089l08762J47782l23258j92337
2154.4F54076309O104M0054J08795l26767M32205k4948J63269J00174P0496K79694
2164.1F54925385m63868k5787J12534K99758k12249n2262M9363k55051M84466P2022
2173.7F54934311L8910j72959j30386K1744p7820M9591J18027K50702j12305M61884
2183.4F55381699Q0185K4032M7913m54254j18561m07868K76413K63596K63138J10779
2193F55467072J3046L94974j31302M24270r3994k37198l204K58408K28500n93872J7242
2203.6F55743942j14212L92151K28272q393J78833k21634K82441k83967j53121j91651
2213.3F55852661K52152M26406j33132K19039k85873N4550p4997J38016p6065j98364
$$ y = [654333801, 654764328, 654612427, 654407654, 654521255, 654511795, 654752884, 654444122, 654591904, 654268646, 654076309, 654082413, 654122467, 654231262, 653904495, 654336700, 654311752, 654475021, 654575195, 654645691, 654925385, 654461517, 654435730, 654548264, 654848022, 654635773, 654583511, 654632874, 654377823, 654862289, 654934311, 654973221, 654800262, 654669876, 654691620, 654613800, 654663391, 654781418, 655032120, 654919815, 655381699, 655461884, 655485916, 655533829, 655079575, 654961014, 654553146, 654829559, 655093155, 655356293, 655467072, 655480118, 655875092, 655743790, 656168060, 656074066, 655836868, 655833664, 656092072, 656320572, 655726700, 655743942, 655629730, 656021881, 656250153, 656241760, 656420593, 656198959, 656481400, 656197433, 656044312, 655852661, 656104813, 656531219, 656398087, 656617126, 656331253, 656385803, 656310806, 656448822, 656372757, 656174393]
2222.9F56174393J97677l85513M57916k1362p2174R689J28327N08117l74908j36566
2232.5F56485596n72510J28250L96500J94626K55279m02298m4174m58832J59378o10
2242.2F56141205j81503J50222r3155K11182n17883O1798J29700O2637p095m16871
2251.8F55540237K2583k26898J81504q8044J16043K00119J87760M51050r1477J03378
2261.5F56396255m25415j50604k13165j37863K97851j15890j05515m16107J59683j69143
2271.1F55120087L2730J79443m45557j78985k86484K56348q9493J19553J36261r4452
2280.8F54749451N5694j61667K26822m41665J28936j60369n12696j20392l80172L63464
2290.4F53747406j26038L65754L2425m11606p1411l43934j44882q19549J43203P3929
$$ y = [656174393, 656372070, 655986557, 656444473, 656423111, 656350937, 656360626, 656488953, 656997070, 656622162, 656485596, 655913086, 656041336, 656437836, 656632462, 656887741, 656485443, 656441269, 655982437, 656141815, 656141205, 655959702, 656109924, 656016769, 656227951, 655710068, 655771866, 655901566, 655964203, 655957108, 655540237, 655562820, 655335922, 655517426, 655429382, 655545425, 655745544, 655933304, 656384354, 656292877, 656396255, 655970840, 655820236, 655607071, 655469208, 655767059, 655651169, 655545654, 655129547, 655289230, 655120087, 655152817, 655332260, 654886703, 654707718, 654421234, 654677582, 654588089, 654707642, 654843903, 654749451, 654805145, 654643478, 654870300, 654428635, 654557571, 654397202, 653884506, 653764114, 653383942, 653747406, 653621368, 653987122, 654019547, 653607941, 653536530, 653192596, 653047714, 652228165, 652371368, 652445297]
2300F52445297j86004j79902l49502O40488J47628J43357n66559k47040k67410j061783
2309.7F50518570j49612j85471O3095j45798P68891k29874p93915K13394j119613l21503
2319.3F48618164j19934J46332k78015o23551o74743m03214J549683m22516l58200
2328F47434006J38626j47629o02035p17316P54318n75485J82953n00794n87921L47214
2337.7F45725937K42767J36872j281357J47400n5466K27737k70996q87451L46680N264
2347.3F44337387L4103L49732P71332r88617j007996j85699j056824m76151r67178
2356F40810089R47189N26200L95202J34278l82767K14462n85479M10461j182404K30332
2365.6F41517563r47724j109809J154136q24470R2163N34782j01089k75345M57535
$$ y = [652445297, 652259293, 652079391, 651729889, 652370377, 652518005, 652661362, 652094803, 651847763, 651580353, 650518570, 650368958, 650183487, 650246582, 650100784, 650869675, 650639801, 649845886, 650059280, 648939667, 648618164, 648498230, 648644562, 648366547, 647742996, 647068253, 646665039, 648214722, 647792206, 647434006, 647572632, 647425003, 646822968, 646105652, 646859970, 646284485, 646467438, 645966644, 645378723, 645725937, 645968704, 646105576, 644824219, 644971619, 644916153, 645143890, 644872894, 643985443, 644332123, 644337387, 644371490, 644721222, 645492554, 644503937, 643495941, 643310242, 642253418, 641777267, 640810089, 641757278, 642283478, 642678680, 642812958, 642430191, 642644653, 642059174, 642469635, 641287231, 641517563, 640569839, 639460030, 640614166, 639789696, 639881859, 640416641, 640315552, 640040207, 640497742]
2374.3F40497742O10m48379k4567n76363K71874O5498M7493K08206m93393q19664n04226
2384.9F38224831N3177m58527n9395j29967q6555j5297n06706K74772o8664m33426
2394.6F36794243m56314j86005n98183q02917J11198l22723k62985k63024J1788j78948
2404.2F33846130k59132n5237p61261q5373m97093m09622l4065m09928l07045m84276
2413.8F30543098k25029o88285j40190K03437j65138m32968p10793m74624r31511m43382
2423.5F26534615l19329Q3237J54877l70751j81312n92690k38724o17981l31420m35830
2433.1F23684692o92558K00157l60145k14730m10499k17743l06015o91261k97585o12221
2442.8F20082092l40728p41082l21388k47345m30031Q9836n92041l95546k96135l34625
$$ y = [640497742, 640498352, 640049973, 640025406, 639449043, 639720917, 639786415, 639833908, 640042114, 639548721, 638729057, 638224831, 638278008, 637819481, 637760086, 637630119, 637543564, 637528267, 637021561, 637296333, 637227669, 636794243, 636337929, 636151924, 635553741, 634750824, 634862022, 634539299, 634276314, 634013290, 634025078, 633846130, 633586998, 633531761, 632770500, 632685127, 632188034, 631778412, 631744347, 631334419, 631027374, 630543098, 630318069, 629629784, 629489594, 629693031, 629527893, 629094925, 628384132, 627909508, 626977997, 626534615, 626215286, 626298523, 626453400, 626082649, 625901337, 625308647, 625069923, 624451942, 624120522, 623684692, 622992134, 623192291, 622832146, 622617416, 622206917, 621989174, 621683159, 620991898, 620694313, 620082092, 619741364, 619000282, 618678894, 618431549, 618001518, 618091354, 617499313, 617103767, 616807632, 616473007]
2452.4F16473007n71976o46057k18773k39257n08232p02210j99737n18456m07867k03362
2462.1F12257080j97601k66609o34003m52843j120453m44145j36528m45747p1259n39589
2471.7F07948303o57882q34160l29094k10114k35023l49121p05109m38957n86357k25869
2481.3F03376617p69577o59561l7460l09219n50919q79822l94783q01658p13044l68271
2491E97892303l72695p8240m53339o32705p70340k43988n26886o94847o36711q32138
2500.6E92650414j91536m13094j31569j39542l83071q71926j014747j72043n45578
2509.3E88787308o21071o40297k82974n81017o82487K73361k24495o08749p99141n80140
2519E84040298q02192o05507k3117m87633o02798o68717m6463k98042m32320m82902
$$ y = [616473007, 615901031, 615254974, 615036201, 614796944, 614288712, 613586502, 613386765, 612868309, 612460442, 612257080, 612059479, 611792870, 611158867, 610706024, 609585571, 609141426, 609004898, 608559151, 608487892, 607948303, 607290421, 606456261, 606127167, 605917053, 605682030, 605332909, 604627800, 604188843, 603602486, 603376617, 602607040, 601947479, 601910019, 601600800, 601049881, 600170059, 599775276, 598973618, 598260574, 597892303, 597519608, 597441368, 596988029, 596355324, 595584984, 595340996, 594814110, 594119263, 593482552, 592650414, 592458878, 592045784, 591914215, 591774673, 591391602, 590519676, 589504929, 589332886, 588787308, 588166237, 587525940, 587242966, 586661949, 585979462, 586252823, 586028328, 585419579, 584620438, 584040298, 583238106, 582632599, 582609482, 582121849, 581519051, 580850334, 580803871, 580505829, 580073509, 579590607]
2528.6E79590607q75969m87976o67610l17994p97729m55780k4872l27721N6305q83598
2538.2E74807663q39424n57785k00157k98272o93664n5695m97780o32591o94885l26767
2547.9E70010643j24702l07732l18871q62617o38466o03409l83224l84407n21355o18095
2557.5E65247765o52543j08490k23350k29607n82618m77753m37813m38843k70347r07250
2567.2E60919151n06668m28734m24614m33006k00653p3471o79283n37567q55103k50473
2576.8E56529579q1940l76472k46735n76248m95033r19190l18527k60467m53835j50642
2586.5E52650490o81305o24466o53496k74696m33922o19583m16451l69033l13378q09097
2596.1E47455063l10936l30277m83436n18303p80716m18129n29480m24919n74951n89485
$$ y = [579590607, 578714638, 578226662, 577559052, 577241058, 576443329, 575987549, 575962677, 575634956, 575691261, 574807663, 573968239, 573410454, 573210297, 572912025, 572218361, 572162666, 571664886, 571032295, 570337410, 570010643, 569885941, 569578209, 569259338, 568396721, 567758255, 567154846, 566771622, 566387215, 565865860, 565247765, 564595222, 564486732, 564263382, 564033775, 563451157, 562973404, 562535591, 562096748, 561826401, 560919151, 560412483, 559983749, 559559135, 559126129, 558925476, 558852005, 558172722, 557635155, 556780052, 556529579, 556447639, 556071167, 555824432, 555248184, 554753151, 553833961, 553515434, 553254967, 552801132, 552650490, 551969185, 551344719, 550691223, 550416527, 549982605, 549363022, 548946571, 548577538, 548264160, 547455063, 547144127, 546813850, 546330414, 545812111, 545031395, 544613266, 544083786, 543658867, 543083916, 542494431]
2605.7E42494431o59180p66678j72920j90239o52352o34079k33154n17998n97534p00798
2615.4E37369499p85103m88472n95588l97988m01649l06473m89159n92918n92689p75719
2625E31943741o45294q74062m54407n07621m81797m01039q18138n50003o58684n02815
2634.7E26049881n63202l06511k01378o59370o86417q37288l17573n32952p77397m63676
2644.3E20704117k48261l18985q32519o29807o70585n24826p01828q18253m33731m34113
2654E15091209k47230l32375l37867q23365m98619j18179o47049l99780m38004m89731
2663.6E10759010p16476n74417m21295n05791k16866j97906j93672m26751j96151o65169
2673.3E06644516p60384m30793o24199k8611k69355k77748l92647m52500k81143m81834
$$ y = [542494431, 541835251, 541068573, 540895653, 540705414, 540053062, 539418983, 539185829, 538667831, 538070297, 537369499, 536584396, 536095924, 535500336, 535102348, 534700699, 534394226, 533905067, 533312149, 532719460, 531943741, 531298447, 530424385, 529969978, 529462357, 528980560, 528579521, 527761383, 527211380, 526552696, 526049881, 525486679, 525180168, 524978790, 524319420, 523633003, 522795715, 522478142, 521945190, 521167793, 520704117, 520455856, 520136871, 519304352, 518674545, 518003960, 517479134, 516777306, 515959053, 515525322, 515091209, 514843979, 514511604, 514173737, 513350372, 512851753, 512733574, 512086525, 511686745, 511248741, 510759010, 510042534, 509468117, 509046822, 508541031, 508324165, 508126259, 507932587, 507505836, 507309685, 506644516, 505884132, 505453339, 504829140, 504800529, 504531174, 504253426, 503860779, 503408279, 503127136, 502645302]
2682.9E02645302l29018r19647o95534n68886k45170P4158l73803k80227q59299n63660
2692.5D97884216m32968l12157J8044n01747k24114n81054n87578O5956p9193o14472
2702.2D94634933q29658m67262j48926l93715o61964K5787k45476p05414m93011k96135
2711.8D90419159j53503q00820l52211N1041l10555k74048j96876l74375p53860l87878
2721.5D86866074n0545P1869l88642m35028j91459o13671j82762j84288k49252k45285
2731.1D84397011l70217l19252o89621l98826n6229j65329l77273k05651j64642l75290
2740.8D81274681l20358j55831j72424n78766j83487p8811k0218O7329j18789p2899
2750.4D79640427p02401m47959m16222k60086j8044n94253l51448k75841l7003k90184
$$ y = [502645302, 502316284, 501396637, 500701103, 500132217, 499887047, 499961205, 499587402, 499307175, 498447876, 497884216, 497451248, 497139091, 497157135, 496655388, 496431274, 495850220, 495262642, 495328598, 495249405, 494634933, 493805275, 493338013, 493189087, 492795372, 492133408, 492159195, 491913719, 491208305, 490715294, 490419159, 490265656, 489464836, 489112625, 489163666, 488853111, 488579063, 488382187, 488007812, 487253952, 486866074, 486815529, 486887398, 486498756, 486063728, 485872269, 485258598, 485075836, 484891548, 484642296, 484397011, 484026794, 483707542, 483017921, 482619095, 482562866, 482397537, 482020264, 481814613, 481649971, 481274681, 480954323, 480798492, 480626068, 480047302, 479863815, 479785004, 479764786, 479832115, 479713326, 479640427, 478938026, 478490067, 478073845, 477813759, 477795715, 477201462, 476850014, 476574173, 476537170, 476246986]
2760D76246986k96173j48735n44586n34897o79550k9793j48849n30434n07278l55339
2769.7D72471352k2774n28603m20570j74561Q8768p35740j124497k51007n36804l56636
2779.3D68408928l08609l05824o30379o23474N073l45955n16319q46329k46009j52474
2789D64438629p62939o14930r25941p77779m31633j17950m83475q62808o80084n87502
2798.6D58193588q17375j236954n14183l87306q22372r70803o89392l00483l37143
2807.3D52117577j37940r01794r65653p56721j002388o81153q27827j057320j151313
2816D44635468m02184n31387j145630p96128r48181r90257j084518q43125n53131p01103
2825.6D36639824q76274r91974q42819j027184j088333r91287j152916j291657r11369
$$ y = [476246986, 475950813, 475802078, 475257492, 474722595, 474043045, 474013252, 473864403, 473333969, 472826691, 472471352, 472448578, 471919975, 471499405, 471324844, 471413612, 470677872, 469553375, 469302368, 468765564, 468408928, 468100319, 467794495, 467164116, 466540642, 466545715, 466199760, 465683441, 464837112, 464591103, 464438629, 463675690, 463060760, 462134819, 461357040, 460925407, 460807457, 460323982, 459461174, 458781090, 458193588, 457376213, 456139259, 455625076, 455237770, 454415398, 453444595, 452755203, 452454720, 452117577, 451979637, 451077843, 450112190, 449355469, 448353081, 447671928, 446844101, 445786781, 444635468, 444233284, 443701897, 442556267, 441760139, 440811958, 439821701, 438737183, 437894058, 437340927, 436639824, 435763550, 434771576, 433928757, 432901573, 431813240, 430821953, 429669037, 428377380, 427466011]
2834.3D27466011j128159j368408q60939j180763j334686j743851j946373j594963
2842D16307869j806030j833153k100525k231789k061500j956978k390480k260666j459770
2850.7C98206978j499672j553574j395073m34341k25220n69649k94036k46735K35138
2859.4C92223816j70937p42645r06525o37741j00975m57000o81992q54683p84492j024895
2869C85861931j078873p37953o42014m51889j072197j117668p26509o27441o34651
2877.7C78772736o30494m50477q83217q77724q20579j084862j199341j068649o79970
2886.4C71077423o57272j032486j431389q69064o79284j391983j547126r85031n17426
2895.1C61966362n85251q80432j309433p35283p32422j130676n89294n52788n48096
$$ y = [427466011, 426337852, 424969444, 424108505, 422927742, 421593056, 419849205, 417902832, 416307869, 414501839, 412668686, 410568161, 408336372, 406274872, 404317894, 401927414, 399666748, 398206978, 396707306, 395153732, 393758659, 393324318, 393099098, 392529449, 392235413, 391988678, 392223816, 392052879, 391310234, 390403709, 389765968, 389664993, 389207993, 388526001, 387671318, 386886826, 385861931, 384783058, 384045105, 383403091, 382951202, 381879005, 380761337, 380034828, 379407387, 378772736, 378142242, 377691765, 376808548, 375930824, 375110245, 374025383, 372826042, 371757393, 371077423, 370420151, 369387665, 367956276, 367087212, 366407928, 365015945, 363468819, 362483788, 361966362, 361381111, 360500679, 359191246, 358455963, 357723541, 356592865, 356003571, 355450783, 354902687]
2903.7C54902687r08089p29980o79092j015893p54776j254463j161461j076736j227799
2912.4C46094398j216697j545448j382142j284675j346283j567650j376686r65538
2920.1C35409279j031227j310196j140213m80194j86425k8648l50799j97678L33481
2928.8C31017380M34646L74985J31378K48490L2844K04277O21758N31006J95846K54288
2938.5C34046898Q30307Q98132J039047M34533N47523J209946O25191N73883L56712
2947.1C40562172M43726Q40568R12819N21469M4022N18074O69746P33605M76265L28979
2956.8C46051445L20358N08194R15184M64554O85959M04091K14195J001968J050988
2965.5C51616936O18591M45366P90291O84204Q33206P80220O96640R06181O45600P70263
$$ y = [354902687, 353994598, 353264618, 352585526, 351569633, 350814857, 349560394, 348398933, 347322197, 346094398, 344877701, 343332253, 341950111, 340665436, 339319153, 337751503, 336374817, 335409279, 334378052, 333067856, 331927643, 331447449, 331261024, 331232376, 330881577, 330683899, 331017380, 331452026, 331827011, 331958389, 332206879, 332239723, 332444000, 333065758, 333596764, 333792610, 334046898, 334877205, 335775337, 336814384, 337248917, 337796440, 339006386, 339631577, 340205460, 340562172, 341005898, 341846466, 342759285, 343280754, 343324776, 343842850, 344512596, 345246201, 345722466, 346051445, 346371803, 346879997, 347795181, 348259735, 348945694, 349349785, 349563980, 350565948, 351616936, 352235527, 352680893, 353471184, 354155388, 354988594, 355768814, 356465454, 357371635, 358017235, 358787498]
2975.1C58787498L64457L48320M77295L21922M75273L80249N17731Q0795R1286M06036
2984.7C62250862J76125o7025k09808K44637K48489L54881J96953m78630P2594L34053
2994.4C63123131m29726m70199p0382k0599j46637q17642r94072m61311k43988m03443
3004C59065132q22296o68068m58717o09665o51512m47998j68953k08512m57000q04291
3013.7C53768120r27429r52874o63757n52177o67076n62287p47413q00515p66029o21872
3023.3C46506691p94754r93080q08373o02264m01230q74901r13543q43735q80928o68106
3033C38725777p13845n48668j022872j333962j037292l67051m82635j278191p17048
3041.6C31224213o72722j003647p18689n15747j047402j321792n60074n98907n74418
$$ y = [358787498, 359151955, 359500275, 359977570, 360299492, 360774765, 361155014, 361672745, 361753540, 361844826, 362250862, 362426987, 362359962, 362150154, 362394791, 362643280, 362998161, 363195114, 362716484, 362789078, 363123131, 362693405, 362223206, 362152824, 362132225, 361985588, 361167946, 360173874, 359712563, 359468575, 359065132, 358242836, 357574768, 357116051, 356506386, 355854874, 355406876, 355237923, 355029411, 354572411, 353768120, 352840691, 351887817, 351224060, 350671883, 350004807, 349442520, 348695107, 347894592, 347128563, 346506691, 345711937, 344718857, 343910484, 343308220, 342906990, 342032089, 341118546, 340274811, 339393883, 338725777, 338011932, 337463264, 336440392, 335106430, 334069138, 333702087, 333219452, 331941261, 331224213, 330551491, 329547844, 328829155, 328313408, 327266006, 325944214, 325384140, 324785233, 324210815]
3050.3C24210815r26590j193885o85463j135979j160603n07698l62510r95446j007118
3059C16235523n52883p47089p84054q67539q69407o21891m88701q79059q19702o24867
3068.6C08980331r15985l90491m84696p62710n72224q87909j155910r16462k83909
3077.3C02610035l71571p65266j056557q56151n75486r79213o17028j16615m68769
3086B96803379j188030r62811l81946p65305q15506o37207o10370n40371n87426q69102
3095.6B89445305r42402m36974n81092q25272n66731o21051n82581p91645j092720
3104.3B83004837n98240n38235q23459q98056p13921q4076m47197p99122p79514j238727
3114B76084290j115666o69041n51605p17010m86355n52349p38583p37305j036815p78752
$$ y = [324210815, 323284225, 322090340, 321404877, 320268898, 319108295, 318600597, 318238087, 317242641, 316235523, 315682640, 314935551, 314151497, 313283958, 312414551, 311792660, 311303959, 310424900, 309605198, 308980331, 308064346, 307673855, 307189159, 306426449, 305854225, 304966316, 303810406, 302893944, 302610035, 302238464, 301473198, 300416641, 299560490, 298985004, 298005791, 297388763, 297272148, 296803379, 295615349, 294652538, 294270592, 293505287, 292689781, 292052574, 291442204, 290901833, 290314407, 289445305, 288502903, 288065929, 287484837, 286659565, 286092834, 285471783, 284889202, 284097557, 283004837, 282406597, 281868362, 281044903, 280146847, 279432926, 279348850, 278901653, 278102531, 277323017, 276084290, 274968624, 274299583, 273747978, 273030968, 272544613, 271992264, 271253681, 270516376, 269479561, 268700809]
3123.6B68700809o49414k48279m22478j012974o98127r63440r36547m81147m58279
3132.3B62830124j129608j122093o43349r81274m95662m56677n62420m15077r48601
3141B56075363j077366r40265m60244l70216o82640q03070n11227m30755r52034r69258
3150.6B48878288p83825n57365p58057p06157o48175r86004o14757n21488n22499o81458
3160.3B42098503o57043o97728j080551r94396r80911l08151k63939p13997p86972
3168.9B35614815j074238o76575n49946p79972q18786o66256o51436o03027k61422
3177.6B29533157n86357r60369q56266o07796o47201l93238j99204o52427q19035p34730
3187.3B23076534n24959r59149q42247j31149m55532j045590r72003j164k92149j028537
$$ y = [268700809, 268051395, 267803116, 267380638, 266367664, 265669537, 264706097, 263769550, 263288403, 262830124, 261700516, 260578423, 259935074, 258953800, 258458138, 258001461, 257439041, 257023964, 256075363, 254997997, 254057732, 253597488, 253227272, 252544632, 251741562, 251230335, 250799580, 249847546, 248878288, 248094463, 247537098, 246779041, 246072884, 245424709, 244438705, 243823948, 243302460, 242779961, 242098503, 241441460, 240743732, 239663181, 238668785, 237687874, 237379723, 237115784, 236401787, 235614815, 234540577, 233864002, 233314056, 232534084, 231715298, 231049042, 230397606, 229794579, 229533157, 228946800, 227986431, 227130165, 226522369, 225875168, 225481930, 225282726, 224630299, 223811264, 223076534, 222551575, 221592426, 220750179, 220619030, 220163498, 219117908, 218145905, 218144741, 217852592, 216824055]
3196.9B16824055p98531p21512m82750m86202n96542p78466o62727m25854l74145l01972
3206.5B11195354l12881l5400o37436j102333p46251l10821m60491j212178l02486
3215.2B06075077k30980j009464k39296l7575n54771q66032o87103l12920o08520o64177
3224.9B00864239k49596o51951p69539m01954o35109m66061j21708j75762o59351n19486
3234.5A96213722k47154o49433m64707o58798p38849n50881l38325k33117p98664k43053
3244.2A91290741l5534m09241k02865l12367m38461n68676l06358m25625m95129q9226
3253.8A88007259m94346n80101l20530n52216k30350P5474n97725m00505j64223p96776
3263.4A83945961o57005m13075N2567N474o08788j70040m5109n35831l63331J82915
$$ y = [216824055, 216025524, 215304012, 214821262, 214335060, 213738518, 212960052, 212297325, 211871471, 211497326, 211195354, 210882473, 210847073, 210209637, 209107304, 208361053, 208050232, 207589741, 206377563, 206075077, 205844097, 204834633, 204595337, 204557762, 204002991, 203136959, 202449856, 202136936, 201528416, 200864239, 200614643, 199962692, 199193153, 198791199, 198156090, 197690029, 197568321, 197392559, 196733208, 196213722, 195966568, 195317135, 194852428, 194193630, 193454781, 192903900, 192565575, 192332458, 191533794, 191290741, 191255207, 190845966, 190643101, 190330734, 189892273, 189323597, 189017239, 188591614, 188096485, 188007259, 187512913, 186932812, 186612282, 186060066, 185829716, 185905190, 185307465, 184906960, 184742737, 183945961, 183288956, 182875881, 182928448, 182933922, 182325134, 182155094, 182109985, 181574154, 181210823, 181393738]
3273.1A81393738k0333n45959r31721j074238j60160L38555l0518k53162l71742l87288
3282.7A77957172l23371k91272m83913m01363K03704p6p01561m03442K2030k06871
3292.4A75371037k82383o3916r7065j69620l23982o30780m60033l75061k72808q9874
3302A72605515k33517p5588k10801l51944j45244q7757k8248k25868m45195o02741
3311.7A70198612k92148J0662m30126m96369k44102j60523l15285k61917J02825l24172
3321.3A67787457p16038m07410l47176k45208k62089o97098m12102L0709o56147j078110
3330.9A62996788l53699j53007l19405P6523O6452l87878p01542o00148m12082l73144
3340.6A59838858m69742m89674N4093K6626k45170l24755n77431k77815k08692o0730
$$ y = [181393738, 181373405, 180827446, 179895725, 178821487, 178661327, 178999882, 178969364, 178716202, 178344460, 177957172, 177633801, 177342529, 176858616, 176457253, 176660957, 176660881, 175959320, 175555878, 175577908, 175371037, 175088654, 175024738, 174927673, 174758053, 174434071, 173803291, 173343258, 172968197, 172695389, 172605515, 172371998, 172296410, 172085609, 171733665, 171588421, 171500664, 171472416, 171246548, 170801353, 170198612, 169906464, 169917126, 169487000, 168990631, 168746529, 168586006, 168270721, 168008804, 168111629, 167787457, 167071419, 166664009, 166316833, 166071625, 165809536, 165112438, 164700336, 164731045, 164074898, 162996788, 162643089, 162490082, 162170677, 162247200, 162313652, 161925774, 161224232, 160624084, 160212002, 159838858, 159369116, 158879442, 158933535, 158960161, 158714991, 158390236, 157812805, 157534990, 157326298, 157265568]
3350.2A57265568j6957n37481m94823m0741J58434l96128l98388K61955L06311M0731
3359.9A56148481k25544j33514p0705j44530j12619k7504k82841m63705P1364J77249
3369.5A54936132R9402L8195l55320m16689n6115L1023N8423L56206k68945k78244
3379.2A54144068K60162j16520J55592J04141m29010l55234N3711K41213J17387L34721
3388.8A54510231R4748N6619N23501k661p97815m62761K18238J54543Q8911N61333
3398.4A54944887L90005j17626L56140Q4200p92370j05228N6429k21339K25487L12405
3408.1A55132990J11570j47171J63527N85613M17261K53172J39408l4933J12228O7282
3417.7A56800947j35517O77414O69670j68972J57356P0725M0321M57201L79133L99294
$$ y = [157265568, 157248611, 156711130, 156216307, 156175566, 156334000, 155937872, 155539484, 155801439, 156107750, 156148481, 155922937, 155789423, 155718718, 155574188, 155461569, 155434065, 155151224, 154687519, 154758883, 154936132, 155035534, 155073729, 154718409, 154301720, 154245605, 154276628, 154335051, 154691257, 154422312, 154144068, 154404230, 154287710, 154443302, 154547443, 154118433, 153763199, 153816910, 154058123, 154175510, 154510231, 154604979, 154661598, 155185099, 155182438, 154384623, 153921862, 154140100, 154294643, 154383554, 154944887, 155334892, 155217266, 155573406, 155657606, 154865236, 154760008, 154816437, 154595098, 154820585, 155132990, 155244560, 155097389, 155260916, 155846529, 156263790, 156516962, 156656370, 156621437, 156733665, 156800947, 156665430, 157342844, 158012514, 157843542, 158000898, 158071623, 158111944, 158569145, 158948278, 159347572]
3427.4A59347572L62625L06130J53389k03695K43272O23188K37523j23578J36891P99732
3437A61883049M00105J48944O28357N86109K69490k03266K99472N90878O22940R25846
3446.7A66151924o0882j31627O43769J101150R10244L10860K15435L67088Q74272K16446
3456.3A70598679o9695N16453L80192N68218N04341Q09135O90327K20604M72870O23913
3466A75315037Q98304J58653K3041J019211R78546L34644P04460J274567L17917r1267
3475.6A80933113M05026Q56037R56535K39258L25622J053906J105823O29044R19189
3484.3A87423553R56727L09715K62337M72183R58061P76539N12104Q17070Q97694P08179
3493.9A94094162P05452J116257J022739R02786Q61969P97749O49528P67517P78351
$$ y = [159347572, 159710197, 160016327, 160169716, 159966021, 160209293, 160832481, 161070004, 160946426, 161083317, 161883049, 162283154, 162432098, 163060455, 163646564, 163916054, 163712788, 164012260, 164603138, 165226078, 166151924, 166091042, 165959415, 166603184, 167704334, 168614578, 168925438, 169140873, 169507961, 170382233, 170598679, 170528984, 171045437, 171425629, 171993847, 172498188, 173307323, 173997650, 174218254, 174691124, 175315037, 176213341, 176371994, 176395035, 177414246, 178392792, 178727436, 179431896, 180706463, 181024380, 180933113, 181338139, 182194176, 183150711, 183389969, 183715591, 184769497, 185875320, 186504364, 187423553, 188380280, 188689995, 188952332, 189424515, 190382576, 191159115, 191671219, 192488289, 193385983, 194094162, 194799614, 195915871, 196938610, 197841396, 198703365, 199501114, 200150642, 200918159, 201696510]
3502.6B01696510k25467N39398J422119J484470J449128O65073N3635K29091J222859
3511.3B08536816J008510Q41847J147937J048146J138935O15578R28497P64332L54137
3520B16384735J356030J728305Q49152J32275R33761Q65441J020126J254711O61984
3528.6B25186520P53784J257286K062225J489392O92348P99065J454754R78755N29290
3537.3B35203419K022571J485176O10104O97842J520805J692314J007061J383324Q83980
3546B46506596J559715J246700R70612J634693K477379K474727l31344J122761J448097
3554.7B59109936J484661K340412J026821J916447J422252J021901J194706K238712
3562.4B71755848J971188P80372L658104J512013J321716J217804p81593K850761J872349
$$ y = [201696510, 201471043, 202010441, 203432560, 204917030, 206366158, 207031231, 207084866, 207313957, 208536816, 209545326, 210387173, 211535110, 212583256, 213722191, 214337769, 215266266, 216030598, 216384735, 217740765, 219469070, 220318222, 220450497, 221384258, 222249699, 223269825, 224524536, 225186520, 225940304, 227197590, 229259815, 230749207, 231441555, 232240620, 233695374, 234674129, 235203419, 237225990, 238711166, 239321270, 240019112, 241539917, 243232231, 244239292, 245622616, 246506596, 248066311, 249313011, 250283623, 251918316, 254395695, 256870422, 256539078, 257661839, 259109936, 260594597, 262935009, 263961830, 265878277, 267300529, 268322430, 269517136, 271755848, 273727036, 274507408, 278165512, 279677525, 280999241, 282217045, 281435452, 284286213, 286158562]
3571.1B86158562J913566K194290J978417J563358J532974K702046J128921K235756
3578.8C01407890K188835R47247J917667K521630K151680J097107L696327K822800
3586.5C18751183M57172J725903K7847L008079L136177K664872J846733J526069L133355
3595.2C36277390K56538K304573L599472J833229K828484K119712K042428K154769
3602.9C53416595K243081K908210L262787K931710P70111L902702Q29620n12771O572876
3611.6C76324921K634773m53529M500808R75800L718910M591446J683578L103447J005326
3620.3C98085480J242752L155899L355942L206291L569183L074265L221817P172508
3628D26084137J708565p968369M007416N188332O061439L120957J43775L527184M465065
$$ y = [286158562, 288072128, 290266418, 292244835, 293808193, 295341167, 298043213, 299172134, 301407890, 303596725, 304543972, 306461639, 308983269, 311134949, 312232056, 315928383, 318751183, 319208355, 320934258, 320962105, 323970184, 327106361, 329771233, 331617966, 333144035, 336277390, 336533928, 338838501, 342437973, 344271202, 347099686, 349219398, 351261826, 353416595, 355659676, 358567886, 361830673, 364762383, 365532494, 369435196, 370264816, 369752045, 376324921, 378959694, 378506165, 383006973, 383982773, 387701683, 392293129, 393976707, 397080154, 398085480, 399328232, 402484131, 405840073, 409046364, 412615547, 415689812, 418911629, 426084137, 427792702, 419824333, 423831749, 429020081, 435081520, 438202477, 438346252, 441873436, 446338501]
3636.6D46338501M002037J949806J820450L296394L721962K301636J216126L035965
3644.4D67682877M603500P184105K405472j669731O602211K728042k131882k078170
3652.1D85326424M999847N655975N314598P349854o126022O59904N782776K562294
3659.8E11525650L467979J328316J982269J726571J959457K200356J284866N480156
3667.5E30955620L390083R48296K158775p157211K149620R123459J0721588L076973
3675.2E55367203j7089768N49240P856293N855065k171059p31545L077317K708053
3682.9E55420799J723023O92558J386185M838180P189598q224220m177704R410477
3690.6E68258896l936997j296882M923782R38301K059250Q02307k13852J247139J15967
$$ y = [446338501, 450340538, 452290344, 454110794, 457407188, 461129150, 463430786, 464646912, 467682877, 472286377, 479470482, 481875954, 480206223, 486808434, 489536476, 487404594, 485326424, 490326271, 495982246, 501296844, 508646698, 502520676, 503180580, 508963356, 511525650, 514993629, 516321945, 518304214, 520030785, 521990242, 524190598, 525475464, 530955620, 534345703, 535293999, 537452774, 530295563, 532445183, 541568642, 552290230, 555367203, 538277435, 538826675, 546682968, 552538033, 550366974, 549635429, 552712746, 555420799, 557143822, 557836380, 559222565, 564060745, 571250343, 563026123, 558848419, 568258896, 564321899, 563025017, 567948799, 568887100, 570946350, 571748657, 571534805, 572781944, 572897911]
3699.3E72897911K555428M118805l743897k541237M143639J315841N95398J338196
3707E80680084L479347M949875q097381K839775N376930j3456573M559097N465851
3714.8E85797005M00428J13411K434502K438049l550224K33307O147995k045670n133400
3723.4E86835403M617768J590004r65081k906913l72048M311676J467133N449066j606216
3732.1E98420792p993012Q568649J605874p445717J85508J133614L6240K311821M145279
3740.8F00969048l414536J151466J0491143q642464j6541176R566536O668167P391243
3748.5F07639427j795349j1978226J1433983k358093r043083N279693M592820L656921
3756.2F07428093n615807J425515O936645o841278l313751L568268J491699P36580
$$ y = [572897911, 575453339, 579572144, 575828247, 573287010, 577430649, 578746490, 579341888, 580680084, 584159431, 589109306, 581011925, 583851700, 589228630, 575772057, 580331154, 585797005, 586197433, 586310844, 588745346, 591183395, 587633171, 587866478, 594014473, 591968803, 586835403, 591453171, 593043175, 592078094, 589171181, 588799133, 593110809, 594577942, 600027008, 598420792, 590427780, 598996429, 600602303, 593156586, 593342094, 594475708, 594511948, 596823769, 600969048, 597554512, 598705978, 609197121, 600554657, 584013481, 593580017, 600248184, 607639427, 605844078, 593865852, 605299835, 602941742, 593898659, 599178352, 603771172, 607428093, 601812286, 603237801, 610174446, 603333168, 600019417, 603587685, 605079384, 605815964]
3763.9F05815964M000396k578048n310326L739624O387406J628952j0585099K13585
3771.7F03312454L273392M51698J210175l03803J085930P53365K573280R33533p460442
3780.3F05829582J741486K451896O03524K162590k444954j152039J486054O3362J71089
3789F10912590K77901N21965k49634o24542r995K535057M410706m028626n078430J778755
3798.7F10445747L805924P688865m617767j3040390K612190K779885N879516O837807
3806.4F22391777r628868o271057M526710K846489L13607K7694k3002J923713O905518
3815.1F23012581l5515j6301193L740387O563873N226898L196259j7647209l05367
3822.8F07450714N009422K228966L573799P53517m272079j018257O28433L561668M068947
$$ y = [605815964, 609816360, 607238312, 601927986, 605667610, 612055016, 613683968, 603098869, 603312454, 606585846, 607037544, 608247719, 607943916, 609029846, 609783211, 612356491, 613290024, 605829582, 607571068, 610022964, 610626488, 612789078, 610344124, 609192085, 610678139, 610741501, 610912590, 611190491, 611712456, 611462822, 610838280, 610828285, 613363342, 617774048, 613745422, 608666992, 610445747, 614251671, 621940536, 617322769, 604282379, 606894569, 609674454, 615553970, 622391777, 612762909, 606491852, 611018562, 613865051, 614178658, 614206352, 614183350, 616107063, 623012581, 622977066, 606675873, 610416260, 616980133, 622207031, 625403290, 607756081, 607450714, 612460136, 614689102, 618262901, 619016418, 614744339, 613726082, 614354515, 617916183, 621985130]
3831.4F21985130q676948R99412Q697892n504151j882591R690323p607918p322807
3839.2F10378342Q199157m488220j436348Q032685j743889m999352K393913J066895
3846.9F17403183p5150K070809q20236J050796M933548m825630K892075j6027947j226273
3855.6F05375175J1527176j19590k378464K169342K797279L348732n489082p16972
3863.3F16513596O906318o463737p749100M095612O637649Q916359n442924j2997933
3871F10415840K510033O259880M586487j0615769j013031M578514l624K206841N180626
3879.7F24105797l866654q929977N008087K650986J640282N809555j2947808o99119
3887.4F12771149M005317L97797M609947N09110q011093j60943L111725q01849Q32634
$$ y = [621985130, 613308182, 614307594, 623005486, 617501335, 615618744, 625309067, 617701149, 610378342, 618577499, 614089279, 612652931, 620685616, 618941727, 613942375, 616336288, 617403183, 617328033, 619398842, 618578606, 619629402, 624562950, 619737320, 622629395, 606601448, 605375175, 616902351, 616782761, 614404297, 616573639, 619370918, 622719650, 617230568, 616513596, 623419914, 616956177, 609207077, 613302689, 619940338, 628856697, 623413773, 610415840, 612925873, 619185753, 623772240, 613156471, 612143440, 616721954, 616718330, 618925171, 624105797, 620239143, 611309166, 616317253, 618968239, 620608521, 626418076, 613470268, 612771149, 616776466, 617174263, 621784210, 622293320, 614282227, 614121284, 617233009, 616431160, 617263794]
3896.1F17263794O40068K255936L263969j0387001L612938L540382n711097M734077
3903.8F19213066j767082k487755j31493M18320K398300J20278j76621p27844j0986
3912.5F16848183O04858O9885J558113K251893l528443m304199M176216N25780m328728
3921.1F13873558J979523K191429J143036j654244l291740J195412J430320R36928
3928.8F17804222q06389n17311K486992k194328j741181K196465K61268n74913k73971
3937.5F16640854N1651p7820p18269J351852J978836l427696j038666J727905L13416
3946.2F16802063J292381j888771L24249O07949l144875J790390J26267j076088P71904
3954.9F15605469Q07228Q42018j118355K70233m93774o5041P78160j292266M02641
$$ y = [617263794, 617903862, 620159798, 623423767, 613036766, 616649704, 620190086, 614478989, 619213066, 617445984, 614958229, 614826736, 615245056, 617643356, 617763634, 617587013, 616859169, 616848183, 617453041, 617522926, 619081039, 621332932, 617804489, 613500290, 617676506, 618202286, 613873558, 615853081, 618044510, 619187546, 617533302, 614241562, 615436974, 616867294, 617804222, 616997833, 616480522, 618967514, 616773186, 615032005, 617228470, 617489738, 616914825, 616640854, 616692505, 616614685, 615896416, 617248268, 619227104, 615799408, 614760742, 616488647, 616802063, 618094444, 616205673, 616529922, 617137871, 613992996, 615783386, 615909653, 614833565, 615605469, 616412697, 617254715, 616136360, 616406593, 615912819, 615847778, 616625938, 615333672, 615736313]
3963.6F15736313O38771J74408N2719q4190K43682k82478r02138J28251R53140o64330
3973.2F15994148p11441m22020Q0910q1024R8686J211433p7743K17247R3536l12919
3982.8F16090813J61857J91536R9945q90503m77752j33629O25267K0866o72607m234
3992.5F15011559m13361N26733M6006J59950M39300m07524K39830L51296
4000.2F15953789
$$ y = [615736313, 616375084, 616549492, 616602211, 616518021, 616761703, 616479225, 615577087, 615705338, 616658478, 615994148, 615282707, 614860687, 614941597, 614860573, 614959259, 616170692, 616092949, 616310196, 616403732, 616090813, 616252670, 616444206, 616544151, 615653648, 615175896, 615042267, 615667534, 615688400, 615015793, 615011559, 614598198, 615124931, 615170937, 615330887, 615770187, 615362663, 615602493, 615953789]
##END=$$ End of the data block
