##TITLE=$$ Begin of the data block
##JCAMP-DX=5.00 $$ ACD/SpecManager v 10.08
##SPECTROMETER/DATA SYSTEM=Varian
##DATE=15 Jan 2013 10:02:42
##DATA TYPE=INFRARED SPECTRUM
##DATA CLASS=XYDATA
##ORIGIN=
##OWNER=
##NPOINTS=3735
##FIRSTX=399.26403809
##LASTX=4000.35498047
##MAXX=4000.35498047
##MINX=399.26403809
##MAXY=75.07305908
##MINY=22.44697380
##XFACTOR=1.0000000000
##YFACTOR=0.000000100000000
##FIRSTY=46.70051575
##DELTAX=0.96440572
##XUNITS=1/CM
##YUNITS=TRANSMITTANCE
##XYDATA=(X++(Y..Y))
399.3D67005157J0750199p09915j0169678j6574631o463966J964149J959572M285393
407D52046280K195625N437622K21901n396728M27360K122078J545792n13649m221993
415.7D53864288o257667k950630m260407l373299J7099076R607849J06354n364647
423.4D58470917k282906j03226K707901L79639m578438m528198L36037Q044777N365295
432.1D63811798j063232n537873p798233p95478L205833J813812j999206o111374j997795
440.7D43528252M939575N182037K202568K384568j196480o602288k859840L596268
448.4D51174660n52025m30184J989670N15404L804169J25580j437722k98843n355873
457.1D49534836o177635J067924N78461j183243Q20236L73879J062240L708725l46489
$$ plain form
399.3 467005157 477755356 477045441 466875763 450301132 443837166 445801315 447760887 452046280
407 452046280 454241905 459679527 459901428 454504700 454932060 457054138 458599930 458086281 453864288
415.7 453864288 447606621 444655991 440395584 437022285 454121361 463729210 463835564 458470917
423.4 458470917 456188011 456084785 458792686 459172325 454593887 450065689 450401726 458446503 463811798
432.1 463811798 462748566 457210693 449412460 448616982 451822815 453636627 451637421 445526047 443528252
440.7 443528252 448467827 453649864 455852432 458237000 457040520 450438232 447578392 451174660
448.4 451174660 450622635 450192451 452182121 452697525 456501694 456627274 455189552 454890709 449534836
457.1 449534836 443357201 444425125 445003586 443820343 444640579 445014458 446076698 449785423 449438934
465.8D49438934j331138j45493p90481j514664j507683k248649l041306K017174J181106
474.5D42057800q08220N85099K320175j463509n384521k485314k354164l505630j52855
483.2D28808861L610306K104492k53449L5591l86200M82445j139564j287079J391678
491.8D33367081N23071j589012l434677k029381K72751L880081M502373j252632m111557
500.5D30128098o179085k089691N957870L203278n24750k379685j56135K335281k21100
509.2D30074081j211357J674309L47176l014489k954177l218689k159996M22248J148148
517.9D21107254m74434O70357K312240k466354l095894R78432R90601r90906k010575
526.6D17020721o55174l79982k64892l66745r385P66526J473617J744805k166825k376785
$$ plain form
465.8 449438934 448107796 447962303 447171822 445657158 444149475 441900826 438859520 440876694 442057800
474.5 442057800 441249580 441834679 444154854 442691345 437306824 434821510 432467346 428961716 428808861
483.2 428808861 432419167 434523659 434270210 434305801 433919601 434402046 433262482 431975403 433367081
491.8 433367081 433890152 432301140 428866463 426837082 427109833 430989914 435492287 434239655 430128098
500.5 430128098 423949013 421859322 427817192 431020470 430495720 428116035 427959900 430295181 430074081
509.2 430074081 428862724 430537033 430884209 427869720 424915543 421696854 419536858 419959106 421107254
517.9 421107254 420632820 421303177 423615417 421149063 418053169 419031601 420022202 419031296 417020721
526.6 417020721 416365547 415985565 415720673 415353928 415344543 416111069 417584686 419329491 417162666 414785881
536.2D14785881K42119o15769r41200o74362J362991J689873k56882j393890j366348
544.9D12832413l16544Q6212J080933k49939k462883l068695j979599J424713J064491
553.6D08411102q41598k26364j92871j243134k153931j587371l85476j12724J68839
562.3D01836472J254043J113281R78165M48494n48706l36762L42827M36097n57671
570.9D04966240j29700J6861o37550j83296q07419m59709J519470K008438m41704k207527
580.6D03644104p89642k99149n83305k39678Q67539J159019M96865K12135L50036O26946
590.2D05444870N6000k97318m83131j91040N05562l49732k92625Q31909N06515Q79288
599.9D06610298K030640L07770j679535j223374K9907k49938k272454k068825K38839
$$ plain form
536.2 414785881 415028000 414412231 413471031 412796669 414159660 415849533 415592651 414198761 412832413
544.9 412832413 412515869 412602081 413683014 413433075 410970192 407901497 405921898 407346611 408411102
553.6 408411102 407569504 407343140 407150269 405907135 403753204 402165833 401780357 401667633 401836472
562.3 401836472 403090515 404203796 405181961 405630455 405081749 404744987 405087814 405523911 404966240
570.9 404966240 404836540 404853401 404215851 404032555 403225136 402765427 404284897 406293335 405851631 403644104
580.6 403644104 402854462 402555313 401972008 401732330 402599869 403758888 404255753 404467888 404817924 405444870
590.2 405444870 405500870 405203552 404720421 404529381 405034943 404685211 404392586 405224495 405731010 406610298
599.9 406610298 408640938 408948708 407269173 406045799 406075706 405825768 403553314 401484489 401723328
608.5D01723328O17637n93452q37059m5510J59913N34172m35219j705094k81105k98652
618.2C98838959j513367K32811K206688J426353N52292O80275J047096J76125m27284
626.9D03219948R06296J312599Q51516P74651J268883J604690J781235K041664K164192
635.5D15925674K687607J240273k28081O04134J056327J187821O79130L65830J761894
644.2D25280609K199249J289673l00255k91633J868629J733322M2267j167259O25191
652.9D31279793J855392J56632Q57315O19774o37894n50346L54995M19846j065025
661.6D33290482o23780l46946o37246p23419p66411k690162j259880Q003959J508065
670.3D35754662j24741N98869k58140J74370M07981J71318J311226K641945J609040
$$ plain form
608.5 401723328 402340965 401747513 400910454 400864944 401024857 401559029 401123810 399418716 399137611 398838959
618.2 398838959 397325592 397558403 399765091 401191444 401743736 402424011 403471107 403647232 403219948
626.9 403219948 404126244 405438843 406290359 407065010 408333893 409938583 411719818 413761482 415925674
635.5 415925674 418613281 419853554 419625473 420229607 421285934 422473755 423152885 423518715 425280609
644.2 425280609 427479858 428769531 428469276 428177643 430046272 431779594 431821861 430654602 431279793
652.9 431279793 433135185 433291817 434149132 434768906 434131012 433580666 433935661 434355507 433290482
661.6 433290482 432666702 432319756 431682510 430959091 430192680 427502518 426242638 434246597 435754662
670.3 435754662 435629921 436228790 435970650 436145020 436553001 436724319 438035545 440677490 442286530
678.9D42286530M46777J946640J822319O69746J481362J289024n57632j2398J548500
687.6D50920868J787262J724930J576309J127396L04527O45027K5215o99234O08902
696.3D58021202Q81310L47328K45819M10118R88655J974335J315574K09084P55348
705D65148773Q85811N99556o3705K7923P31430J026383R40132O95534J381912J962929
714.6D73336678J267166k68250K59171N14831L77999R69085m19235L87802J198349
723.3D77623596J407967J764908J282501J955948Q08220K07443M43458j62086k92702
732D85039253Q32901K208367J117324N89219R12857J225395R47304L62930o49j150627
741.6D92084274p81440l69111K65198K289429K890282J743888J408616N38177m50668
$$ plain form
678.9 442286530 442733307 444679947 446502266 447172012 448653374 449942398 449384766 449372368 450920868
687.6 450920868 452708130 454433060 456009369 457136765 457441292 458086319 458111534 457412300 458021202
696.3 458021202 458902512 459249840 459495659 459905777 460894432 462868767 464184341 464393425 465148773
705 465148773 466034584 466634140 466570435 466598358 467329788 468356171 469296303 469991837 471373749 473336678
714.6 473336678 474603844 474335594 474594765 475109596 475487595 476456680 476037445 476425247 477623596
723.3 477623596 479031563 480796471 482078972 484034920 484843140 485050583 485494041 485331955 485039253
732 485039253 485872154 488080521 489197845 489787064 490699921 491925316 492872620 493235550 493234901 492084274
741.6 492084274 491302834 490933723 491198921 493488350 496378632 498122520 499531136 500069313 499618645
750.3D99618645M10156j98593M32014P95098N41114J272202Q62122J553649J266442
759E06552849K152710K234840J006088J113091Q5487N59349k57301l08533J021080
767.7E14159660K004280K454110O72035N81055k13700n73425m10538q37173n9777p667
777.3E17768860K94342O69479P49855M05464J261330R82933m25720K32353L52707J77536
787E22469139n87921r2621L38745L98369R27048L63502J000634K92167j96419m10194
796.6E24502449j393890j270943r64737q23746o03065K13356j065521q88787l97339
805.3E17307777k114334j370735j100044k323876k689399j781578k303048k202720
813E01422043m47121q51021r8915R06716n32036j493187o88934n50194m63906Q57430
$$ plain form
750.3 499618645 500028801 499830208 500262222 501057320 501598434 502870636 503732758 505286407 506552849
759 506552849 508705559 510940399 511946487 513059578 513145065 513704414 513447113 513138580 514159660
767.7 514159660 516163940 518618050 519290085 519871140 519657440 519084015 518673477 517836304 517776527 517768860
777.3 517768860 518063202 518732681 519482536 519888000 521149330 522132263 521706543 521938896 522291603 522469139
787 522469139 521881218 521788597 522127342 522525711 523452759 523816261 524816895 525109062 524912643 524502449
796.6 524502449 523108559 521837616 520872879 520049133 519446068 519659424 518593903 517705116 517307777
805.3 517307777 515193443 513822708 512722664 510398788 507709389 505927811 503624763 501422043
813 501422043 500974922 500123901 500024986 500931702 500399666 498906479 498217545 497667351 497203445 498060875
822.6D98060875J539230K012253K052460K611770L080826L410454L346710K662659
830.4E18777237L210220J794281J966172K957611K529869K659568L098870L771553
838.1E40765381K000351K657165K343865O54831R36050R73663K453995J101341J005784
846.8E54892426K231025K124138J905632J422653K169533Q88519N0126M45404J624565
855.4E67754021J379623O94161J489791J556969K011757Q90579J600800J116600m95072
864.1E77999229l35464p72247m0322o17103o12564j135521n60036j42059j411438j247902
873.8E71124573k439080j993637k064018j754646j270752j042862k83585j422157m5700
882.4E58808136j19400n40161n875J2169m72412k515831j059685k51312l53928L79639
$$ plain form
822.6 498060875 499600105 501612358 503664818 506276588 509357414 512767868 516114578 518777237
830.4 518777237 521987457 523781738 525747910 528705521 531235390 533894958 536993828 540765381
838.1 540765381 542765732 545422897 547766762 548421593 549357643 550331306 552785301 553886642 554892426
846.8 554892426 557123451 559247589 561153221 562575874 564745407 565633926 565684052 566129456 567754021
855.4 567754021 569133644 569827805 571317596 572874565 574886322 575776901 577377701 578494301 577999229
864.1 577999229 577663765 576891518 576851196 576234093 575621529 574486008 573925972 573783913 572372475 571124573
873.8 571124573 568685493 566691856 564627838 562873192 561602440 560559578 560275993 558853836 558808136
882.4 558808136 558688736 558148575 558142700 558154869 557682457 555166626 554106941 553855629 553501701 553881340
892.1E53881340O75354R01566O37550R84421N75676R10873M74434k60239m57229m60625
901.7E57863121m90799r47571J376877K909050L014488K351532K530098K795525J381149
910.4E72783470J348343k79999p38373j158866j168862j25122j241608j862831j853866
919.1E65702286q85124l037072m523697l459587l538055l688049m328461l558197l324661
927.8E35359383k815895k582665k643623k332955l322944k601700j803093j368179
935.5E15888329j632309j190758J80015k75573p04270j142769o48727j143150j563988
944.2E07766800o08940o48194o68525k23542J151848O86379J37596L95660l09372o76727
953.8E07002983j159325j109390j940536k041436k185440k594108k105561k117614
$$ plain form
892.1 553881340 554556694 555458260 556095810 557080231 557655907 558566780 559041214 558780975 558323746 557863121
901.7 557863121 557372322 556424751 557801628 560710678 563725166 566076698 568606796 571402321 572783470
910.4 572783470 574131813 573851814 573113441 571954575 570785713 570660591 569418983 567556152 565702286
919.1 565702286 564817162 561780090 557256393 553796806 550258751 546570702 542242241 538684044 535359383
927.8 535359383 532543488 529960823 527317200 524984245 521661301 519059601 517256508 515888329
935.5 515888329 514256020 513065262 513245277 512969704 512265434 511122665 510473938 509330788 507766800
944.2 507766800 507157860 506509666 505841141 505617599 506769447 507455826 507593422 507989082 507679710 507002983
953.8 507002983 505843658 504734268 502793732 500752296 498566856 495972748 493867187 491749573
961.5D91749573j349983j627808j660271j883201k321816j224251j248054k149582
969.2D78284607k842407j984330k079887l158379k891616k732544k917328l891525
976.9D55786591m032784l847732m721604n337105n143852m891052n602989n978661
984.7D16230812n368500m687538m738273n519944m974289m447326m421883m009209
992.4C78063850m680061m045105m241409m711952l044892k509842l118744m182205
1000.1C47529640l595123l391914k823983j921692k806778k443161k299156j799888
1007.8C26447945j967125j963120k016983k343216j053619j633396k293244k659416
1015.5C10517826k098293k371903l038025k410736k782058k525254l151741j971187
$$ plain form
961.5 491749573 490399590 488771782 487111511 485228310 482906494 481682243 480434189 478284607
969.2 478284607 475442200 473457870 471377983 468219604 465327988 462595444 459678116 455786591
976.9 455786591 451753807 447906075 443184471 437847366 432703514 427812462 422209473 416230812
984.7 416230812 410862312 406174774 401436501 395916557 390942268 386494942 382073059 378063850
992.4 378063850 373383789 369338684 365097275 360385323 357340431 354830589 351711845 347529640
1000.1 347529640 343934517 340542603 337718620 335796928 332990150 330546989 328247833 326447945
1007.8 326447945 324480820 322517700 320500717 318157501 317103882 315470486 313177242 310517826
1015.5 310517826 308419533 306047630 303009605 300598869 297816811 295291557 292139816 290168629
1023.2B90168629k085591k349739j132965k340679j442394j541920j314678r52358
1031B77008305j016732q98590o11419M66289n10044J150608J398754J273842J359406
1039.6B79620419J175632K600822J341916J085376j82418l24955l19939o41880j1788
1048.3B84343185j349964m65164j302357j519641j615887j254978k76375j604424j15967
1057B74838428K7714M82960l376L81355J869679J966152L166771J606235J845799J705704
1066.6B87887421J727867J979732Q69808J389008J102257R98840J1082Q98895N29499
1075.3B97394409Q8253J038571k01321Q62617O10066N24845N84087J395951K212448
1084C04509926N87768J158867J533280J918735J664276K185269J910553J129646J959972
$$ plain form
1023.2 290168629 288083038 285733299 284600334 282259655 280817261 279275341 277960663 277008305
1031 277008305 275991573 275092983 274481564 274947853 274437809 275588417 276987171 278261013 279620419
1039.6 279620419 280796051 283396873 284738789 285824165 285641747 285316792 284996853 284354973 284343185
1048.3 284343185 282993221 282528057 281225700 279706059 278090172 276835194 276558819 274954395 274838428
1057 274838428 274866142 275349102 275345726 275727081 277596760 279562912 282729683 284335918 286181717 287887421
1066.6 287887421 289615288 291595020 292464828 293853836 294956093 295954933 295966015 296864910 297394409
1075.3 297394409 297482662 298521233 298319912 299182529 299792595 300317440 300901527 302297478 304509926
1084 304509926 305097694 306256561 307789841 309708576 311372852 313558121 315468674 316598320 318558292
1092.7C18558292J322041K066193J199913O38046J942215K074928J638641J815148
1100.4C31255417K602119J202622J678276K367821J855812J752891Q79402Q26569N88188
1109.1C45009117M21105N91049J575699J617431J250649J413536J059570J281853j4992
1117.7C54205017J34087K31208q32214p1335k68364L9749M94729Q96911J616020J197853
1127.4C57643661O58303J803818K984352K386398K393303J801491J359596K359009
1135.1C73389931L054657K767486K544365K386017J733513J982422J991501J411438
1142.8C91261330P47947O44608N25627O10428J384621R36431P11480L85551p3585l69416
1152.5C96765022p94601l72124o73828n26199j06736o32972o40412J45722K57950j031037
$$ plain form
1092.7 318558292 319880333 321946526 323146439 323784485 325726700 327801628 329440269 331255417
1100.4 331255417 333857536 335060158 336738434 339106255 340962067 342714958 343594360 344420929 345009117
1109.1 345009117 345430222 346021271 347596970 349214401 350465050 351878586 352938156 354220009 354205017
1117.7 354205017 354339104 354570312 353738098 353666763 353398399 353438148 353932877 354829788 356445808 357643661
1127.4 357643661 358301964 360105782 363090134 365476532 367869835 369671326 371030922 373389931
1135.1 373389931 376444588 379212074 381756439 384142456 385875969 387858391 389849892 391261330
1142.8 391261330 392009277 392653885 393179512 393789940 395174561 396110992 396822472 397208023 397134438 396765022
1152.5 396765022 395970421 395598297 394924469 394398270 394291534 393658562 393018150 393163872 393421822 392390785
1162.1C92390785o96106M36592R37882J390304J775361K255554K348289L111153L258743
1170.8D07208557L105049L251763L158836K675858K615661K893791K213707K386208
1178.5D29509430K522774J932106K187919K805939K345467J840629J563645J322479
1186.2D46030388J327934L28789j97487m53300O4125K96402p35474n50041L07884K53983
1195.9D46673203j167641j461907j083870j408157j844101j863022r61494j143494
1203.6D35739517j073608j19133l01552r34639q47778l16086l99704o28510r94682
1212.3D30123825p06329j55869r5634L02849L5591K03819L71475j53427n32570r74312
1221.9D28419418p19680p74956p07627l02276n12962n73349m10691l49998p33300r33609
$$ plain form
1162.1 392390785 391694679 392131271 393069153 394459457 396234818 398490372 400838661 403949814 407208557
1170.8 407208557 410313606 413565369 416724205 419400063 422015724 424909515 427123222 429509430
1178.5 429509430 432032204 433964310 436152229 438958168 441303635 443144264 444707909 446030388
1186.2 446030388 447358322 447687111 447489624 447036324 447100449 447396851 446661377 446111336 446419220 446673203
1195.9 446673203 445505562 444043655 442959785 441551628 439707527 437844505 436883011 435739517
1203.6 435739517 434665909 434546776 434245224 433310585 432462807 432146721 431747017 431118507 430123825
1212.3 430123825 429417496 429261627 429165993 429468842 429504433 429708252 430079727 429926300 429393730 428419418
1221.9 428419418 427699738 426924782 426217155 425914879 425401917 424828568 424417877 424067879 423334579 422400970
1231.5D22400970j208343j502876r24836m22401m46587o77871m47083K12136M88967
1240.2D17472076n8784o79131m73480n31921o57768p56951j003685p46574l70865N1498
1249.9D12244415J90544o3057l26385j02425l7574j96076j21689n31158m77829j17455
1259.5D10461311P4807J25160L01285O94656L50990N33524J116447R31473r3842J11504
1269.2D14607315J085434P83882P80296P34330J231689J386986P58209J148262J211510
1277.8D23727913Q70323R85451J082764P55081J168632J759529J842881J896286J796264
1286.5D35885124J599846J381226J536636P64236M85726O66122O69175Q98704M90418
1295.2D44377213P83271J107292J068154Q19626M80537J9074L4599J52130m34914m768
$$ plain form
1231.5 422400970 421192627 419689751 418764915 418342514 417895927 417218056 416770973 416983109 417472076
1240.2 417472076 417413292 416734161 416260681 415728760 415070992 414314041 413310356 412563782 412192917 412244415
1249.9 412244415 412434959 412371902 412045517 411943092 411905518 411709442 411587753 411056595 410578766 410461311
1259.5 410461311 410536118 410661278 410962563 411657219 412008209 412541733 413658180 414589653 414495811 414607315
1269.2 414607315 415692749 416476631 417256927 417991257 419222946 420609932 421368141 422516403 423727913
1277.8 423727913 424598236 425583687 426666451 427421532 428590164 430349693 432192574 434088860 435885124
1286.5 435885124 437484970 438866196 440402832 441167068 441652794 442318916 442988091 443886795 444377213
1295.2 444377213 445160484 446267776 447335930 448155556 448636093 448655167 448689766 448841896 448406982 448402214
1304.8D48402214k45476m6005L15399K9335J04294r57031r28269o61697n05333l60413
1314.5D45147018q64410k23656L12958L83492L84941P66563J226349J369514J114312
1323.2D49617081P04841O95114J58959K9449M8943L27797K5940n55077l90205m48265
1332.8D50214577R8762r8686n32417o24886o8321M91943k60734P2746O38809J213494
1342.4D51145287J039199R04580J255264N26924N16396K67829K94381j01662k91557
1351.1D55556641r3842m43268j44768k04086p5493j95083r0142n93376o52199o40449
1360.8D52423935j521187n02128o46096K53182M74929n82885q76389p78084J488q08143
1370.4D47438622o38314n01137o76498m59747m08173R46236K11029M0932Q3999j27258
$$ plain form
1304.8 448402214 448156738 448110733 448426132 448455467 448559761 447602730 446674461 446012764 445507431 445147018
1314.5 445147018 444282608 444058952 444371910 444755402 445140343 445906906 447133255 448502769 449617081
1323.2 449617081 450321922 451017036 451175995 451205444 451254387 451582184 451608124 451053047 450662842 450214577
1332.8 450214577 450313339 450214653 449682236 449057350 448989029 449480972 449220238 449292984 449931793 451145287
1342.4 451145287 452184486 453089066 454344330 454871254 455387650 455655479 455949860 455848198 455556641
1351.1 455556641 455462799 455019531 454874763 454670677 454595184 454400101 454309959 453716583 453064384 452423935
1360.8 452423935 450902748 450400620 449754524 450007706 450482635 449899750 449023361 448245277 448246765 447438622
1370.4 447438622 446800308 446299171 445622673 445162926 444754753 445700989 445912018 445952950 446036949 445909691
1380.1D45909691o10047j546745j594047j711121j016312j342888j534500k383575
1387.8D34170456j413193j94206j328774j392135k135048j873627k551536l931122
1395.5D19350815j687927k008973j891708l060188k205811j139412k052650j813774
1403.2D03490372k222367l148880k559623j577530j736031j834526j405258j911278
1410.9C87094879j473236j200981j082497r37652j076317q77686j348838l98942j699028
1419.6C76999702o6413J184043L84064R93080k6703Q94890J137657Q19321J364212
1428.3C83683853L74565J153832J347465J999169J458320J459313K349281Q12569J840591
1437C96478958K766838K967377K102585J764526K022629J220016J495591J152191K203636
$$ plain form
1380.1 445909691 445299644 443752899 442158852 440447731 439431419 438088531 436554031 434170456
1387.8 434170456 432757263 432563057 431234283 429842148 427707100 425833473 423281937 419350815
1395.5 419350815 417662888 415653915 413762207 410702019 408496208 407356796 405304146 403490372
1403.2 403490372 401268005 398119125 395559502 393981972 392245941 390411415 389006157 387094879
1410.9 387094879 385621643 384420662 383338165 382400513 381324196 380446510 379097672 378698730 376999702
1419.6 376999702 376933289 378117332 378501396 379494476 379467773 380362663 381500320 382319641 383683853
1428.3 383683853 384058418 385212250 386559715 388558884 390017204 391476517 393825798 394638367 396478958
1437 396478958 399245796 402213173 404315758 406080284 408102913 409322929 410818520 411970711 414174347
1445.6D14174347J291733M88968J105232K051468K475433J257057J860886J060867
1453.3D25765991J446190R48677n8632O59600M96978N166931K393189K456474J991310
1462D41266708J498490J872673L82271L048782K180290K754860K553787K617226K804375
1470.7D60979462J394233L948594L261985L743172K893219K620239L039437K503395
1478.4D84383736K577095K052459K047158J613388K135086K385063J856346J536865
1486.1E00587196Q51250R87511J119194Q6441j86577P36923M70047m80308o44265j419143
1495.8E02108269m010353M61807j571541l026199m31214j361503j224175j005821P4005
1504.5D90013275p46612o232377m899749K567291K683220p14073J72538q02421j160660
$$ plain form
1445.6 414174347 415466080 415955048 417060280 419111748 421587181 422844238 424705124 425765991
1453.3 425765991 427212181 428160858 428102226 428761826 429258804 434425735 436818924 439275398 441266708
1462 441266708 442765198 444637871 445020142 448068924 450249214 453004074 455557861 458175087 460979462
1470.7 460979462 462373695 466322289 469584274 473327446 476220665 478840904 481880341 484383736
1478.4 484383736 486960831 489013290 491060448 492673836 494808922 497193985 499050331 500587196
1486.1 500587196 501438446 502425957 503545151 503631592 503445015 504181938 504651985 504171677 503527412 502108269
1495.8 502108269 498097916 498559723 496988182 493961983 493530769 492169266 490945091 489939270 490013275
1504.5 490013275 489266663 483034286 478134537 480701828 483385048 482670975 482843513 482041092 480880432
1513.1D80880432k85263j329536j148453k657967l20434J001701M01764k510757k925988
1521.8D71105499K920304J680603J031990o90193J132240J679077Q52051J043091O16607
1530.5D81371269N24369M58984L31802n35507J736832J267585N26658O72416m435997
1539.2D81918411k94265K944488J363678N77507J747398J538964o28205J322709L30162
1547.9D90820847M52232o64864n12275J383552P9155P05757j361885L90053O58150
1556.5D91950722k34185l032989r282761L514710P80907J317939j180229j547813k750512
1565.2D79535789l024711j337204k889366k042732q477097j528893j595878l906212
1572.9D54733696l205223l459206j959915j3212395j712074k960701m608192m541550
$$ plain form
1513.1 480880432 480595169 479265633 478117180 475459213 475138779 476140480 476542244 474031487 471105499
1521.8 471105499 474025803 475706406 476738396 476048203 477180443 478859520 479711571 480754662 481371269
1530.5 481371269 481895638 482354622 482686424 482150917 483887749 485155334 485681992 486354408 481918411
1539.2 481918411 481624146 484568634 485932312 486509819 488257217 489796181 489167976 490490685 490820847
1547.9 490820847 491273079 490608215 490095940 491479492 491558647 492264404 490902519 491292572 491950722
1556.5 491950722 491716537 488683548 479400787 482915497 483696404 485014343 483834114 482286301 479535789
1565.2 479535789 476511078 475173874 472284508 470241776 461764679 460235786 458639908 454733696
1572.9 454733696 451528473 448069267 446109352 432896957 431184883 428224182 423615990 419074440
1580.6D19074440n815048l722077o077728l659897n964241n168762m412270n610084
1588.4C78644333l772011o425209l611221o133461l839073m425583n508499k624398
1596.1C42304878n053978k245941m940681k916603l963814l581486k440491m788208
1603.8C12373676j331062l590546j024646l299694j863175j519089k645321N08938
1611.5B97609081k626629K12574k410698M883l18413m865589K534676j352291J165104
1620.2B89952698j360874J392021l4542j628189K092590n89104J983147j421356J674156
1628.9B92060547Q51993J222344J761474N04056K623195l99246L120327j007385L297920
1637.5C04035225J858692R02138L012028Q04042L290081J031380K439404J173648q98838
$$ plain form
1580.6 419074440 413259392 409537315 403459587 399799690 393835449 388666687 384254417 378644333
1588.4 378644333 374872322 368447113 364835892 358702431 354863358 350437775 344929276 342304878
1596.1 342304878 337250900 335004959 330064278 327147675 323183861 319602375 317161884 312373676
1603.8 312373676 311042614 307452068 306427422 303127728 301264553 299745464 297100143 297609081
1611.5 297609081 294982452 295195026 292784328 292789211 292470798 287605209 290139885 288787594 289952698
1620.2 289952698 288591824 289983845 289949303 288321114 290413704 289824600 291807747 290386391 292060547
1628.9 292060547 292912540 294134884 295896358 296400414 299023609 298624363 301744690 300737305 304035225
1637.5 304035225 305893917 306796055 309808083 310612125 313902206 314933586 317372990 318546638 317647800
1646.2C17647800L586712l66668M060936P54509K891159J525535m199905L552055J076889
1654.9C30529022M258576Q54721K784462J512603J748963J729278J030236L377723
1662.6C47825584J348916L977699K393875L296394K836609L056107N347557J050949
1670.3C71133690M867782K881546M300194L249512L040771N061379L885002N427132
1678D03847008L250313N096397M273567M580383M833756J162338P832489L976784O495247
1686.7D45348282M525719M532051N513687N291328N826187M920998N656509M900246
1694.4D86515007N060196L485870N411530O086960N418701M955635K030983O863251
1702.1E25828133N336036M785691M123878L612404L014297L156853L910484K701188
$$ plain form
1646.2 317647800 321234512 320867844 324928780 325683289 328574448 330099983 325900078 329452133 330529022
1654.9 330529022 334787598 335642319 338426781 339939384 341688347 343417625 344447861 347825584
1662.6 347825584 349174500 353152199 355546074 358842468 361679077 364735184 370082741 371133690
1670.3 371133690 376001472 378883018 383183212 386432724 389473495 394534874 398419876 403847008
1678 403847008 407097321 412193718 416467285 421047668 425881424 427043762 434876251 438853035 445348282
1686.7 445348282 449874001 454406052 459919739 465211067 471037254 475958252 481614761 486515007
1694.4 486515007 491575203 495061073 500472603 506559563 511978264 516933899 518964882 525828133
1702.1 525828133 531164169 535949860 540073738 543686142 546700439 549857292 553767776 556468964
1709.9E56468964K665748K872772K872086K438774P97196J747932L030205J419105
1717.6E74312782j181602M041748K966270J793442J671524J144295J598129K023926
1725.3E88370514J696014J537209K205353J924858l96614P11364K989617K253227j821823
1734E99469719j655312M966965M326973K256699K460899J184616N10216L839302K395935
1742.7F19756012J048393K299233L352089K989730K714043L206978K374687M283905
1750.4F42025070K302094K426529M750824L122558K775498K276992J057892K431336
1758.1F63168793L337631L150482K637863l37829J594085L606034J474762J402893
1765.8F80034714J448898O92596q88900K792434L852082J33896r24530k35291L930969
$$ plain form
1709.9 556468964 559134712 562007484 564879570 567318344 568115540 569863472 572893677 574312782
1717.6 574312782 573131180 577172928 580139198 581932640 583604164 584748459 586346588 588370514
1725.3 588370514 590066528 591603737 593809090 595733948 595337334 596048698 599038315 601291542 599469719
1734 599469719 597814407 602781372 607108345 609365044 611825943 613010559 613520775 617360077 619756012
1742.7 619756012 620804405 623103638 626455727 629445457 632159500 635366478 637741165 642025070
1750.4 642025070 644327164 646753693 651504517 654627075 657402573 659679565 660737457 663168793
1758.1 663168793 666506424 669656906 672294769 671956940 673551025 677157059 678631821 680034714
1765.8 680034714 681483612 682176208 681287308 684079742 687931824 688065720 687141190 686905899 690836868
1774.5F90836868K111512j63727K031707N17807J214600N99442J0070J669007K257309
1783.2G01084595J792373l18527O94122J317215Q79212K52914P18613J00861j55564
1791.8G06365814m80346Q44802L761063J021118J65634J374665J168823K90146r86099
1800.5G13525620J732711J38550P13043J351090P25479J601868N55954N79376Q58307
1809.2G21781998R72213r61303K0523J104126K92053R57260N28412J166687L6392N64347
1818.8G26462708J427917P04880R35745n59921N01861m1275j992645P59048J923218
1827.5G30121536J646805l05481j332855J217270K263336M05731Q3389K63138k79693
1836.2G34083176l61557l18451J524505O63758Q30078R20791J023789K09732l903656
$$ plain form
1774.5 690836868 692948380 692784653 694816360 695334167 696548767 697148209 697158279 698827286 701084595
1783.2 701084595 702876968 702558441 703252563 704569778 705448990 705701904 706420517 706521378 706365814
1791.8 706365814 705885468 706730270 710491333 711512451 711678085 713052750 714221573 714511719 713525620
1800.5 713525620 715258331 715396881 716109924 717461014 718186493 719788361 720344315 720923691 721781998
1809.2 721781998 722754211 721792908 721813431 722917557 723209610 724166870 724695282 725861969 725898361 726462708
1818.8 726462708 727890625 728595505 729531250 728971329 729473190 729431915 727439270 728198318 730121536
1827.5 730121536 731768341 731462860 730130005 731347275 733610611 734016342 734099731 734362869 734083176
1836.2 734083176 733721619 733403168 734927673 735591431 736421509 737342300 738366089 738575821 734672165
1844.9G34672165K148590J336899o40106m73709M43496J181183N51529J195831L29895
1853.6G40745773O80466m1428j92031O64672m37698k2430m74320J82572L5400O52084
1863.2G41793060J069870K04621O95724l58581N42450q15430j053238R45053O07681
1871.9G43631210M66843j41525L00140J11771J102829P26013k4414l9826o86111K64893
1881.5G45711823k59171J93939l16162N0507J024856M22440J283722l79639j141968
1890.2G46590347N9281L36151J05209O7063k56882r32465J087570M99878M36173P15103
1899.8G48707428K79999O12182m37927m24881m27704J59684l34473m97131J52511J3580
1909.5G47803268N42603N25284J075058j74713j12000m66461p66754O83746j426849
$$ plain form
1844.9 734672165 736820755 738157654 737517548 737043839 737487335 738668518 739220047 740415878 740745773
1853.6 740745773 741426239 741384811 741192780 741857452 741419754 741397324 740923004 741105576 741140976 741793060
1863.2 741793060 742862930 743067551 743763275 743404694 743947144 743131714 742078476 743023529 743631210
1871.9 743631210 744098053 743956528 744256668 744368439 745471268 746197281 746172867 746133041 745446930 745711823
1881.5 745711823 745452652 745646591 745330429 745380936 746405792 746828232 748111954 747732315 746590347
1890.2 746590347 746649628 746985779 747090988 747158051 746901169 745968704 747056274 747556152 747992325 748707428
1899.8 748707428 748987427 749599609 749161682 748736801 748309097 748468781 748134308 747637177 747789688 747803268
1909.5 747803268 748345871 748871155 749946213 749771500 749659500 749193039 748426285 749110031 747683182
1918.2G47683182j9074R74274R84192P52106q56171J35269O66351M10462o81763n03998
1927.8G49544830k37045k0752N0354K2431Q50601J2283L99857P6446P6k36435q39767
1938.4G49622879m9896l54309N36880r11636p63855J303787M19769j22757k71148P78122
1948.1G50187836j45035m29611l62091k94342K44979l39889K51846j58005N36576K51236
1957.7G49743500k00272K21558p09000k94876n02472l3417j68457N6992K78854n23834
1967.3G47868576O16150L91617M05884j71280o50559p21206m12522L68271j80435N32989
1977G48047485M10080J73035J11923J48316J93710m61197k48718p92847m17023m94155
1986.6G46670609k33384M36173K24304N59998j58768k7619m7225J77764l75976r54590
$$ plain form
1918.2 747683182 747664108 748638382 749622574 750374680 749518509 749653778 750320129 750730591 750048828 749544830
1927.8 749544830 749307785 749287033 749337387 749359818 750210419 750222702 750622559 750699005 750699081 750462646 749622879
1938.4 749622879 749572983 749218674 749755554 748843918 748080063 749383850 749803619 749680862 749409714 750187836
1948.1 750187836 750042801 749613190 749251099 748956757 749201736 748861847 749113693 748955688 749492264 749743500
1957.7 749743500 749543228 749764786 749055786 748760910 748258438 748225021 748056564 748113556 748392410 747868576
1967.3 747868576 748484726 748876343 749282227 749110947 748460388 747739182 747326660 747694931 747514496 748047485
1977 748047485 748457565 748630600 748742523 748890839 749084549 748623352 748374634 747581787 747164764 746670609
1986.6 746670609 746437225 746873398 747097702 747657700 747498932 747471313 747424088 747601852 747225876 746271286
1996.3G46271286j47781l01514M40826r994m654M12674m1199j70517l15246L13339
2005.9G46447220n90439p62939j33057P8277k57644m18778N05524P0267L10135K08664
2015.6G45457230l17994p33413m74320J02921m76227j07346m05044J91421L71552k12708
2025.2G43396072J86539j00708J07346k95029k08359n78613o40183j94473n05066L47138
2034.9G41514664K31933K23542K44674K25678K29o24314o35071n18264K03323n26810
2044.5G40339584n17959j5106J75857N15976n0888O3705m31518j76697O2485m00849
2054.1G39564590o72073k38724N21851k10419N0125o637L86276M96674j15891j45492
2063.8G39630280j183777k16523J90430r0713l3493j51520K95029l1815K4719l5858
$$ plain form
1996.3 746271286 746123505 745821991 746262817 746252823 746248169 746660843 746619644 746449127 746133881 746447220
2005.9 746447220 745856781 745093842 744960785 745039062 744781418 744362640 744868164 744938431 745248566 745457230
2015.6 745457230 745139236 744405823 743931503 744034424 743558197 743450851 743045807 743237228 743608780 743396072
2025.2 743396072 743582611 743481903 743589249 743294220 743085861 742507248 741867065 741672592 741167526 741514664
2034.9 741514664 741746597 741970139 742214813 742440491 742440720 741816406 741181335 740663071 740866394 740339584
2044.5 740339584 739821625 739806519 739982376 740498352 740447464 740511169 740079651 739902954 739965439 739564590
2054.1 739564590 738892517 738653793 739175644 738965225 739015350 739008713 739394989 739891663 739775772 739630280
2063.8 739630280 738446503 738229980 738420410 738329697 738296204 738144684 738439713 738407898 738432617 738396759
2073.4G38396759K79694j53733k16674N2261l81317k05765p22809J15509N2262j24588
2083.1G37091599L64990p2708K3803k36511K61459k83203m35714l28522m05808J41678
2092.7G36121063l76739M68368L47061J02845l662n74341o8741k66724m11834n17121
2102.4G34820175Q9264o1264n5695J93558k30636j0300m35638K33001J95542k59934
2112G34478073m43420p52487l51487k06146M89426J12228L19290K20185j96534O7597
2121.6G33736725l47138N570l73230o0578m30145m81720L34015r6817L13416K00424
2131.3G32800522L92837j04065j41296j68228p07550L05m74396K09732K90909K04621
2140.9G32303391L72238j32676L37525k65656k94418J2436J69601m76837m24957K87781
$$ plain form
2073.4 738396759 738676453 738522720 738306046 738358307 737976990 737771225 737048416 737163925 737216187 737091599
2083.1 737091599 737456589 737383881 737407684 737171173 737432632 737149429 736713715 736385193 735979385 736121063
2092.7 736121063 735744324 736212692 736559753 736662598 736658936 736084595 736015854 735749130 735337296 734820175
2102.4 734820175 734909439 734848175 734792480 734986038 734755402 734745102 734309464 734542465 734738007 734478073
2112 734478073 734034653 733282166 732930679 732724533 733213959 733326187 733645477 733865662 733669128 733736725
2121.6 733736725 733389587 733395157 733021927 732961349 732531204 732049484 732383499 732286682 732600098 732800522
2131.3 732800522 733193359 733089294 732947998 732779770 732072220 732072525 731598129 731807861 732098770 732303391
2140.9 732303391 732675629 732542953 732880478 732614822 732320404 732332840 732502441 732025604 731600647 731888428
2150.6G31888428j1521N58167L967l9902q3999j6327K44522j86310J95160n14297j61972
2161.2G31875916J7242L9978K26288J80511N67627l38745J12534j40534l24249L2349
2170.8G32248917j45569K8076l46603N84793K32391N5389K60849q3084K24762l18908
2180.5G32741013j94855k32315K75726L27530J00861J86767k01874J35651k96249K57034
2190.1G33099289M28467j10398j42135j35727K48566j08719j30616l01666J41983M07944
2199.8G33396988J89056q2092k84195M77829J1902j15509k57263P0800J54648k93045
2209.4G33269119M63639P2860K31629k29416j73035J97754k59094J99737k78473J15891
2219G33610611p8964L3798O31943J60827j42746m65316K81906m2191j62048j73950
$$ plain form
2150.6 731888428 731876907 732435074 732439041 732399139 732315140 732298813 732543335 732357025 732552185 732037888 731875916
2161.2 731875916 731893158 731933136 732159424 732339935 732907562 732568817 732681351 732540817 732216568 732248917
2170.8 732248917 732103348 732131424 731784821 732369614 732602005 732657394 732918243 732835159 733059921 732741013
2180.5 732741013 732546158 732313843 732589569 732917099 733017960 733204727 733002853 733138504 732842255 733099289
2190.1 733099289 733527756 733417358 733275223 733139496 733388062 733279343 733148727 732847061 732989044 733396988
2199.8 733396988 733586044 733503952 733219757 733697586 733709488 733593979 733336716 733407516 733562164 733269119
2209.4 733269119 733732758 733805618 734037247 733807831 733634796 733832550 733573456 733773193 733494720 733610611
2219 733610611 733531647 733565445 734197388 734358215 734215469 733750153 734032059 733989868 733827820 733653870
2228.7G33653870j07499K29264l52783J57547k1973J07727P858L739L24554l30353
2238.3G33671951m97818m04739N90897K2659J9989L83301k73743K23923l4104J39923
2248G33842239l64837m14200J55563K35138J02768m76227J09101k71454J82419L09600
2257.6G33410110m2419L41950k80991o7673l11813L7384n8975j12687K85721l45154
2267.3G32855453n4321j82648J90812J56936n2871k91367n66864P935r1019L64990
2276.9G32337036L6011J79748P4006n73807M5624K14080J14594n78919k29263j86310
2286.5G31432800j60217l0746j46714O14090k62298k9908N1880j67007j1444m53491
2296.2G30836945o9657m64248p7n7525J45645J08413o77032k43912k94189L59878m24423
$$ plain form
2228.7 733653870 733546371 733775635 733422852 733580399 733558426 733666153 733674011 733677750 734002304 733671951
2238.3 733671951 733174133 732769394 733360291 733382950 733402939 733786240 733512497 733736420 733702316 733842239
2248 733842239 733477402 733063202 733218765 733453903 733556671 733080444 733189545 732918091 733100510 733410110
2257.6 733410110 733367691 733709641 733428650 733360977 733049164 733086548 733027573 732914886 733200607 732855453
2267.3 732855453 732801132 732618484 732809296 732966232 732913361 732621994 732055130 732063065 731972046 732337036
2276.9 732337036 732373047 732552795 732626801 732052994 732098618 732312698 732427292 731848373 731619110 731432800
2286.5 731432800 731272583 731241837 731095123 731709213 731446915 731417007 731468887 731301880 731290436 730836945
2296.2 730836945 730767288 730303040 730302963 730245438 730391083 730499496 729822464 729578552 729284363 729644241 729219818
2306.8G29219818n96695j92108k08740J60980k07901R67484k65046r66034q7432K67791
2316.4G28092117K89078r11331l79562p45469K8458L14865k30484J75095k48108M23050
2326.1G26807709o39649p77054m99649j20544k84500n68543M73633j98517J20087m02527
2335.7G23910446N54123L97186n10330o96335j154937J014099j19858k12936m12980
2344.4G22768478l26233N31540J13755O94275j03684P0496l90244m19006k03858k93121
2354.1G22442398M29993j987000k14615j309051j306076J790161O34308p91779k125168
2362.7G17563171K20642k24533M83780N71595J40075M51508n18799J161652K64358
2371.4G20113449N41306l4104q11081j44577r19876m33807k23007M08477K69776q9340
$$ plain form
2306.8 729219818 728623123 728431015 728222275 728383255 728175354 729142838 728877792 727911758 727824326 728092117
2316.4 728092117 728381195 727469864 727090302 726344833 726373291 726688156 726457672 726632767 726384659 726807709
2326.1 726807709 726168060 725391006 724891357 724770813 724486313 723917770 724391403 724192886 724312973 723910446
2335.7 723910446 724464569 724861755 724351425 723655090 722500153 723514252 723394394 723181458 722768478
2344.4 722768478 722442245 722973785 723087540 723781815 723678131 723748627 723358383 722939377 722735519 722442398
2354.1 722442398 722872391 720885391 720670776 719361725 718055649 719845810 720480118 719688339 717563171
2362.7 717563171 717783813 717559280 718043060 718614655 718754730 719206238 718687439 719849091 720113449
2371.4 720113449 720654755 720620651 719809570 719664993 718745117 718311310 718088303 718496780 718766556 718677216
2381.1G18677216L37066N35431K91367p21131l03268j42212o43692m83017M7073j49002
2390.7G17445831n58700L31650K05612j83716k72522o6147k12173p33033l35769o93436
2400.3G14927597l33099K21710l8071m40140k61993K17667k67411k32544l64990m74243
2410G12954483q51288p04727K08588j7701j65481m54178l4409K41395j13602l86124
2419.6G10676956o16302m81568p66678k85415j14746j53656l38898l34244K31552k08969
2429.3G07608032k15225o47125n13611l30353n21164q9035o98623l93143J20163R8343
2438.9G04418259o5384k26441m33807n99823j69754n72968n87387p13272l27835J61591
2448.6G00883179k75879q7509m88739l54157j97067n5771j89819r51920n69916k53067
$$ plain form
2381.1 718677216 719014282 719549713 719841080 719119949 718816681 718674469 718030777 717547760 717594833 717445831
2390.7 717445831 716887131 717218781 717424393 717240677 716968155 716902008 716689835 715956802 715621033 714927597
2400.3 714927597 714594498 714816208 714778137 714337997 714076004 714293671 714026260 713793716 713428726 712954483
2410 712954483 712103195 711398468 711607056 711589355 711423874 710969696 710935287 711176682 711063080 710676956
2419.6 710676956 710060654 709579086 708812408 708526993 708412247 708258591 707919693 707585449 707817001 707608032
2429.3 707608032 707392807 706745682 706232071 705901718 705380554 705291519 704592896 704199753 704319916 704418259
2438.9 704418259 704352875 704126434 703692627 703092804 702923050 702350082 701762695 701049423 700721588 700883179
2448.6 700883179 700607300 700519791 700031052 699676895 699479828 699424057 699234238 698282318 697712402 697459335
2458.2F97459335j05667k37198j40228n18722n68543J56174k01035m14886r05075p54090
2467.8F93770065l37219k77100l04336p12891l41186K0904Q2550o81305o49261k26975
2477.5F90343246l53698n0888n44205n69992p14188n27725p5073l94058m62342n59845
2487.1F86091232M044J06048k11486n68009r80224r19953n28946k93121o90994k97928
2496.8F81710663j73264n9128p2631l78800k68097q72574n24215k92359n47943p45086
2506.4F77776566q46482l52173k41012k39563n55420j78909j36338m67682o18820r35364
2516.1F73204803m58297k43988p172n70908m16641p2479n57785j63803o82449m39530
2525.7F69591751m25339p98111n64804m94842L8910k89002k05688m26026l51867j35804
$$ plain form
2458.2 697459335 697353668 697116470 696976242 696457520 695888977 696045151 695844116 695429230 694524155 693770065
2467.8 693770065 693432846 693155746 692851410 692138519 691797333 691818237 691900787 691219482 690570221 690343246
2477.5 690343246 689989548 689938660 689394455 688824463 688110275 687582550 687507477 687113419 686651077 686091232
2487.1 686091232 686095276 686201324 685989838 685421829 684441605 683521652 682992706 682699585 682008591 681710663
2496.8 681710663 681537399 681478271 681405640 681026840 680758743 679886169 679361954 679069595 678521652 677776566
2506.4 677776566 676930084 676577911 676336899 676097336 675541916 675363007 675226669 674758987 674140167 673204803
2516.1 673204803 672746506 672502518 672495346 671924438 671507797 671435318 670877533 670713730 670031281 669591751
2525.7 669591751 669166412 668368301 667803497 667308655 667347565 667058563 666852875 666426849 666074982 665939178
2535.4F65939178n72509q5144n60379n78080m55856o53458k21405l73764n08194m19159
2545F61511230j46789k18811m81720p76444o03408j57853k49862m09241l29590j43127
2554.6F57994385o00739k66952j81885o87027n77240o96640m76151m99115P7820K13852
2564.3F54300308m34036p57675j061096j23825Q4381n12467n14068k03629m55551n57938
2573.9F49764404p2174n11322k29797q3542m39224n76401m86984l84140n42755K03247
2583.6F46641312l67966o42395k56043q08181r15451p82929j56936l44773n9662J82724
2593.2F42489700m69207n61219p87201l36151l88756o06651n12924k87895j1368n47562
2602.9F37980766o79245p15065l69339k06909n71937q68111o00014R0637k74276n22690
$$ plain form
2535.4 665939178 665366669 665281525 664721146 664143066 663687210 663033752 662812347 662438583 661930389 661511230
2545 661511230 661364441 661145630 660663910 659887466 659284058 659126205 658876343 658467102 658137512 657994385
2554.6 657994385 657393646 657126694 656944809 656257782 655680542 654983902 654507751 654008636 654086456 654300308
2564.3 654300308 653866272 653108597 652047501 651923676 652008057 651495590 650981522 650777893 650322342 649764404
2573.9 649764404 649692230 649180908 648951111 648867569 648428345 647851944 647364960 646980820 646438065 646641312
2583.6 646641312 646273346 645630951 645374908 644566727 643651276 642868347 642711411 642366638 642306976 642489700
2593.2 642489700 642020493 641459274 640672073 640335922 639947166 639340515 638827591 638539696 638528328 637980766
2602.9 637980766 637301521 636586456 636217117 636010208 635438271 634570160 633970146 634060783 633786507 633263817
2612.5F33263817o41136o92826o99806l65867r2812q04176o37818n41153o69975p16515
2622.1F27401733n61027k10343m58145k38456k93351l98445m44946n56145n87883o35261
2631.8F23017731o27861j016465m95376j16310m38729o74972n77164k97966l59917
2640.5F18412971k06375n66558n77012m69818p39364o46782k68593j10626q23784m98390
2650.1F13505669l66021o93855l69377n84602o67267n87998l30581m05579n02434n59311
2659.8F08438644l71666P3052k92320l61138o21986n52940l03345l58391m37660o87599
2669.4F04524651n5771k20948n21926k68479k10762j90163l57284k74201o12754m66118
2679F01346245l80097n39436n70450o68678o600j06277l00331q5487j07766m23965
$$ plain form
2612.5 633263817 632622681 631929855 631230049 630864182 630771370 629967194 629329376 628788223 628118248 627401733
2622.1 627401733 626840706 626630363 626172218 625933762 625640411 625241966 624797020 624240875 623652992 623017731
2631.8 623017731 622389870 621373405 620878029 620761719 620322990 619648018 619070854 618772888 618412971
2640.5 618412971 618206596 617640038 617063026 616593208 615853844 615207062 614938469 614827843 614004059 613505669
2650.1 613505669 613139648 612445793 612076416 611491814 610824547 610236549 609905968 609500389 608997955 608438644
2659.8 608438644 608066978 608140030 607847710 607486572 606864586 606311646 606008301 605649910 605212250 604524651
2669.4 604524651 604468880 604247932 603726006 603457527 603246765 603056602 602699318 602425117 601812363 601346245
2679 601346245 600966148 600426712 599856262 599187584 599180984 599074707 598774376 598688889 598581123 598157158
2688.7E98157158r34372q18672n27916l30544m32014l51677k02294j8157p7401l84674
2698.3E94079437j67579n10674o09436l95393m76837o96679m85649L87650J54724n37109
2708E90742455n66216j43967m69513p69958l23448k74086j79711m69741l32566k69813
2717.6E86943436m66118q5335j19095k54631m28772j10016m2915l95126q01468n84679
2727.3E83655281L12233j66359l60870l75328l92990K4185k68097m56734m48646j94169
2736.9E81328506k27394m17060n97191j40152L87268o2828k21711o85653k28157L55530
2746.5E79491158j53466n01289m08440L33824j56974p84340o04477l32031j98975j79291
2756.2E76505699N1232l39089R7160O104r63669r09233l57895J58768m51203o35757
$$ plain form
2688.7 598157158 597222786 596404114 595876198 595545654 595113640 594761963 594559669 594541512 594464111 594079437
2698.3 594079437 593911858 593401184 592791748 592396355 591919518 591222839 590737190 591124840 591279564 590742455
2708 590742455 590176239 590032272 589562759 588792801 588469353 588195267 588015556 587545815 587213249 586943436
2717.6 586943436 586477318 586391983 586272888 586018257 585589485 585479469 585436554 585041428 584239960 583655281
2727.3 583655281 583967514 583801155 583440285 583064957 582671967 582696152 582428055 581971321 581522675 581328506
2736.9 581328506 581101112 580684052 580086861 579946709 580333977 580271149 580049438 579363785 579135628 579491158
2746.5 579491158 579337692 578836403 578427963 578761787 578604813 577820473 577215996 576883965 576684990 576505699
2756.2 576505699 576556931 576217842 576315002 576321106 575357437 574448204 574090309 574249077 573797874 573162117
2765.8E73162117n7831Q1635j96381m19884k18048l51791l98178m88014m53110l04413
2775.5E70356102n28259n70641k19574k51999o79970n02357m61273l17497l05024m27780
2785.1E66091728l89824n69992k00996j76163k28386o74095r19571o58188o76498J411
2794.8E61599426m29687p16591m64020r04999q57238o71578m93278o14548m97398p13425
2804.4E55236664n85594k22969q61588o24618m30108q81500j085930p05299n85861
2813.1E49253197r01985r12247r10568m61998o88057p77932p21397r47838n95970r45091
2822.7E41390114r43604q48846j138687j094322p71523m07028p71980r63784q35266
2831.4E33615074p86552p14340o28777j119614j634559j362839j150894j076660j459046
$$ plain form
2765.8 573162117 573104286 573185921 572989540 572569656 572351608 571999817 571601639 571113625 570660515 570356102
2775.5 570356102 569827843 569257202 569037628 568785629 568105659 567603302 567142029 566824532 566519508 566091728
2785.1 566091728 565701904 565131912 564930916 564754753 564526367 563852272 562932701 562274513 561598015 561599426
2794.8 561599426 561169739 560453148 559989128 559084129 558226891 557555313 557062035 556447487 555950089 555236664
2804.4 555236664 554651070 554428101 553566513 552941895 552511787 551630287 550544357 549839058 549253197
2813.1 549253197 548351212 547438965 546528397 546066399 545378342 544600410 543879013 542931175 542335205 541390114
2822.7 541390114 540446510 539597664 538458977 537364655 536593132 536186104 535414124 534450340 533615074
2831.4 533615074 532828522 532114182 531485405 530365791 528731232 527368393 526217499 525140839 523681793
2840.1E23681793j603889j509209j560287j762238k064819j655579j685028j770172
2847.8E10070572j708946j923027k089272k065391j423913q71238o01387q09098l89099
2856.5D98189201K17781J41907j06964o65054m45214l43093l94135o62041o06537j57547
2866.1D95168304j018371j241799j195907j164475r97924q58651j37977j58272n28755
2874.8D87866173r52988j049690j054726r87243r38263r56879l52898m48188p51267
2883.5D80374031j077576r32350p70035r80758n34210q84285j021309j108666j198463
2892.2D71866379q81615q89282p46536r95369r43451j117630j097336n66902j91651
2900.8D64436607l08303j221581r27048o51588o99997p11403q26874o86378j413460
$$ plain form
2840.1 523681793 522077904 520568695 519008408 517246170 515181351 513525772 511840744 510070572
2847.8 510070572 508361626 506438599 504349327 502283936 500860023 499988785 499387398 498578300 498189201
2856.5 498189201 498406982 498548889 498441925 497776871 497331657 496988564 496594429 495932388 495325851 495168304
2866.1 495168304 494149933 492908134 491712227 490547752 489549828 488691177 488553200 488394928 487866173
2874.8 487866173 486913185 485863495 484808769 483821526 482883263 481926384 481573486 481125298 480374031
2883.5 480374031 479296455 478364105 477594070 476613312 476079102 475194817 474173508 473064842 471866379
2892.2 471866379 470984764 470095482 469348946 468353577 467410126 466292496 465195160 464628258 464436607
2900.8 464436607 464128304 462906723 461979675 461328087 460628090 459916687 459089813 458403435 456989975
2909.5D56989975j243248n89676q15697j583442j712494j103401j169320j199455j579056
2918.2D45994186j441955q60214j123619j429024j163368m41933n79453r01374n13993
2926.9D37539253K20757M01344J96724k03629m92324N58281M67071K2469M13894K40822
2936.5D39364662N26810M62952K25181O76499R25674P43751P89719P20329M70696Q82263
2946.2D45788536J030922O35300M90265O20040M41323O34498P64237M71420O60248
2954.8D51536789K01874K40402N61371K84347L66326O64215J222153R04579L10707
2963.5D56292763N26047J112823R82628L97568L32527L38592P14798Q11920R59511
2972.2D62469177Q94776N86204N32570K55699O21338M92325M95415P85904N17273K94570
$$ plain form
2909.5 456989975 455746727 455157051 454341354 452757912 451045418 449942017 448772697 447573242 445994186
2918.2 445994186 444552231 443692017 442568398 441139374 439976006 439534073 438954620 438053246 437539253
2926.9 437539253 437760010 438161354 438358078 438154449 437662125 438220406 438687477 438709946 439123840 439364662
2936.5 439364662 439891472 440354424 440579605 441256104 442181778 442925529 443715248 444435577 444906273 445788536
2946.2 445788536 446819458 447454758 447945023 448565063 449006386 449640884 450405121 450876541 451536789
2954.8 451536789 451738663 451979065 452540436 452824783 453191109 453855324 455077477 455982056 456292763
2963.5 456292763 456818810 457931633 458914261 459311829 459644356 459982948 460697746 461509666 462469177
2972.2 462469177 463363953 463950157 464482727 464738426 465359764 465852089 466347504 467133408 467650681 467945251
2981.8D67945251J27602M49867J56784M3183K79922K03400Q3618J50147M13856k38457
2991.5D69615173k34413k27775k43073K03552q2359o6872m90341n05409l26843n93643
3001.1D67047997l11242p5760l68499j033249r02214r31320p45087k22359m05350l25469
3010.8D61727448m19083o55098p79877o70013r56497p68929N760p84797j295510o56128
3020.4D54747276m22897q37784o89430m29726p36541r51615r86938l11051o32820j179733
3030.1D47568741j043396j218147n84565l90472q53348j067695o31981o60057j335869
3038.7D39783211p42874n45693j090660r58061n12734o69670j318550j483879j170387
3047.4D31290703p15103k86751j68457j122055j755982j000099m97970p34368r43260
$$ plain form
2981.8 467945251 468072853 468522720 468679504 468722687 469002609 469206009 469289627 469439774 469853630 469615173
2991.5 469615173 469380760 469152985 468909912 469113464 469031105 468964233 468473892 467968483 467641640 467047997
3001.1 467047997 466736755 466660995 466292496 465259247 464357033 463425713 462680626 462458267 462052917 461727448
3010.8 461727448 461308365 460653267 459873390 459203377 458246880 457477951 457483711 456698914 455403404 454747276
3020.4 454747276 454324379 453486595 452797165 452367439 451630898 450679283 449692345 449381294 448748474 447568741
3030.1 447568741 446525345 445307198 444722633 444332161 443478813 442411118 441779137 441119080 439783211
3038.7 439783211 439040337 438494644 437403984 436445923 435933189 435263519 433944969 432461090 431290703
3047.4 431290703 430575600 430288849 430120392 428998337 427242355 426242256 425744286 425009918 424066658
3056.1D24066658p88231o75545q10127j222305q48656m00925p34672q34313j133728
3064.8D16618156q73184p72285q57010m59519p77702p52296n69687o88324o84242o61126
3074.4D09522781q23211j077614j156807j053848n75753l89022l69683o96411q24127
3083.1D02556305q48427j057205m56085o41327q78029r11484p84607l28483q53920
3091.8C95796738p50275o92139p98072o56472o59294n29556q37021q28133j056366
3100.5C88989410j072044o81152m71230n29785q94280p66792j024895o53839l82537
3109.1C82512856q92563n42069q18062j276931q72155m78592n77621p14607o51436
3117.8C75688820q24242r99946r73320r73282j096115p77016o76117p80029o78330
$$ plain form
3056.1 424066658 423278427 422602882 421792755 420570450 419721794 419320869 418586197 417751884 416618156
3064.8 416618156 415744972 414972687 414115677 413656158 412878456 412126160 411556473 410868149 410183907 409522781
3074.4 409522781 408699570 407621956 406465149 405411301 404835548 404446526 404076843 403380432 402556305
3083.1 402556305 401707878 400650673 400194588 399553261 398675232 397763748 396979141 396650658 395796738
3091.8 395796738 395046463 394354324 393556252 392899780 392240486 391710930 390873909 390045776 388989410
3100.5 388989410 387917366 387236214 386764984 386235199 385340919 384574127 383549232 382895393 382512856
3109.1 382512856 381620293 381078224 380260162 378983231 378111076 377632484 377054863 376340256 375688820
3117.8 375688820 374864578 373864632 372891312 371918030 370821915 370044899 369368782 368588753 367910423
3126.5C67910423p40127n65338o54374q53080p07322p99522j514168j248283l82195
3135.2C60446014q91075j091194o12450l04603m72374r36165j187630j161842p29370
3143.9C53059311o26106m87290q08525j177711r74121q24700p44476r46922m25568
3152.5C46043892p31506j102372m63333p58285j118965j289940q82798q88328r41467
3161.2C37866898n14031o97555n96352p85484o92559j038131j260682n01327m09699
3169.9C31371078n81321j317826j084175o05735p67060m46090q81691j150895j040382
3178.6C23495903r90562r05495p11746m93241n55725o48765r26609q57125o79836o27403
3188.2C16099396r40762j010322o08616p53403n68485m35848p69940j194534j119690
$$ plain form
3126.5 367910423 367170296 366604958 365950584 365097504 364390182 363590660 362076492 360828209 360446014
3135.2 360446014 359554939 358463745 357851295 357546692 357074318 356138153 354950523 353788681 353059311
3143.9 353059311 352433205 351945915 351137390 349959679 348985558 348160858 347416382 346469460 346043892
3152.5 346043892 345312386 344210014 343746681 342988396 341869431 340579491 339696693 338808365 337866898
3161.2 337866898 337352867 336655312 336058960 335273476 334580917 333542786 332282104 331780777 331371078
3169.9 331371078 330789757 329471931 328387756 327782021 327014961 326568871 325687180 324536285 323495903
3178.6 323495903 322505341 321599846 320888100 320394859 319839134 319190369 318263760 317406635 316726799 316099396
3188.2 316099396 315158634 314148312 313539696 312786293 312217808 311781960 311012020 309817486 308697796
3196.9C08697796p03907o00014m30927o33145n38406n49297o86379m83970o83632n28450
3206.5C02859669n75676p90558n78041p25975p59430k76585o93760j157646n90801
3215.2B96711197p57313o22578m40712q09021p02438p74956n42965k93979m96178q17890
3224.9B90453167p51667n48134m69913l69320o31028m26158m39434m66614m91047r04789
3234.5B84955063o99043o75679m11625n92746j055451n29670l45135n56030n79262
3243.2B79510422m22306l63522k28920k50301m32434o53744q16422n84716o16303j79500
3252.8B74962254k27032p46117k51102l60127p22980q33206r05838m95911k94170k78721
3262.5B69847050P4959p2136m79279n65205m68521k0618n84145p21569k84233q37784
$$ plain form
3196.9 308697796 307993889 307393875 306962948 306329803 305791397 305242100 304555721 304071751 303388119 302859669
3206.5 302859669 302283993 301493435 300915394 300189419 299429989 299153404 298459644 297301998 296711197
3215.2 296711197 295953884 295331306 294890594 294081573 293379135 292604179 292061214 291767235 291271057 290453167
3224.9 290453167 289701500 289153366 288683453 288314133 287683105 287256947 286817513 286350899 285859852 284955063
3234.5 284955063 284256020 283580341 283168716 282575970 281520519 280990849 280645714 280089684 279510422
3243.2 279510422 279088116 278724594 278495674 278245373 277812939 277159195 276342773 275758057 275141754 274962254
3252.8 274962254 274735222 273989105 273738003 273377876 272654896 271821690 270915852 270419941 270125771 269847050
3262.5 269847050 269922009 269849873 269370594 268805389 268336868 268316250 267732105 267010536 266726303 265888519
3272.1B65888519p44018l61500O1588l48682p33414k27699l71571l81946o90155l68328
3281.8B61722794J4572j58119o0254p13024m02775k632n22175n31005l53089l20568
3291.4B58673725l83682j91918q6669k53506l99952l46546l95565k66800j92375l53489
3301B55803223l95851q34847k47593m6329n56355L1777j77060m96120l99075n69267
3310.7B52112503n31197k60009l12786n40066l24497m34361l79963l07503j35879l05615
3320.3B48580627j038017o22711j74427k33727p09476p19814l14503m43211j25389
3329B44199352m56314q48999p26509p65152q10089o29673J39503j79767q39939m19750
3338.7B38662663m05350r58214o47469J049k68650o09378n46380k47478j35555j07594
$$ plain form
3272.1 265888519 265144501 264783001 264844589 264495907 263762493 263534794 263163223 262781277 262091122 261722794
3281.8 261722794 261737366 261579247 261518993 260805969 260403194 260400562 259878387 259347382 258994293 258673725
3291.4 258673725 258290043 258098125 258011456 257757950 257357998 257011452 256615887 256349087 256156712 255803223
3301 255803223 255407372 254572525 254324932 254278603 253722248 253754025 253576965 253080845 252681770 252112503
3310.7 252112503 251581306 251321297 251008511 250468445 250143948 249709587 249329624 249022121 248886242 248580627
3320.3 248580627 247542610 246919899 246745472 246511745 245802269 245082455 244767952 244324741 244199352
3329 244199352 243743038 242894039 242167530 241402378 240592289 239962616 240102119 239922352 239082413 238662663
3338.7 238662663 238257313 237299099 236651630 236652679 236384029 235774651 235228271 234980793 234845238 234737644
3348.3B34737644l73535n45406j15643l99513o44684m45232n1499N2891m35410m52671
3357.9B31326942k48069j6003j70002l08666m52442l91827o5250l35312j09616j42974
3367.6B29086781k13814k22130n03368j80798l62301k99797P82k58865k68936J01642
3377.2B26879196M5643o3744L2711n97038k37045J91688q7623K28481L95718M59976
3386.9B27247963k61498m96807k05154o63986n94158l35255j7204J73530K41394K32373
3396.5B25321198m5701K2049R0351K3633j00117k16255k32926k22530J04904L48988
3406.2B25093594j98632m25224K08073N30071M91199M40140M71935J77193j99299k57835
3415.8B26331215P3814M78859M4785K5787K96497N8136J06946K59933J68343K64339
$$ plain form
3348.3 234737644 234364109 233818703 233703060 233303547 232658863 232213631 232162132 232215023 231779613 231326942
3357.9 231326942 231078873 231062870 230892868 230584202 230131760 229739933 229674683 229339371 229229755 229086781
3367.6 229086781 228872967 228650837 228147469 227966671 227604370 227304573 227305355 227046490 226777554 226879196
3377.2 226879196 226924839 226861095 226893806 226296768 226059723 226251411 226163788 226392269 226787987 227247963
3386.9 227247963 226986465 226489658 226284504 225620518 225026360 224691105 224673901 224847431 225088825 225321198
3396.5 225321198 225275497 225297546 225387897 225411530 225311413 225095158 224862232 224639702 224744606 225093594
3406.2 225093594 224894962 224469738 224677811 225207882 225699081 226139221 226611156 226788349 226589050 226331215
3415.8 226331215 226405029 226883888 226928673 226954460 227250957 227309093 227416039 227675972 227844315 228108654
3425.5B28108654P63645L90511Q6059M78745N18207o0634l00942K96841P8659O00491
3435.1B30960236O71959l5782N76210K30560J42784M04568L93638O13118P20615Q92086
3444.7B35569992N40447M62532r0160L24764R97753O35949O49738K58312M84181O33258
3454.4B40466766O01921P44362L26329N53512O33698L79581L97396O38180O75335J014690
3464B46431770P62749K28176P88250O85291P47719N83592O80008R06639L15761R70459
3473.7B53100414Q08583O26049J094989P15256M88911M45461Q58021J032886L66021
3482.3B59536591L06911J594906J242561M31271R80911Q50811J257668R97505O38370
3491B67837505P91912N38464R08012R73587J120244R91554P09343P33852O36292J052055
$$ plain form
3425.5 228108654 228872299 229262810 229348869 229827614 230345821 230285187 229984245 230281086 230359745 230960236
3435.1 230960236 231632195 231596413 232172623 232403183 232545967 232950535 233344173 233957291 234677906 235569992
3444.7 235569992 236110439 236572971 236482811 236807575 237805328 238441277 239091015 239349327 239833508 240466766
3454.4 240466766 241068687 241813049 242139378 242692890 243326588 243706169 244103565 244741745 245417080 246431770
3464 246431770 247194519 247422695 248210945 248896236 249643955 250227547 250907555 251814194 252129955 253100414
3473.7 253100414 253908997 254535046 255630035 256345291 256834202 257279663 258137684 259170570 259536591
3482.3 259536591 259843502 261438408 262680969 263112240 264093151 264943962 266201630 267199135 267837505
3491 267837505 268629417 269167881 270075893 271049480 272169724 273161278 273870621 274604473 275240765 276292820
3500.7B76292820J762238J433391K16847N80539Q90656R07669J010322R05934R72137
3509.4B84972553J148777J369324P99637J432304J241074M03194J227398J326637J017170
3518B94938068M84696J198387J292553Q05702J206913Q76904J913929J734542P31698
3526.7C05183392K33516M70658J323242J244755J778640J606274R84707R02214J932506
3535.4C15659904J642094P44362J677437Q03547R56192J663513J652985J161766J030655
3544.1C26992455J747550J185952J872596J084786J665153J739579R65271K117080
3551.8C39370422J025887J687393J480293J935006K480659P71294J680908K009277
3559.5C52441139K203980J409988J721726J456642J225166L658638N89027Q48465J537247
$$ plain form
3500.7 276292820 278055058 279488449 279705296 280285835 281176491 282084160 283094482 284000416 284972553
3509.4 284972553 286121330 287490654 288290291 289722595 290963669 291366863 292594261 293920898 294938068
3518 294938068 295422764 296621151 297913704 298719406 299926319 300803223 302717152 304451694 305183392
3526.7 305183392 305416908 305887566 307210808 308455563 310234203 311840477 312825184 313727398 315659904
3535.4 315659904 317301998 318046360 319723797 320527344 321483536 323147049 324800034 325961800 326992455
3544.1 326992455 328740005 329925957 331798553 332883339 334548492 336288071 337253342 339370422
3551.8 339370422 340396309 342083702 343563995 345499001 347979660 348750954 350431862 352441139
3559.5 352441139 354645119 356055107 357776833 359233475 360458641 364117279 364706306 365554771 367092018
3568.2C67092018O33164K900009J993904K104416J769600J830711J809273K419700
3575.9C82552795K458229Q57583K624855K221336J496353K322807K608223J827736
3583.6C98969917J588478M245797J803817q89816J665459K004051L304062K695999
3591.3D15387764K865334J523361J924133L440170o0424K379379L710136K506256L624573
3600D37300682J489143Q30727K324867K979012L062401L006858K954102N66711L134995
3608.7D57649498R80759N04760O615792K443008L39012M109421N52254L637275M018059
3617.4D80849838K050324K821426O43654J816483L913612L658256K174340L054809
3625.1E00982742L166199K701874N891189J530533m595871M734497M775429M648361
$$ plain form
3568.2 367092018 367725182 370625191 372619095 374723511 376493111 378323822 380133095 382552795
3575.9 382552795 385011024 385868607 388493462 390714798 392211151 394533958 397142181 398969917
3583.6 398969917 400558395 404804192 406608009 405718193 407383652 409387703 412691765 415387764
3591.3 415387764 418253098 419776459 421700592 425140762 425080338 427459717 431169853 433676109 437300682
3600 437300682 438789825 439620552 441945419 444924431 447986832 450993690 453947792 454514503 457649498
3608.7 457649498 458630257 459135017 465750809 468193817 468532829 472642250 473194504 476831779 480849838
3617.4 480849838 482900162 485721588 486365242 488181725 492095337 495753593 497927933 500982742
3625.1 500982742 504148941 506850815 512742004 514272537 509676666 514411163 519186592 523834953
3632.8E23834953K021447N38673L929367M067459K886124J642112K397271L419723
3640.5E44737129K751084K017555K088661K959595L528557N073051O14929k521858
3648.2E61248703L772736J874656J796570J304779N040856N023536M169159N059204
3655.9E89290199m586563K081566M880562K124176L244476J709633K208366R37386
3663.6F01889801J919823K649498J048088M040909K073707M54178N48706l799057L993607
3672.3F14819260P280960P044449k422486j3474655L649178P375946M593734o93206
3680F28173180J077919K441482K301140J687393L36342O87141M056283N319519q291245
3688.7F37789154j681023O898995l925591M53072N010757J829834J311493M5014k09503
$$ plain form
3632.8 523834953 525856400 526395073 530324440 534391899 537278023 538920135 541317406 544737129
3640.5 544737129 547488213 549505768 551594429 554554024 558082581 563155632 563770561 561248703
3648.2 561248703 565021439 566896095 568692665 569997444 575038300 580061836 584230995 589290199
3655.9 589290199 584703636 586785202 591665764 593789940 597034416 598744049 600952415 601889801
3663.6 601889801 603809624 606459122 607507210 611548119 613621826 614076004 614624710 610825653 614819260
3672.3 614819260 622100220 629144669 626722183 613247528 616896706 624272652 628866386 628173180
3680 628173180 629251099 631692581 633993721 635681114 636017456 636704597 640760880 646080399 637789154
3688.7 637789154 636108131 643007126 639081535 639534607 644545364 646375198 647686691 647731705 647522202
3697.4F47522202J354370J149139K369766J665116m635086r76639M013290J631317
3705.1F54093475R48716R90295K122726K857666n380783L044358K936630r912720M559937
3713.8F56260300M183960J079635P03049J094589J069565k369690J291046L889618
3721.5F67202072l378677k043686M656448O71234j520919j720658P84226L327713P03354
3730.2F68681107M174118o60477o288376N630722j40839n300750O94427J085892J036530
3738.9F68912354K210464K336121l286820K583847R742203q152390j2349166P023086
3746.6F69019699M069672N103073j805420q269730Q223725l784790o351853N540924
3754.3F71745300M696503K536621l921661J651535L485946n823822p3547L439102N30853
$$ plain form
3697.4 647522202 648876572 650025711 652395477 654060593 649425507 648448868 652462158 654093475
3705.1 654093475 655042191 656032486 658155212 661012878 655632095 658676453 661613083 651700363 656260300
3713.8 656260300 660444260 661523895 662226944 663321533 664391098 662021408 663312454 667202072
3721.5 667202072 663823395 661779709 666436157 667107391 665586472 663865814 664650040 667977753 668681107
3730.2 668681107 672855225 672194748 665906372 671537094 671396255 666095505 666789932 667875824 668912354
3738.9 668912354 671122818 673458939 670172119 672755966 682498169 674345779 661996613 669019699
3746.6 669019699 673089371 678192444 676387024 668117294 676341019 672556229 666204376 671745300
3754.3 671745300 676441803 678978424 675056763 676708298 680194244 674370422 674296875 677735977 678266830
3763F78266830N72510L322373k529679l661956K739410L432236l13263o924134J929245
3771.7F76833572K657547N58472J171341J85928J412812j53351J545257L63465n702668
3780.3F78872375J619416J459656M97665N81894k322922N63278J646729M02374K11792
3789F83532257M9744K39410N188j7547J8386J391220J689606m083862k459412K739182
3798.7F83104172L096771L402557o564560o749038M587326K698898L532791L653946
3806.4F90762863p689438k929382M054642J830673N23682L93905p9498J057968K952957
3815.1F90878372l446884r101562N233459M999466K659378q71048j3619308K899169
3822.8F79631042M893342J846771K225952q9340k754898q1635J320114K538300O84204
$$ plain form
3763 678266830 678839340 682161713 679632034 675970078 678709488 682141724 681828461 674904327 676833572
3771.7 676833572 679491119 680049591 681220932 681406860 682819672 682666321 684211578 684575043 678872375
3780.3 678872375 680491791 681951447 682449112 683031006 680708084 681271362 682918091 683320465 683532257
3789 683532257 683582001 683821411 683826599 683809052 683827438 685218658 686908264 682824402 680364990 683104172
3798.7 683104172 686200943 689603500 683038940 676289902 680877228 683576126 687108917 690762863
3806.4 690762863 683073425 680144043 684198685 686029358 686553040 686946945 686867447 687925415 690878372
3815.1 690878372 687431488 678329926 683563385 688562851 691222229 690351181 676731873 679631042
3822.8 679631042 684524384 686371155 688597107 688507767 685752869 685671234 686991348 689529648 690213852
3831.4F90213852o200867K617493N647354m931564O5078N718613q512878l229142N544663
3840.1F86932602l760529K05841N154114j955185k432556L100433J306305l48053J479340
3848.8F89682312p11822J219863M436798n224456j487046j0542068K907181Q747863
3856.5F89028625q06427j514282J619797J804199J811829m156952J54266M666672m149628
3865.2F88458099l916473L175354L526154L412246n997314o644440L360367M632187
3872.9F90006180K658996o511917J25656K863999l25852J168671J632156n522308l654633
3881.6F82440948M833603J165848J683960L432236r389954J025620L391342J067200
3889.3F89650803K901458j223602o284561Q27255K986756r20868M74624O66275K023926
$$ plain form
3831.4 690213852 684012985 686630478 692277832 687346268 687411346 693129959 684617081 681387939 686932602
3840.1 686932602 683172073 683377914 688532028 686576843 684144287 687244720 688551025 688202972 689682312
3848.8 689682312 688970490 690190353 694627151 689402695 687915649 677373581 680280762 689028625
3856.5 689028625 688222198 686707916 688327713 690131912 691943741 687786789 687941055 692607727 688458099
3865.2 688458099 684541626 687716980 691243134 694655380 688658066 682013626 685373993 690006180
3872.9 690006180 692665176 686153259 686278915 689142914 688817062 689985733 691617889 686095581 682440948
3881.6 682440948 687274551 688440399 690124359 693556595 684166641 685192261 688583603 689650803
3889.3 689650803 692552261 691328659 685044098 685871353 688858109 687937241 688411865 689078140 691102066
3898F91102066J758728o678085L692322N46035m472122K850113k844086q69903J072387
3906.7F86157455J696091J813355k49024k38266k97699O18973p8506m73786J225357
3915.3F90173950R61228l985978k075576L576431o37512k126313K114258J493836K34832
3924F89729156j645889j234588Q83255Q05969J179581l78495j328888P17697j549835
3932.7F87177963r70688J778641K75421n1040K73666K89612j80969p93457J003723
3941.4F88802872O32629k871628m83780J506653P38068O16302j168213o027K7924j415177
3951F86379623J034699O5689j87531L89252J82266M42124o95801j221p0266J47476
3960.7F87686310L204o65665l81l64227O30340O05851P7896k14081q74481J77459R47647
$$ plain form
3898 691102066 692860794 686182709 689875031 690421066 685948944 688799057 685954971 685085068 686157455
3906.7 686157455 687853546 689666901 689417877 689179611 688881912 689500885 689422379 688948593 690173950
3915.3 690173950 691135178 687149200 685073624 688650055 688012543 685886230 688000488 689494324 689729156
3924 689729156 688083267 686848679 687731934 688537903 689717484 689338989 688010101 688727798 687177963
3932.7 687177963 686207275 687985916 688261337 688210297 688483963 688773575 688592606 687799149 688802872
3941.4 688802872 689435501 686563873 686080093 687586746 688324814 688941116 687772903 687766876 687794800 686379623
3951 686379623 687414322 687480011 687292480 687681732 687863998 688306122 687610321 687609100 687538834 687686310
3960.7 687686310 687689514 687023849 687023468 686659241 687289581 687895432 687973328 687759247 686884766 687062225 688009872
3971.3F88009872l0670j625976k15073Q06809m6540K64130L20816l4866j19324L27453
3980.9F87656631L57666j32980l23410L75061q39m98200L54615l01667l63464m0131
3990.6F87083282J19706k31552m05808O39648k8457K61688q2397m09012M84543j82724
4000.2F87248917
$$ plain form
3971.3 688009872 687979202 686353226 686138153 686944962 686898422 687162552 687483368 687448502 687329178 687656631
3980.9 687656631 688014297 687881317 687557907 687932968 687932129 687433929 687788544 687486877 687123413 687083282
3990.6 687083282 687202988 686971436 686565628 687205276 687176819 687438507 687356110 686947098 687431641 687248917
4000.2 687248917
##END=$$ End of the data block
