##TITLE=$$ Begin of the data block
##JCAMP-DX=5.00 $$ ACD/SpecManager v 10.08
##SPECTROMETER/DATA SYSTEM=Varian
##DATE=15 Jan 2013 10:02:38
##DATA TYPE=INFRARED SPECTRUM
##DATA CLASS=XYDATA
##ORIGIN=
##OWNER=
##NPOINTS=3735
##FIRSTX=399.26403809
##LASTX=4000.35498047
##MAXX=4000.35498047
##MINX=399.26403809
##MAXY=75.21361542
##MINY=22.48724365
##XFACTOR=1.0000000000
##YFACTOR=0.000000100000000
##FIRSTY=45.46827316
##DELTAX=0.96440572
##XUNITS=1/CM
##YUNITS=TRANSMITTANCE
##XYDATA=(X++(Y..Y))
399.3D54682732O290512j866188K173118L288079j607781j1293030n559501J1250839
$$ 454682732 460973244 459107056 461280174 464568253 462960472 451667442 446107941 457358780
407D57358780R016380P96356q289375q185921q56094J530876n93643K960243P634659
$$ 457358780 466375160 467171516 458882141 450696220 449840126 451371002 450777359 453737602 461372261
415.7D61372261l331947q776093j1287460m398537J7527390P195244p28837j833305
$$ 461372261 458040314 449264221 437976761 433578224 451105614 458300858 457572021 455738716
423.4D55738716L164864M7569n997086j237678J982384J964607k11411Q30994M982567
$$ 455738716 458903580 458951149 452954063 451716385 453698769 455663376 455451965 456282959 461265526
432.1D61265526K18963j885490q64677n932351l105659K133865J810112k25868k815933
$$ 461265526 461484489 459598999 458734322 452801971 449696312 451830177 453640289 453414421 450598488
440.7D50598488K594795N83115l301316K793236L285904j647720p741051j954575P98913
$$ 450598488 453193283 453776398 450475082 453268318 456554222 454906502 447165451 445210876 446009789
449.4D46009789K057571L388405j65749M539375R70574j450501k05955o287651p270851
$$ 446009789 448067360 451455765 451290016 455829391 456799965 455349464 455143509 448855858 441585007
458.1D41585007N46875N878792M103813j538544j442757q80851J991996J819916m19655
$$ 441585007 442131882 448010674 452114487 450575943 449133186 448252335 450244331 452064247 451644592
466.8D51644592k855301j512527k057648k872505k244453p112809M166375O984558
$$ 451644592 448789291 447276764 445219116 442346611 440102158 432989349 437155724 444140282
474.5D44140282o73561k641907k30637J255646k223282j695289k518235l040771R33227
$$ 444140282 443466721 440824814 440594177 441849823 439626541 437931252 435413017 432372246 433305473
483.2D33305473l66401J923332J623611M34113R81903l879547m887886n75867M263611
$$ 433305473 432939072 434862404 436486015 436920128 437902031 434022484 429134598 428558731 432822342
491.8D32822342J995125l165055k207260P99332J921158n65911O5346K303009m26979
$$ 432822342 434817467 431652412 429445152 430244484 432165642 431599731 431665077 433968086 433541107
500.5D33541107m564819n297051m14505J968460K725296J70937j135101Q72001j63307
$$ 433541107 428976288 423679237 423264732 425233192 427958488 428129425 426994324 427866325 427703018
509.2D27703018J29318J013527l73497r00497j22337j245041m813500m865112O67076
$$ 427703018 427832336 428845863 428472366 427571869 427449532 426204491 421390991 416525879 417192955
517.9D17192955K093925R75495J374702q99124j463394J201553M65241o62346r56268
$$ 417192955 419286880 420262375 421637077 420737953 419274559 420476112 420941353 420279007 419322739
526.6D19322739j532593j250458j061745k6969J722869J983757K29912j51863Q43697
$$ 419322739 417790146 416539688 415477943 415450974 417173843 419157600 419387512 419235649 420079346
535.2D20079346n85327j983872j928368j660919N27573J008682o04095o42395m14505
$$ 420079346 419494019 417510147 415581779 413920860 414448433 415457115 414853020 414210625 413796120
543.9D13796120N62172n94902j247864P66754r21516k140694j641159o92482K05307
$$ 413796120 414358292 413763390 412515526 413282280 412360764 410220070 408578911 407886429 408091736
552.6D08091736q71773p32460P1106O40068m82635j627465q28094j65520J68114j270371
$$ 408091736 407219963 406487503 406558609 407198677 406716042 405088577 404260483 404094963 404263077 402992706
562.3D02992706j480522m3487J461296K155456N80445j06545K91748n74150m52881
$$ 402992706 401512184 401468697 402929993 405085449 405665894 405559349 405851097 405276947 404824066
570.9D04824066O85845q85048j217575J019821J04332n59464k60200j83449J064224
$$ 404824066 405509911 404624863 403407288 404427109 404531441 403971977 403711777 403528328 404592552
579.6D04592552l48663j086121J159592N91621j341324j546173l86695J617126J738319
$$ 404592552 404243889 403157768 404317360 404908981 403567657 402021484 401634789 403251915 404990234
588.3D04990234L29285M12636N19867n76363r98802p00302M3793R47227Q37631M77181
$$ 404990234 405319519 405732155 406252022 405675659 404676857 403976555 404020348 404967575 405805206 406282387
597.9D06282387n93109L8871K005234P82890j31797p03469j349525j424217j733551
$$ 406282387 405689278 405728149 407733383 408516273 408384476 407681007 406331482 404907265 403173714
606.6D03173714R6626Q50487n67551l47214R2354p71179j348305n25589l7613j131210
$$ 403173714 403270340 404120827 403553276 403206062 403298416 402527237 401178932 400653343 400615730 399484520
616.3C99484520j103973J6059m53529p7286J138802K163429K393761P43561O64367
$$ 399484520 398380547 398396606 397943077 397865791 399004593 401168022 403561783 404305344 404969711
624.9D04969711J2207p7514P83920P11899J028518j61781J163063K478600J381798
$$ 404969711 404981918 404904404 405688324 406400223 407428741 407266960 408430023 410908623 412290421
633.6D12290421J870384K702141K479515Q69903L45078J78871R42116J513748Q73146
$$ 412290421 414160805 416862946 419342461 420212364 420557442 420736313 421678429 423192177 424065323
642.3D24065323J516952J204148J198272P17850L79486J592980J499099O97709j73760
$$ 424065323 425582275 426786423 427984695 428702545 429082031 430675011 432174110 432871819 432698059
651D32698059j35345O93397J100769L25508m83474N35392J162949K51274m59442k52724
$$ 432698059 432562714 433256111 434356880 434682388 434198914 434734306 435897255 436148529 435689087 435436363
660.6D35436363p41119j843643j133461J21879K70310M06456j326790j319046M801788
$$ 435436363 434695244 432851601 431718140 431840019 432110329 432516785 431189995 429870949 434672737
669.3D34672737R23958K33993Q67577K28996R9564P11136Q83751J268120J997261R20524
$$ 434672737 435596695 435830688 436698265 436927261 437026825 437737961 438621712 439889832 441887093 442807617
678.9D42807617J144104K268639Q21342P53403J567497O73752r7961Q68759J372185
$$ 442807617 443951721 446220360 447041702 447795105 449362602 450036354 449938393 450807152 452179337
687.6D52179337J127052J278000J372757J795540R16519M95071L92723L97225Q74710
$$ 452179337 453306389 454584389 455957146 457752686 458669205 459164276 459556999 459954224 460828934
696.3D60828934m14696m69933O71921J223335R77250L86047N81131J022720J273690
$$ 460828934 460414238 459944305 460616226 461839561 462816811 463202858 463783989 464806709 466080399
705D66080399P97882N25055j67160R6206Q64372P39441J828423J737060N83573N54237
$$ 466080399 466878281 467403336 467236176 467332382 468196754 468936195 470764618 472501678 473085251 473639488
714.6D73639488J110306J130295Q04214n7983p53861L92228R72709R23348Q22143J566620
$$ 473639488 474749794 475880089 476684303 476626320 475872459 476264687 477237396 478160744 478982887 480549507
724.3D80549507J787338N77317J285171J008415L00789L97606K9221K38647J032677
$$ 480549507 482336845 482914162 484199333 485207748 485508537 485906143 485935364 486174011 487206688
733D87206688J916313J411629J128120J290055P79266J23100q1711k72789p19833j71661
$$ 487206688 489123001 490534630 491662750 492952805 493732071 493855171 493773460 493500671 492780838 492609177
742.6D92609177N12962R98383R14650J161537K113228J666984k65808k4490J910247
$$ 492609177 493122139 494120522 495035172 496196709 498309937 499976921 499711113 499686623 501596870
751.3E01596870P20902J65634K34795j88866J58958J051331K997932J320343O33507
$$ 501596870 502317772 502483406 502718201 502529335 502688293 503739624 506737556 508057899 508691406
760E08691406J888581J488113J498184J75972k14462N95665J487961J295318R84116
$$ 508691406 510579987 512068100 513566284 513742256 513527794 514123459 515611420 516906738 517890854
768.6E17890854J429977J193390R86862j34773l19061p23000q89892j172676j027832
$$ 517890854 519320831 520514221 521501083 521366310 521047249 520324249 519434357 518261681 517233849
777.3E17233849J223106J174583J145134P12510J14173P16629P15943R95178K08969
$$ 517233849 518456955 519631538 520776672 521489182 521603355 522319984 523035927 524031105 524240074
786E24240074m87327p39251j67770O66695J093673J217690J355514P78580j317329
$$ 524240074 523752747 523013496 522845726 523512421 524606094 525823784 527179298 527957878 526640549
794.7E26640549j394501j248474q850k88239k035293j085930q00629L28064m96254
$$ 526640549 525246048 523997574 523988724 523700485 521665192 520579262 519778633 520106697 519610443
803.4E19610443r43642l67851j540527j190262k143593k458954k086372j677437j598472
$$ 519610443 518666801 518298950 516758423 515568161 513424568 510965614 508879242 507201805 505603333
812E05603333k410470j137580k15645p04041j371498o43005J86615k59285j097069
$$ 505603333 503192863 502055283 501839638 501135597 499764099 499121094 499307709 499048424 497951355
820.7D97951355q49838J417656J969604J389046J846924L251800L525734L303299L749046
$$ 497951355 497101517 498519173 500488777 501877823 503724747 506976547 510502281 513805580 517554626
829.4E17554626K365761J976052J938285K949143L535805K298698K119522K636528
$$ 517554626 519920387 521896439 523834724 526783867 530319672 532618370 534737892 537374420
837.1E37374420L724365K189026K337799K202149K44369J597672K180404J623040J209030
$$ 537374420 541098785 543287811 545625610 547827759 548072128 549669800 551850204 553473244 554682274
845.8E54682274K007980K127495K263412J671525M36210R23462K18124J883393K410736
$$ 554682274 556690254 558817749 561081161 562752686 563188896 564112358 564330482 566213875 568624611
854.5E68624611P42378K8916R75189K439804J121902J584893K130432J584816r0142
$$ 568624611 569366989 569395905 570371094 572810898 573932800 575517693 577648125 579232941 579142799
863.1E79142799o07795J34926o50025M997j161499j589012p91244n44205r87473j476554
$$ 579142799 578535004 578669930 578019905 578024902 576863403 575274391 574483147 573938942 572951469 571474915
872.8E71474915p08046j302185r06029k119637k486114q45108j130524j251907p93267
$$ 571474915 570766869 569464684 568558655 566439018 563952904 563107796 561977272 560725365 559932098
881.5E59932098K78778l13224l16964n6190o82526r67826j365738p02210q17680n69763
$$ 559932098 560210876 559897652 559580688 559524498 558841972 557874146 556508408 555806198 554988518 554418755
891.1E54418755o19240p6752J062508J618461K120667Q27217N94597L47709m62493
$$ 554418755 553799515 553722763 554785271 556403732 558524399 559351616 559946213 560293922 559831429
899.8E59831429j221085n09567K95524m74395P73887K068024L559418K741584K501755
$$ 559831429 558610344 558100777 558396301 557921906 558695793 560763817 564323235 567064819 569566574
908.5E69566574K756538L18680R66149J43966p93914j165390q75283k31819j951256
$$ 569566574 572323112 572641792 573607941 573751907 572957993 571792603 570917320 570685501 568734245
917.2E68734245j585045j443214j553726k653656k790604k778511n077057m836159
$$ 568734245 567149200 565705986 564152260 561498604 558708000 555929489 550852432 546016273
924.9E46016273l669281l174209l925057k995643k091751k861901j907272k158623
$$ 546016273 542346992 539172783 535247726 532252083 530160332 527298431 525391159 523232536
932.6E23232536k815971k705650j638909j055107j289902j69716m50477j167793k80266
$$ 523232536 520416565 517710915 516072006 515016899 513726997 513557281 513106804 511939011 511658745
941.3E11658745J83868r91287j522903q79555o40793q50182o23855J15242J13411Q21266
$$ 511658745 511842613 510851326 509328423 508448868 507808075 506957893 506334038 506449280 506562691 507383957
950.9E07383957N57709k22092l49388j144600q66928j948776k695465k106171k312508
$$ 507383957 507941666 507719574 507370186 506225586 505358658 503409882 500714417 498608246 496295738
959.6D96295738k293701j860275j472359k041397j914063j403656j175003j482353
$$ 496295738 494002037 492141762 490669403 488628006 486713943 485310287 484135284 482652931
967.3D82652931k445450k509575k477531k614059k813454k276878j943360k461433
$$ 482652931 480207481 477697906 475220375 472606316 469792862 467515984 465572624 463111191
975D63111191l189888m170418l998718l963204m879417n247536n138435n417900n270233
$$ 463111191 459921303 455750885 451752167 447788963 442909546 437662010 432523575 427105675 421835442
983.7D21835442n086861n248489n114327n051536m838486m335938m481888n231704
$$ 421835442 416748581 411500092 406385765 401334229 396495743 392159805 387677917 382446213
991.4C82446213n079079m556045l503952l667870m037781l131866l392563l451119
$$ 382446213 377367134 372811089 369307137 365639267 361601486 358469620 355077057 351625938
999.1C51625938m045715l556480k796364l017540k530556k797966k563209k304840
$$ 351625938 347580223 344023743 341227379 338209839 335679283 332881317 330318108 328013268
1006.8C28013268k045823k128296j612892j320076j766090j716232k624512k095413
$$ 328013268 325967445 323839149 322226257 320906181 319140091 317423859 314799347 312703934
1014.6C12703934k008305k338295k770023k765026k261467l368321k423572j724396
$$ 312703934 310695629 308357334 305587311 302822285 300560818 297192497 294768925 293044529
1022.3B93044529j491070k463627k894954k005082k240505r00383j063213n17635o76766
$$ 293044529 291553459 289089832 286194878 284189796 281949291 281048908 279985695 279468060 278791294
1031B78791294j549511j330395m79774Q07667l63560P17964Q66585J480236K046089
$$ 278791294 277241783 275911388 275431614 276239281 275875721 276593685 277460270 278940506 280986595
1039.6B80986595J028633J590882O05030J254329M54884l54214l55854j124458l58677
$$ 280986595 282015228 283606110 284211140 285465469 285920353 285566139 285210285 284085827 283727150
1048.3B83727150j74580l21788j335373p74498k281418k081700M46415n49621r68247
$$ 283727150 283552570 283230782 281895409 281120911 278839493 276757793 277204208 276654587 275686340
1057B75686340j787357l5725O83918J360798K396717J316510K126617K304058L264256
$$ 275686340 273898983 273863258 274547176 275907974 278304691 279621201 281747818 284051876 287316132
1065.7B87316132J631317J075191K576847J498452M13742K78568J211147J7090J45798
$$ 287316132 288947449 290022640 292599487 294097939 294511681 294790249 296001396 296018486 296164284
1074.4B96164284O93016O73218O76899J77555J175174R75266J362877N44300P20081
$$ 296164284 296857300 297530518 298207417 298384972 299560146 300535412 301898289 302442589 303162670
1083C03162670R53407M34628J617928R64775K027835K208920J727867J757317J919040
$$ 303162670 304116077 304550705 306168633 307133408 309161243 311370163 313098030 314855347 316774387
1091.7C16774387K088986J105404K087803J910247J232300O98967J290207K066231
$$ 316774387 318863373 319968777 322056580 323966827 325199127 325898094 327188301 329254532
1099.4C29254532K256393K974320J294441J549683J997032J571960J518212J368980
$$ 329254532 331510925 334485245 335779686 337329369 339326401 340898361 342416573 343785553
1107.1C43785553J536369M90265N67475O80618J366920J470681O98890Q62007Q13103
$$ 343785553 345321922 345812187 346379662 347060280 348427200 349897881 350596771 351458778 352271881
1115.8C52271881J018753K83890L48358p3700n69458n34K76260J050454N51185L50380
$$ 352271881 353290634 353574524 353922882 353849182 353279724 353279190 353555450 354605904 355157089 355507469
1125.5C55507469P01409J710777J838074J385765J825866J499482K379226K639847
$$ 355507469 356208878 357919655 359757729 361143494 362969360 364468842 366848068 369487915
1133.2C69487915K478333K396621K547112K762451J996727J898079K056656K417106
$$ 369487915 371966248 374362869 376909981 379672432 381669159 383567238 385623894 388041000
1140.9C88041000J670266J247749J148224M29420O73294J044159J199684M90837J54953
$$ 388041000 389711266 390959015 392107239 392536659 393209953 394254112 395453796 395944633 396099586
1149.6C96099586K49482M86526K88811p38983m34761m09470n88760p39975m21524J42898
$$ 396099586 396349068 396835594 397124405 396385422 395950661 395541191 394952431 394212456 393790932 393933830
1159.2C93933830q91037n27916j84898n84831M06227J269531J467133J737327K141800
$$ 393933830 393042793 392514877 392329979 391745148 392151375 393420906 394888039 396625366 398767166
1167.9C98767166K188492K496986L021088L611107L637581L466758K914162K314873
$$ 398767166 400955658 403452644 406473732 410084839 413722420 417189178 420103340 422418213
1175.6D22418213K323456K533531K520485J973572K233924K499428K557144J821175
$$ 422418213 424741669 427275200 429795685 431769257 434003181 436502609 439059753 440880928
1183.3D40880928J892967K270928J024704P84034O39573O12945l21884l27568N30357
$$ 440880928 442773895 445044823 446069527 446853561 447493134 448106079 447784195 447456627 447986984
1192D47986984n18493m20266L281l81622j409264j501121j411553j904297r31205q32024
$$ 447986984 447468491 447048225 447051506 446669884 445260620 443759499 442347946 440443649 439512444 438680420
1201.6D38680420j271591j049423o74210o92520n87692l36037j315994r85680m54254
$$ 438680420 437408829 436359406 435685196 434992676 434404984 434068947 432752953 431767273 431313019
1210.3D31313019o37436n65605p69043j641N66636M94728l26310m82864K60315j91154
$$ 431313019 430675583 430109978 429340935 429339294 429905930 430400658 430074348 429591484 429851799 429660645
1220D29660645m90914o00014n41648m78325p64046q90274n51224J34583k26975p31697
$$ 429660645 429169731 428569717 428028069 427549744 426785698 425895424 425344200 425478783 425251808 424520111
1229.6D24520111j021652j263390q37135q78868j247521r40132m07753l70826l80784
$$ 424520111 423498459 422235069 421397934 420519066 419271545 418331413 417923660 417552834 417172050
1238.3D17172050l53622P744M28467N5885j05324m18892r40399j187286j057930n28412
$$ 417172050 416818428 416826172 417254639 417310524 417205200 416786308 415845909 414658623 413600693 413072281
1247.9D13072281k46735l01590k92129K80838K14805j38740l79601m60434r8724n37300
$$ 413072281 412825546 412523956 412231827 412512665 412727470 412588730 412209129 411748695 411649971 411112671
1257.6D11112671m45519k68325J1711O12793L23524N53475P71637P31582L87039J77651
$$ 411112671 410667152 410398827 410410538 411023331 411346855 411900330 412671967 413403549 413790588 413968239
1267.2D13968239K41852O87484R36470K52114Q65555J425209J006813R16786J682968
$$ 413968239 414210091 414897575 415834045 416086159 416951714 418376923 419383736 420300522 421983490
1275.9D21983490J842155Q79174N13000M14543R95751J146431J320648J782761J706085
$$ 421983490 423825645 424704819 425217819 425632362 426628113 427774544 429095192 430877953 432584038
1284.6D32584038J888656J727028J770745J487274J119995J041870R24644P23534P47299
$$ 432584038 434472694 436199722 437970467 439457741 440577736 441619606 442544250 443267784 444015083
1293.3D44015083N78003K29683Q23555J011238J046028Q29430M88281J32218j31646
$$ 444015083 444593086 444822769 445646324 446657562 447703590 448533020 449021301 449153519 449021873
1301.9D49021873J97335r2926j04141l54691j70288j1368o4354L59535n38788r35020
$$ 449021873 449219208 449126282 449022141 448667450 448497162 448485794 448421440 448780975 448242187 447307167
1311.6D47307167r79309p41997k71873m29917n27649n8784J159363P99446L52592R39331
$$ 447307167 446327858 445585861 445313988 444884071 444356422 444297638 445457001 446256447 446609039 447548370
1321.2D47548370J280899J125145M17672M75883O03828M16527j06621O1188j0795k00997
$$ 447548370 448829269 449954414 450372086 450847969 451451797 451868324 451761703 451822891 451812096 451611099
1330.9D51611099j55372p94335j03187M5318l51372m15534k97623j42517o25839K95944
$$ 451611099 451455727 450661392 450558205 450603523 450252151 449836617 449538994 449396477 448770638 449066582
1340.5D49066582J111335J385842Q88290R96094J293640M59442R06983L21464r0828
$$ 449066582 450177917 451563759 452452049 453448143 454741783 455201225 456108208 456429672 456338844
1349.2D56338844k54821o3782M3907o21376j82953n11703j41831p3013j08109p7400
$$ 456338844 456084023 456020241 456064148 455442772 455259819 454748116 454606285 454533272 454425163 454347763
1358.8D54347763o70319j037750j278305k57683j205749k35825N06363k44865J4496
$$ 454347763 453677444 452639694 451361389 451103706 449897957 449662132 450168495 449923630 449938126
1367.5D49938126o02189o69250o07185m17023k74468l84597p76406j090164M06799
$$ 449938126 449335937 448666687 448059502 447642479 447368011 446983414 446207008 445116844 445523643
1376.2D45523643L02887K29950j07269j59645l27759j167297j483574k019730j217613
$$ 445523643 445826530 446056480 445949211 445789566 445461807 444294510 442810936 440791206 439573593
1384.9D39573593j209450j123542k053414j741066l02582j269035j556129k374077
$$ 439573593 438364143 437240601 435187187 433446121 433143539 431874504 430318375 427944298
1392.6D27944298k070656k472878l517227j454544j958694k172661l575134k134972
$$ 427944298 425873642 423400764 419883537 418428993 416470299 414297638 410722504 408587532
1400.3D08587532j134796k154389j697235k045211k500916k639961j948052j724815
$$ 408587532 407452736 405298347 403601112 401555901 399054985 396415024 394466972 392742157
1408C92742157k183838j439361j604691j318703j141319j056290q67500j151886p55310
$$ 392742157 390558319 389118958 387514267 386195564 385054245 383997955 383130455 381978569 381223259
1416.7C81223259j481018m33998j125145p6256J166191j28174N17922J97906J111717
$$ 381223259 379742241 379308243 378183098 378106842 379273033 379144859 379662781 379860687 380972404
1425.4C80972404J040841N05790J461296N45197J093025J295777K145309J644211J007385
$$ 380972404 382013245 382519035 383980331 384525528 385618553 386914330 389059639 390703850 391711235
1434.1C91711235K073212J391678K054786K141266L135414K445793J864624J601067
$$ 391711235 393784447 395176125 397230911 399372177 402507591 404953384 406818008 408419075
1441.8D08419075Q52661J921768J503678K099266J140899R01528J626549J528854K100677
$$ 408419075 409271736 411193504 412697182 414796448 415937347 416838875 418465424 419994278 422094955
1450.5D22094955J060601K011871J370812J224479Q10394J30692J561203O18477L955612
$$ 422094955 423155556 425167427 426538239 427762718 428573112 428703804 430265007 430883484 434839096
1459.1D34839096K079697K760620K100983J429519J961785M96482K981568K105293
$$ 434839096 436918793 439679413 441780396 443209915 445171700 445668182 448649750 450755043
1466.8D50755043K558785K354698K545204L218078K013665L317871L341408L950500
$$ 450755043 453313828 455668526 458213730 461431808 463445473 466763344 470104752 474055252
1474.6D74055252K559280K550278L262024K611923K484398J864205K214164K150536
$$ 474055252 476614532 479164810 482426834 485038757 487523155 489387360 491601524 493752060
1482.3D93752060K384109K179528J542968J271935Q66661R98421P53937m96140l98369
$$ 493752060 496136169 498315697 499858665 501130600 501997261 502995682 503749619 503253479 502855110
1491E02855110J212616Q29125m46053n97839m49677l391037q74328k084809k881851
$$ 502855110 504067726 504896851 504450798 503852959 503403282 500012245 499137917 497053108 494171257
1499.6D94171257m08249j176453j324234j404380j58654j77917l376045m654236J95083
$$ 494171257 493763008 492586555 491262321 489857941 489699287 489521370 486145325 481491089 481686172
1508.3D81686172J853409j55677M78744r47609j455116k78244j599808j840363k710266
$$ 481686172 483539581 483383904 483862648 482915039 481459923 481181679 479581871 477741508 475031242
1517D75031242N55039J467438N35202k363167k772026K253189J832924J531753k92816
$$ 475031242 475586281 477053719 477588921 475225754 472453728 474706917 476539841 478071594 477778778
1525.7D77778778P66602J194534M55360R70383Q91876R49593N87578l23334m20723
$$ 477778778 478545380 479739914 480195274 481165657 482057533 483007126 483594704 483271370 482850647
1534.3D82850647K188911J281014N57785N87349n617752o95267M846077J914101o10695
$$ 482850647 485039558 486320572 486878357 487465706 481847954 481152687 485998764 487912865 487302170
1543D87302170J250648J399803l55720J691322N54543M98276m72260p88803J067047
$$ 487302170 488552818 489952621 489596901 491288223 491842766 492341042 491868782 491079979 492147026
1551.7D92147026L98712J175728j188087N0926P08809m65966n711288p166977M366722
$$ 492147026 492545738 493721466 492533379 492584305 493293114 492827148 487115860 479948883 484315605
1560.4D84315605J89705R59778j311607j670571k987518k528992p69920k402916k130356
$$ 484315605 484505310 485465088 484153481 482482910 479495392 476966400 476196480 473793564 471663208
1569.1D71663208r483490j648216j656304l515396k883491l779793k218285j2504692
$$ 471663208 462179718 460531502 458875198 455359802 452476311 448696518 446478233 433973541
1576.8D33973541j798591k934456m345284m818954o171684l782959o491738l945923
$$ 433973541 432174950 429240494 424895210 420076256 413904572 410121613 403629875 399683952
1584.5C99683952n051193m376755n024643n924034l515243o347275l717537o538696
$$ 399683952 394632759 390256004 385231361 379307327 375792084 369444809 365727272 359188576
1592.2C59188576l948059l961296n125809l209953n630722k159997m730682k621879
$$ 359188576 355240517 351279221 346153412 342943459 337312737 335152740 330422058 327800179
1599.9C27800179m165230l849545k315426m537601j168652l757152r74999l447761
$$ 327800179 323634949 319785404 317469978 312932377 311763725 308006573 307031574 303583813
1607.6C03583813k010899j256523k833195L07617k858963J19782k186508J45969K57683
$$ 303583813 301572914 300316391 297483196 297790813 294931850 295051632 292865124 293011093 293268776
1616.3B93268776m935818J836701j320286J423645j428948J041699k03991j829243
$$ 293268776 288332958 290169659 288849373 290273018 288844070 289885769 289681778 287852535
1624B87852535K076111l3989K448292j496372J570301P75013J384392J982040K83337
$$ 287852535 289928646 289894657 292342949 290846577 292416878 293191891 294576283 296558323 296841660
1632.7B96841660K460346l74909K541256j250000L381462K387181J240978K839661
$$ 296841660 299302006 298927097 301468353 300218353 303599815 305986996 307227974 310067635
1640.4C10067635M40082L094826J117134K645454K039967M29707K054462q88596M297295
$$ 310067635 310507717 313602543 314719677 317365131 319405098 319834805 321889267 321000671 325297966
1649.1C25297966N78308K895432J252327o011162L885422K751731N029297R28650K826309
$$ 325297966 325876274 328771706 330024033 324012871 327898293 330650024 335679321 336607971 339434280
1657.8C39434280J310234J660805K100792J119118K858467R41696M176483K544899
$$ 339434280 340744514 342405319 344506111 345625229 348483696 349425392 353601875 356146774
1665.5C56146774L542633K944985J908798L821945K069016N508575L070641M715805
$$ 356146774 359689407 362634392 364543190 368365135 370434151 375942726 379013367 383729172
1673.2C83729172L723106K951737M964981L975067N253105L308868M906731M215622
$$ 383729172 387452278 390404015 395368996 399344063 404597168 407906036 412812767 417028389
1680.9D17028389N103378N091248J400871O875076L836518O758842M650192M775620
$$ 417028389 422131767 427223015 428623886 435498962 439335480 446094322 450744514 455520134
1688.6D55520134N133133M905052O227722N233383N733490M674721M386139L125153
$$ 455520134 460653267 465558319 471786041 477019424 482752914 487427635 491813774 494938927
1696.4D94938927O493683O722488N290108M734840J867752P209282N675240M589996
$$ 494938927 501432610 508155098 513445206 518180046 520047798 527257080 532932320 537522316
1704.1E37522316L838615L320961K742272L177337M035874K487030K280426L135223
$$ 537522316 541360931 544681892 547424164 550601501 554637375 557124405 559404831 562540054
1711.8E62540054L050919K772484J140213J426277L327370J075859k458611M491196
$$ 562540054 565590973 568363457 569503670 570929947 574257317 575333176 572874565 577365761
1719.5E77365761L726654K288055J296501P81060J834755K176094J686897J608429
$$ 577365761 581092415 583380470 584676971 585458031 587292786 589468880 591155777 592764206
1727.2E92764206J928825J472817m31824R29298L341675K506066j764489j636085M502830
$$ 592764206 594693031 596165848 595734024 596663322 600004997 602511063 600746574 599110489 603613319
1735.9F03613319M093666K413559K891541J207275J17264L829537K471618J297264
$$ 603613319 607706985 610120544 613012085 614219360 614336624 618166161 620637779 621935043
1743.6F21935043K538338L384132K549973K351418L521842K792473M435158J905899
$$ 621935043 624473381 627857513 630407486 632758904 636280746 639073219 643508377 645414276
1751.3F45414276K015228M687958K972717L006745K913666J112823K113953L205490
$$ 645414276 647429504 652117462 655090179 658096924 661010590 662123413 664237366 667442856
1759F67442856K826080K916413M09851J181717L284988J586532J639710J615448Q76694
$$ 667442856 670268936 673185349 673595200 674776917 678061905 679648437 681288147 682903595 683780289
1767.7F83780289j167984K487793L827819L57743l85742l89405M015732K208481n80673
$$ 683780289 682612305 685100098 688927917 689285660 688899918 688510513 692526245 694734726 694154053
1776.4F94154053J840210N45578J022644K71682K07978J684570K077103J859970k26059
$$ 694154053 695994263 696539841 697562485 697834167 698042145 699726715 701803818 703663788 703437729
1785.1G03437729R32007J498337Q38317P3319Q51364M87747l33023r24072P46231L803482
$$ 703437729 704369736 705868073 706706390 706779709 707631073 708118820 707785797 706861725 707607956 711411438
1794.7G11411438J094894L26920J447830J259308M89349j454467J280517K41623J120300
$$ 711411438 712506332 712833252 714281082 715540390 716029739 714575272 715855789 716097412 717217712
1803.4G17217712J673279O46591J400910M28390O06385J069641J008148r94644o6529
$$ 717217712 718890991 719537582 720938492 721366882 721973267 723042908 724051056 723056412 722989883
1812.1G22989883Q60749L04413R66873K82669J297149M65546P28607J208954L84903
$$ 722989883 723850632 724155045 725121918 725404587 726701736 727167282 727895889 729104843 729489746
1820.8G29489746R80148l53088Q02002L11127j942520N72128J825867J680831m96597
$$ 729489746 730469894 730116806 730918808 731229935 729287415 729859543 731685410 733366241 732869644
1829.4G32869644j643066J131744K158432N41840K08587M16184k33154m87442k86103
$$ 732869644 731226578 732358322 734516754 735058594 735267181 735683365 735450211 734962769 734676666
1838.1G34676666J407700P43255R19419O63223J035767K62222l932648K372132J407013
$$ 734676666 736084366 736827621 737747040 738410263 739446030 739708252 735775604 738147736 739554749
1846.8G39554749o46363l52249N86014J117477K28195R65195J61057O13937L75061
$$ 739554749 738908386 738556137 739142151 740259628 740487823 741453018 741614075 742228012 742603073
1855.5G42603073l3874K86407p11594M2649N1956O23856J55715M78364P54470K20795
$$ 742603073 742569199 742855606 742144012 742186661 742238617 742862473 743018188 743496552 744251022 744471817
1865.1G44471817O10733n33371L41568j135635q42896J071320O23550M54788P3853
$$ 744471817 745082550 744549179 744890747 743755112 742912216 743983536 744607086 745061874 745135727
1873.8G45135727P76901Q8883P54089N40543K4566J74027n49164K14233m45022J57242
$$ 745135727 745912628 746001511 746755600 747296143 747320709 747494736 746945572 747159805 746714783 746872025
1883.4G46872025m883K30636P73774K16827J112595o63682r44061N56336N06439q316
$$ 746872025 746867142 747097778 747871552 748088379 749200974 748537292 747593231 748149567 748656006 748647690
1893.1G48647690r16m70581j114959J109008M97132M95071O80466J94855M01687l52936
$$ 748647690 748646774 748176193 747061234 748170242 748667374 749162445 749842911 750037766 750439453 750086517
1902.7G50086517O7520o81915k13699P3547J14670M58908j61056L01361L77655J036377
$$ 750086517 750154037 749472122 749258423 749331970 749446640 749905548 749744492 750045853 750423508 751459885
1912.4G51459885m0818j88446n88531q55179L07999j771775M18320J455307P28684
$$ 751459885 751419067 751230621 750642090 749786911 750094910 748323135 748741455 750196762 750925446
1921.1G50925446M64019m46624L738M65775P23800n52139n42755l77350j35117K7771
$$ 750925446 751389465 750942841 750946579 751412354 752136154 751584015 751041260 750663910 750528793 750556564
1930.7G50556564j42364P28454L3722N47791J62582K7542j96457q42971j3962n19486
$$ 750556564 750414200 751142654 751176376 751724167 751886749 751914291 751717834 750874863 750860901 750341415
1940.3G50341415O64978l96575r42154J039352N31998K73895j36032K82898n88837
$$ 750341415 751006393 750609818 749667664 750707016 751239014 751512909 751376877 751659775 751070938
1949G51070938l67889m3259p01675k70005o9961O13403J90048N76096K39944k17437
$$ 751070938 750703049 750659790 749958115 749688110 749618149 750231552 750421600 750997696 751237640 751020203
1958.7G51020203n1117o70777l19290n44052l2577r7123R8267J15127j36871O41785
$$ 751020203 750969086 750298309 749979019 749434967 749402390 749305267 749403534 749518661 749381790 750023575
1968.3G50023575O1645M90876l3570m75769o39725l81851K46430l30353M07410J76010
$$ 750023575 750085220 750576096 750542526 750066757 749427032 749045181 749291611 748961258 749368668 749544678
1978G49544678J88522J58005K8229J22528k17820l5095j005172p17774m37164J52511
$$ 749544678 749733200 749891205 749919434 750041962 749824142 749789047 748783875 748066101 747628937 747781448
1987.6G47781448L42713J3122Q95691P2098j06964j09177J7395l73535n93262j76696
$$ 747781448 748124161 748137283 749032974 749105072 748998108 748888931 748906326 748532791 747939529 747762833
1997.2G47762833o49720J60370j05209J96457M16717J03608K84194k73132j35116o38886
$$ 747762833 747113113 747273483 747168274 747364731 747781448 747885056 748169250 747896118 747761002 747122116
2006.9G47122116k53677k87018m16336j06049j45416L88336O7749N44052J61438m06646
$$ 747122116 746868439 746581421 746165085 746059036 745913620 746301956 746369705 746913757 747075195 746668549
2016.5G46668549o49109m79584K2125n98907l13416k72980L74909J62430J4877N01480
$$ 746668549 746019440 745539856 745561981 744963074 744649658 744376678 744751587 744914017 744928894 745430374
2026.2G45430374j69067k8458m16412m9591o32630j016693j85547j78451K20718J3733
$$ 745430374 745261307 745232849 744816437 744766846 744134216 743117523 742931976 742753525 742974243 742987976
2035.8G42987976K85187J71890K88849L738m06570m17099r14078o180m82483l42636
$$ 742987976 743273163 743445053 743733902 743737640 743331070 742913971 741999893 741993713 741511230 741168594
2045.5G41168594O485J38092O78482R9717L86886l40271o04782m25262j34507k46200
$$ 741168594 741175079 741313171 741991653 742091370 742478256 742137985 741533203 741107941 740973434 740727234
2055.1G40727234n86853P6370l74679L21731L99399M85840K88391k65503J95389q51746
$$ 740727234 740140381 740216751 739842072 740163803 740563202 741049042 741337433 741071930 741267319 740415573
2064.7G40415573l50799j87607j20240o0501l42865L88413O8054M32205J36261j39160
$$ 740415573 740064774 739877167 739756927 739696426 739353561 739741974 739810028 740242233 740378494 740239334
2074.4G40239334l17078j69448J58844n11170m48150n08423M67224J37329j74942L38364
$$ 740239334 739922256 739752808 739911652 739400482 738952332 738443909 738911133 739048462 738873520 739211884
2084G39211884K9373K26516l86505j21460l09753l62396l07389k02560J55411n60761
$$ 739211884 739241257 739467773 739081268 738959808 738650055 738287659 737980270 737777710 737933121 737372360
2093.7G37372360M3030r6970L64838K55280m25034N8212l85437j88446m73709j54953
$$ 737372360 737415390 737318420 737683258 737938538 737513504 737571716 737186279 736997833 736524124 736369171
2103.3G36369171l31726j68457L51563j96534L85895r6207l9520j74484l63007l20739
$$ 736369171 736037445 735868988 736220551 736024017 736409912 736313705 736274185 736099701 735736694 735415955
2113G35415955m89502j00556n81970J80969R7428K12555L72695j64032M8295l99781
$$ 735415955 734926453 734825897 734243927 734424896 734522324 734734879 735107574 734943542 734991837 734592056
2122.6G34592056J94855k25601m86221k52533j10093L01209j97296K746j85775K29644
$$ 734592056 734786911 734561310 734075089 733822556 733712463 734013672 733816376 733819122 733633347 733862991
2132.3G33862991L66440K39487r5825o74134j33361k70157N3711n0507M50592O28281
$$ 733862991 734229431 734468918 734373093 733698959 733565598 733295441 733349152 733298645 733749237 734377518
2141.9G34377518j29853j25503k56653L51028j05209k26745l57438r7503K87628m41742
$$ 734377518 734247665 734122162 733865509 734216537 734111328 733884583 733527145 733429642 733717270 733275528
2151.5G33275528K58636n035N6000M7531K15073N31692l11279o4469l14712j40991
$$ 733275528 733534164 733529129 733585129 733632660 733847733 734379425 734068146 734003677 733688965 733547974
2161.2G33547974j59760K10037K17972j88522M24423r6359K01339L2425J00861l6621
$$ 733547974 733388214 733598251 733816223 733627701 734052124 733955765 734157104 734189529 734290390 734253769
2170.8G34253769n23834p3014o2408O16074o2485O714K60086p8812J04523k90375K00729
$$ 734253769 733729935 733656921 733594513 734210587 734148102 734154816 734414902 734336090 734440613 734150238 734350967
2181.4G34350967J42975J46561l12424r5215J93558j16424K69470l05710M26178K64816
$$ 734350967 734493942 734640503 734328079 734232864 734426422 734309998 734579468 734273758 734699936 734964752
2191.1G34964752o2942j78986m31671L37753k97546J04523J48849J60217L71399J12076
$$ 734964752 734901810 734722824 734291153 734628906 734331360 734435883 734584732 734744949 735116348 735228424
2200.7G35228424n3482n19943K90680O2713J69220K8611j07193L01055j73797K01874
$$ 735228424 735174942 734654999 734945679 735008392 735177612 735206223 735099030 735400085 735226288 735428162
2210.4G35428162q8654J18103k16370j69906K72903J068L37296n05142r7809k3880
$$ 735428162 735339508 735457611 735241241 735071335 735344238 735345306 735682602 735177460 735079651 735055771
2220G35055771n4932M72489Q2168l7155k42538J55105k73208J5792K99988O8054j03225
$$ 735055771 735000839 735473328 735555496 735518341 735275803 735430908 735157700 735173492 735473480 735541534 735438309
2230.6G35438309o24619K08283K86026N16204p1029k34528L60337l34321l15246m43573
$$ 735438309 734813690 735021973 735307999 735824203 735753174 735518646 735878983 735544662 735229416 734785843
2240.3G34785843L16849j7243j96380M56009O5231R0332m98734j14288k2736k5329
$$ 734785843 735102692 735085449 734889069 735345078 735410309 735500641 735001907 734887619 734864883 734839554
2249.9G34839554L586r1858L95279n3177r690l84521P5150L05175j32370J30158k76566
$$ 734839554 734843140 734751282 735146561 735093384 735083694 734699173 734774323 735079498 734947128 735077286 734800720
2260.5G34800720k2659R9182o4545n00641J78681N32150l65906l54538k41394L92914
$$ 734800720 734778061 734877243 734812698 734312057 734490738 735022888 734656982 734302444 734061050 734453964
2270.2G34453964o9885l1433J9836n57022j55868j5641L58506o3324O4621k59247m18091
$$ 734453964 734384079 734352646 734372482 733815460 733659592 733643951 734002457 733939133 734003754 733744507 733326416
2280.8G33326416J03149K9374M16793l36151j35040k52838m38156p2861J46027P36999
$$ 733326416 733429565 733458939 733875732 733539581 733404541 733151703 732713547 732640686 732786713 733523712
2290.4G33523712l68576j70975j83868k31781j70441m78973R3460n75943L0060j04981
$$ 733523712 733155136 732984161 732800293 732568512 732398071 731919098 732012558 731436615 731466675 731361694
2300G31361694J34735M02756m66766K03094J70517p5531j023178m67224k51160n51834
$$ 731361694 731496429 731899185 731432419 731635513 731806030 731730499 730707321 730240097 729988937 729437103
2309.7G29437103L47443j64414M13361K29k2736j92642m88281O0882l80325l73917
$$ 729437103 729784546 729620132 730033493 730033722 730010986 729818344 729330063 729390945 729010620 728636703
2319.3G28636703j378555l30200K5177M654j62659o97403J062928K73971J63956p08313
$$ 728636703 727258148 726927948 726953125 726957779 726795120 726097717 727160645 727434616 727598572 726890259
2329G26890259n98297m49448r29337N0126p46155R81598K92968j07727n8898l42179
$$ 726890259 726291962 725842514 724913177 724963303 724217148 725198746 725491714 725383987 725325089 724982910
2338.6G24982910p3089j213227P79572l3417o34842o51855O7215J053695M33121P83539
$$ 724982910 724909821 723696594 724476166 724442749 723807907 723156052 723223267 724276962 724710083 725493622
2348.3G25493622q927j73034j025620l08838k54669j329956o561j474228K33917q84323
$$ 725493622 725484695 725311661 724286041 723977203 723722534 722392578 722386017 720911789 721145706 720261383
2357.9G20261383o41251J483918P75604N64728j920700p13272j136094Q24356P26319
$$ 720261383 719620132 721104050 721879654 722444382 720523682 719810410 718674316 719498672 720224991
2366.6G20224991q38013K90833m05121J240692O94656L88413j25656m45786M6997p40967
$$ 720224991 719386978 719677811 719272690 720513382 721208038 721596451 721470795 721025009 721072006 720331039
2376.2G20331039n09719m08020K69241M46319O74134L85208k4033p0343r06906j82190
$$ 720331039 719821320 719413300 719682541 720128860 720802994 721188202 721164169 721093826 720186920 720004730
2385.9G20004730k6169k81677l74145l85437n3025l37524L69415K35825k87552j90353
$$ 720004730 719978561 719696884 719322739 718937302 718884277 718546753 718916168 719151993 718864441 718674088
2395.5G18674088p2556m34189q39996l73993o11878m24118l0365J43204j85852j34125
$$ 718674088 718601532 718167343 717327347 716953354 716341476 715917358 715886993 716030197 715844345 715710220
2405.2G15710220L35923l51258k33841l69720n37033p01752o21109O4392j92947j89057
$$ 715710220 716046143 715694885 715461044 715091324 714554291 713852539 713231430 713295822 713102875 712913818
2414.8G12913818l92990j93557R3917j6021k60620l43476m92096j046142j08033N6000
$$ 712913818 712520828 712327271 712421188 712405167 712144547 711801071 711308975 710262833 710154800 710210800
2424.5G10210800j56479l55148m41513J21384l41568j53580n20935m99268l13492n10406
$$ 710210800 710054321 709699173 709257660 709379044 709037476 708883896 708362961 707863693 707550201 707039795
2434.1G07039795k09885p34100k12479R384j24664j38473j02387j82876n89982j71356
$$ 707039795 706829910 706095810 705883331 705892715 705768051 705629578 705527191 705344315 704754333 704582977
2443.7G04582977q99505r71070k42614J10244k05078o70318J11160k67410m91333l45459
$$ 704582977 703683472 702712402 702469788 702580032 702374954 701704636 701815796 701548386 701057053 700711594
2453.4G00711594j24436L8986n89981o32171n76783l02429l53927l23258m48913l35160
$$ 700711594 700587158 700626144 700036163 699403992 698827209 698524780 698170853 697847595 697398682 697063522
2463F97063522J22834j05362K9907o16226r48792o13632l85361k82440l99780k14768
$$ 697063522 697186356 697080994 697110901 696494675 695545883 694932251 694546890 694264450 693864670 693649902
2472.7F93649902k03933J11923k96631o59332n28107k29111k17971j024628q79288
$$ 693649902 693445969 693557892 693261261 692601929 692073822 691844711 691626740 690602112 689722824
2481.3F89722824n64346l9749l38517o17218j49917k45896J4801m82940k93045l08457
$$ 689722824 689158478 689118729 688780212 688162994 688013077 687767181 687781982 687299042 687005997 686697540
2491F86697540j083297r33762l25165Q9951n36194m10843l57056k65045j93863m10995
$$ 686697540 685614243 684680481 684355316 684445267 683909073 683498230 683141174 682876129 682682266 682271271
2500.6F82271271r1400o34995q03757q30230n72892o66732n30091K06833l49197n22537
$$ 682271271 682179871 681544876 680741119 679910889 679337997 678671265 678141174 678348007 677998810 677476273
2510.3F77476273n51606j28936k32544o33850o25306o73751O942m18014m21067j59530
$$ 677476273 676924667 676795731 676563187 675929337 675304031 674630280 674637222 674219208 673798141 673638611
2519.9F73638611m4098m55933r71985N9510l57666p69120p43942o35376m02756m14352
$$ 673638611 673594513 673138580 672166595 672226105 671868439 671099319 670355377 669720001 669317245 668902893
2529.6F68902893N8670j68610j11160n69534m89731k14844o19125l10516n37033l24173
$$ 668902893 668961563 668792953 668681793 668112259 667622528 667407684 666788559 666478043 665941010 665616837
2539.2F65616837l58963n12619l62549l20740l60336o17905m64478m73709k0294l82614
$$ 665616837 665257874 664745255 664382706 664061966 663701630 663083725 662619247 662145538 662125244 661742630
2548.9F61742630o37817l26310m60586j57242l23029k98080p13730m83246j3275n33447
$$ 661742630 661104813 660778503 660317917 660160675 659837646 659539566 658825836 658342590 658329315 657795868
2558.5F57795868n91889n98907k33307n06821m83017j77917j69678k87933q62808l29895
$$ 657795868 657203979 656605072 656371765 655864944 655381927 655204010 655034332 654746399 653883591 653553696
2568.1F53553696j52970l85971n64956n40619l92304k87246l16926r25750j81732R2239
$$ 653553696 653400726 653014755 652449799 651909180 651516876 651229630 650912704 649986954 649805222 649897461
2577.8F49897461j24435l71399o78864l65753n43213p172n20630q95309l23334m04281
$$ 649897461 649773026 649401627 648722763 648357010 647813797 647806625 647285995 646390686 646067352 645663071
2587.4F45663071n52826o87104o9351l34396l32947j93481m11377j30081m09546m00772
$$ 645663071 645110245 644423141 644353790 644019394 643686447 643492966 643081589 642951508 642541962 642141190
2597.1F42141190p03583o34613p44095o29234J2245j76239j13068p04956q79669m88510
$$ 642141190 641437607 640802994 640058899 639429665 639441910 639265671 639152603 638447647 637567978 637079468
2606.7F37079468l40386m32930n04684k23694m55284m10996o97593p85599o36139l02467
$$ 637079468 636739082 636306152 635801468 635577774 635122490 634711494 634013901 633228302 632592163 632289696
2616.4F32289696j09902q51288p57789n61371m08173n98945m46053j72958p29790m19998
$$ 632289696 632179794 631328506 630570717 630009346 629601173 629002228 628556175 628383217 627653427 627233429
2626F27233429j89667l23753o53610n55039r04999j053238j60255m67949o09360o00776
$$ 627233429 627043762 626720009 626066399 625511360 624606361 623553123 623392868 622924919 622315559 621714783
2635.6F21714783j71624k40135o71005k77977m20494r232l34816p36694r57680r87968
$$ 621714783 621543159 621303024 620632019 620354042 619933548 619924316 619589500 618852806 617895126 616907158
2645.3F16907158l08647m17519k77367n04379m00772m77829o01272m29078q39538l60756
$$ 616907158 616598511 616180992 615903625 615399246 614998474 614520645 613919373 613490295 612650757 612290001
2654.9F12290001n22080m19006k91748p22656m04892k27089k24190m62379l09105m56619
$$ 612290001 611767921 611348915 611057167 610334511 609929619 609702530 609478340 609015961 608706856 608250237
2664.6F08250237m43688m19083n73501k83928m38957r0027l43933m24919l9330k98958
$$ 608250237 607806549 607387466 606813965 606530037 606091080 606001053 605657120 605232201 605192871 604893913
2674.2F04893913l76396o05583m58870l11508p4501l94707q71696m34876l18184m01115
$$ 604893913 604517517 603911934 603453064 603141556 603067055 602672348 601800652 601365776 601047592 600646477
2683.9F00646477l64685j98746l32069j56098l30582q16993p03621p03201j74637j38779
$$ 600646477 600281792 600083046 599750977 599594879 599264297 598447304 597743683 597040482 596865845 596727066
2693.5E96727066m01421m21943k07100K4261k36282j81541n13649m97246n42717p59850
$$ 596727066 596325645 595903702 595696602 595720863 595484581 595303040 594789391 594292145 593749428 592989578
2703.1E92989578m41818k7847L03840l83834n12047j42937j88026n16472p73239m00734
$$ 592989578 592547760 592519913 592823753 592439919 591927872 591784935 591596909 591080437 590307198 589906464
2712.8E89906464j85967j89094n07088k10953L3302k74696m99000l51487P2251o49414
$$ 589906464 589720497 589531403 589024315 588813362 588846664 588571968 588072968 587721481 587793732 587144318
2722.4E87144318p35360k78244k57148m78249n39665r5406m40674j98516n8403k29226
$$ 587144318 586408958 586130714 585873566 585395317 584855652 584760246 584319572 584121056 584062653 583833427
2732.1E83833427J21384m959m02870o54717l84445j84555K7466m14696j31988L40538
$$ 583833427 583954811 583949852 583546982 582892265 582507820 582323265 582350731 581936035 581804047 582144585
2741.7E82144585o00434o99615n29862K02942J30616m55246l37143m80156K44102M5815
$$ 582144585 581544151 580844536 580314674 580517616 580648232 580192986 579855843 579375687 579619789 579665604
2751.4E79665604n14984n55306k02827j72501n39436J0872m6120K01683j75858q11309
$$ 579665604 579150620 578595314 578392487 578219986 577680550 577691422 577645302 577846985 577671127 576859818
2761E76859818p34139n92308p0686m09966l4981j27105o02646j81580l35121m19960
$$ 576859818 576125679 575533371 575462685 575052719 575017738 574890633 574287987 574106407 573771286 573351326
2770.7E73351326k08397k7428m93736k47650k62833p77626k71072k57111p36198q80241
$$ 573351326 573142929 573115501 572621765 572374115 572111282 571333656 571062584 570805473 570069275 569189034
2780.3E69189034q6022l81584p02095k79503n63812k26288l50609M807o8856q53843
$$ 569189034 569103012 568721428 568019333 567739830 567176018 566949730 566599121 566603928 566535072 565681229
2789.9E65681229p44477q20999m64134m10767m70085o19278q88824n70221k30332l88641
$$ 565681229 564936752 564115753 563651619 563240852 562770767 562151489 561262665 560692444 560462112 560073471
2799.6E60073471j053657q35419k78282l12004q13179o14090l49083q71430p65648
$$ 560073471 559019814 558184395 557906113 557594109 556780930 556166840 555817757 554946327 554180679
2808.3E54180679o92939n20668o60325p23190o28052j035194j055832j100502m60625
$$ 554180679 553487740 552967072 552306747 551583557 550955505 549920311 548864479 547763977 547303352
2816.9E47303352l74794q71048q53920p90824m39988p14149q94089r37996j164779
$$ 547303352 546928558 546057510 545203590 544412766 543972778 543258629 542364540 541426544 540261765
2825.6E40261765j098748r20639q96988q77838o40945o08788n77812j113205j261063
$$ 540261765 539163017 538242378 537345390 536467552 535826607 535217819 534640007 533526802 532265739
2834.3E32265739j253509j121292n10521j163445j298217j665497j955109j140480
$$ 532265739 531012230 529890938 529380417 528216972 526918755 525253258 523298149 522157669
2842E22157669j696091k284965j962242j624909j509895j499023j940766k053337j820488
$$ 522157669 520461578 518176613 516214371 514589462 513079567 511580544 509639778 507586441 505765953
2850.7E05765953j781082j320877j293640p51419l84827m76227j93024N6382L70674
$$ 505765953 503984871 502663994 501370354 500618935 500234108 499757881 499564857 499621239 499991913
2859.4D99991913l21427r13505j071968m48837m769o75354p48215r30366q26187j007271
$$ 499991913 499670486 498756981 497685013 497236176 497231407 496556053 495807838 494877472 494051285 493044014
2869D93044014j077805o46705o47545o67305r17931l25966m48799j167221r74540q87642
$$ 493044014 491966209 491319504 490671959 490004654 489086723 488760757 488311958 487144737 486170197 485282555
2878.7D85282555j027832r71375l75709n14145q24242j009750r98955p34749r20525
$$ 485282555 484254723 483283348 482907639 482393494 481569252 480559502 479560547 478825798 477905273
2887.3D77905273o52084j137276j519317r45397o05697o23017q55064r43260j109619
$$ 477905273 477253189 476115913 474596596 473651199 473045502 472422485 471567421 470624161 469514542
2896D69514542q11921q51974q72688o86989p54280l62854p28798q05893n58128q28057
$$ 469514542 468702621 467850647 466977959 466290970 465536690 465173836 464445038 463639145 463081017 462252960
2905.7D62252960p56569o69098p76443j145630j258354j131134j247940j502610j452980
$$ 462252960 461496391 460827293 460050850 458905220 457646866 456515732 455267792 453765182 452312202
2914.3D52312202j470756j415520j037483j081848j158829j331062j536942j357460
$$ 452312202 450841446 449425926 448388443 447306595 446147766 444816704 443279762 441922302
2922.1D41922302p16133j008377r39064L58276k35977k34794Q7204k65618K81029q392
$$ 441922302 441206169 440197792 439258728 439617004 439381027 439146233 439233437 438967819 439248848 439240456
2931.7D39240456P591L71017M35677J20582K35940P14378L19328N36232O92482P63321
$$ 439240456 439248047 439619064 440054741 440175323 440411263 441125641 441444969 441981201 442673683 443437004
2941.3D43437004P77817P12204P88269M43878N82886O93893R71718J026878P18117
$$ 443437004 444214821 444927025 445715294 446159172 446742058 447435951 448407669 449434547 450152664
2950D50152664O32477O15654M47884J60904P45582O81343M47922M22783J18828L88183
$$ 450152664 450785141 451400795 451848679 452009583 452755165 453436508 453884430 454307213 454426041 454814224
2959.7D54814224N14298Q28247O98585Q10051J020127N48210N72166L20206K97432
$$ 454814224 455328522 456156769 456855354 457665405 458685532 459233742 459805908 460126114 460423546
2968.3D60423546R15756J046295O46324Q84171R69887M59175N13954N11436N11895
$$ 460423546 461339302 462385597 463031921 463916092 464885979 465345154 465859108 466370544 466882439
2977D66882439N38788P22999O21796L69758K02828k85912K13928N26123K69585L55606
$$ 466882439 467421227 468144226 468766022 469135780 469338608 469052696 469266624 469792747 470062332 470417938
2986.7D70417938M35753J8463l29323M07105M80232j27144m20036k46048P5798J4763
$$ 470417938 470853691 470872154 470542831 470949936 471430168 471303024 470882988 470636940 470712738 470727501
2996.3D70727501j74332n94558l44620q3199n08537p83310m93622l26118p20520o98738
$$ 470727501 470553169 469958611 469613991 469530792 469022255 468238945 467745323 467419205 466698685 465999947
3006D65999947o63338n07927l90701p12929q38547n41534m41017o93856m50592p24144
$$ 465999947 465336609 464828682 464437981 463725052 462886505 462344971 461903954 461210098 460759506 460035362
3015.6D60035362q11844m46396p55920q87985p94106p74650n63774k28882j012840
$$ 460035362 459223518 458777122 458021202 457133217 456339111 455564461 455000687 454771805 453758965
3024.3D53758965j007195m44870j166801o63567k30446q11500j289864r28803m03518
$$ 453758965 452751770 452306900 451140099 450476532 450246086 449434586 448144722 447215919 446812401
3033D46812401q04558j123390j269875o05888q30765j232948o42357q73718p72744
$$ 446812401 446007843 444884453 443614578 443008690 442177925 440944977 440302620 439428902 438656158
3041.6D38656158p13501q32557r03549j021996j010017q11577n99861j113968j014862
$$ 438656158 437942657 437110100 436206551 435184555 434174538 433362961 432763100 431649132 430634270
3050.3D30634270p17354o56510p70835j022110j152687j097489o61812q21876o41823
$$ 430634270 429916916 429260406 428489571 427467461 426314774 425217285 424555473 423733597 423091774
3059D23091774j078453j257782n29251o08025n90286j105690o53496m25453r11331
$$ 423091774 422013321 420755539 420226288 419618263 419027977 417922287 417268791 416843338 415932007
3067.7D15932007p14531j073761n15480p37877j258659o82907o62690p06672o94199
$$ 415932007 415217476 414143715 413628235 412890358 411631699 410948792 410286102 409579430 408885231
3076.4D08885231o88438p75299m48723n86701j261787j130600m29917j33476o66237
$$ 408885231 408196793 407421494 406972771 406386070 405124283 403993683 403563766 403430290 402764053
3085D02764053r12780q97828q33664q14247l72047l60031j023827r79538j000938n28870
$$ 402764053 401851273 400953445 400119781 399305534 398933487 398573456 397549629 396570091 395569153 395040283
3094.7C95040283p29255j026803m72641n82275p51800j043282o02417p13120q51097
$$ 395040283 394311028 393284225 392811584 392229309 391477509 390434227 389831810 389118690 388267593
3103.4C88267593m43229r86824q98400o30188m09088p40700j215400j127053r66720
$$ 388267593 387824364 386837540 385939140 385308952 384899864 384159164 382943764 381816711 380849991
3112C80849991o63757n61600k80533r12933r61876q41408j150169k81258l88680q17489
$$ 380849991 380186234 379624634 379344101 378431168 377469292 376627884 375477715 375196457 374807777 373990288
3121.7C73990288j445732j470375o65589p27920p10068q72879q66585p08885m87671
$$ 373990288 372544556 371074181 370408592 369680672 368970604 368097725 367231140 366522255 366034584
3130.4C66034584m70581j119270j313172p03582p55387j083336k73704n19257q89816
$$ 366034584 365564003 364444733 363131561 362427979 361672592 360589256 360315552 359796295 358906479
3139C58906479p66945j006699n89370o77224q80165j217613r93080p83310j234627
$$ 358906479 358139534 357132835 356543465 355866241 354986076 353768463 352775383 351992073 350757446
3147.7C50757446p79495m59862l11851p10945q35801o17485p25288r36699j413994
$$ 350757446 349977951 349518089 349206238 348495293 347659492 347042007 346316719 345380020 343966026
3156.4C43966026p15446p48177j344757j176605p19757k35634p18231r71909j140556
$$ 343966026 343250580 342502403 341157646 339981041 339261284 339025650 338307419 337335510 336194954
3165.1C36194954q04176m41094j038513j164398q90427n96046n92995p43256j138000
$$ 336194954 335390778 334949684 333911171 332746773 331856346 331260300 330667305 329924049 328786049
3173.8C28786049j038551o35643n45388m49447j041870j281624q95272k37808k84653
$$ 328786049 327747498 327111855 326566467 326117020 325075150 323793526 322898254 322660446 322375793
3182.4C22375793r52606j082535r09214n19180p67288q38852j109066r92088l39165
$$ 322375793 321423187 320340652 319431438 318912258 318144970 317306118 316197052 315204964 314865799
3191.1C14865799p27177q14209q26626l50990n55591j124382q43392r59511l49941
$$ 314865799 314138622 313324413 312497787 312146797 311591206 310466824 309623432 308663921 308313980
3199.8C08313980p31144j028805m86335p16591k76947k99034q23574p36161p60727
$$ 308313980 307582836 306554031 306067696 305351105 305074158 304775124 303951550 303215389 302454662
3208.5C02454662j046257m76818j51272m77581m38213j300735j253701k99797n31406
$$ 302454662 301408405 300931587 300780315 300302734 299864521 298563786 297310085 297010288 296478882
3217.2B96478882p98588n38635m96960o12144n92118j133556q55637k97928o24122
$$ 296478882 295680294 295141659 294644699 294032555 293440437 292306881 291451244 291153316 290529194
3225.8B90529194l69511k83756p65209p20902m23679o04286l69988n10483q98437l33118
$$ 290529194 290159683 289875927 289110718 288389816 287966137 287361851 286991863 286481380 285582943 285249825
3235.5B85249825m94919p21073p39460n45903k16789o81171p12719n63126n10693l65161
$$ 285249825 284754906 284033833 283294373 282748470 282531681 281850510 281137791 280574665 280063972 279698811
3245.1B79698811j04676p1754n11036r06296r90162n91163n16491m31691k30941k36664
$$ 279698811 279594135 279522381 279011345 278105049 277114887 276523724 276007233 275575542 275344601 275107937
3254.8B75107937k12708l94592p40204p73678k76355l15228m36916q15525q53081j72348
$$ 275107937 274895229 274500637 273760433 272986755 272710400 272395172 271958256 271142731 270289650 270117302
3264.4B70117302m78287k42195m11987q10681J374N2471n88665q84075n04284l74832
$$ 270117302 269639015 269396820 268984833 268174152 268175526 268227997 267639332 266755257 266250973 265876141
3274B65876141l7690n512p46384n77793k43625r5387k99167m75312m94728l58677k39391
$$ 265876141 265838451 265832939 265086555 264508762 264265137 264169750 263870583 263395271 262900543 262541866 262302475
3284.7B62302475p08408n04685l08723j46847k11754n62401k15206k87800l70845k91825
$$ 262302475 261594067 261089382 260780659 260633812 260422058 259859657 259644451 259356651 258985806 258693981
3294.3B58693981l05195l72867k48795N5523j59931n96943r08890k73037R9201k66742
$$ 258693981 258388786 258015919 257767124 257822647 257662716 257065773 256156883 255883846 255983047 255716305
3303.9B55716305m50573n77221j49784K0313j15662m08134r20773p40718l66860m34284
$$ 255716305 255265732 254688511 254538727 254559040 254443378 254035244 253114471 252373753 252006893 251572609
3313.6B51572609k40536p8258m79203k96650j81732l85570n62744q77381l41530k8019
$$ 251572609 251332073 251253815 250774612 250477962 250296230 249910660 249347916 248470535 248129005 248100986
3323.2B48100986m60071o79035m58565n65701o27708l97301r85069q27274l60527n41325
$$ 248100986 247640915 246961880 246503315 245937614 245309906 244912605 243927536 243100262 242739735 242198410
3332.9B42198410o92463m13055K85186l95851q28647m36192o16989n43003n78728n45311
$$ 242198410 241505947 241092892 241378078 240982227 240153580 239717388 239100399 238557396 237978668 237433357
3342.5B37433357m33407o65035p98149l90415R1038j18561o86226o01101J51119j9607
$$ 237433357 236999950 236334915 235536766 235146351 235237389 235118828 234432602 233831501 233982620 233963013
3352.2B33963013l97721k58960l27568l66097m13265j34182k65732p45125l95660j63994
$$ 233963013 233565292 233306332 232978764 232612667 232199402 232065220 231799488 231054363 230658703 230494709
3361.8B30494709j59531K0714l21045m73881O7330n5294k21710J49154l05404n77450
$$ 230494709 230335178 230355892 230034847 229560966 229628296 229573002 229351292 229500446 229195042 228617592
3371.4B28617592K6569j42040o56490k87743M51183J47419r99946o14987L34874P381
$$ 228617592 228644161 228502121 227845631 227557888 228009071 228156490 227156544 226541557 226876431 226883812
3381.1B26883812k54974J54419K27184l95184j35441J36776l50647n4035J38684q0224
$$ 226883812 226628838 226783257 227010441 226615257 226479816 226616592 226265945 226211910 226350594 226270370
3390.7B26270370k74791j70956L25661L22552k26441n12600p2841K82382O9161o28872
$$ 226270370 225995579 225824623 226150284 226472836 226246395 225733795 225660954 225943336 226012497 225383625
3400.4B25383625n11188R9639O7788M8122j04198J01985J94474L20854L97186j0795
$$ 225383625 224872437 224972076 225039864 225087986 224983788 225085773 225280247 225601101 225998287 225987492
3410B25987492k3137L9731M62532K8915n2166O17466K75402J33877j06125J8845j63231
$$ 225987492 225964355 226004086 226466618 226495533 226443367 227060833 227336235 227470112 227363987 227382832 227219601
3420.6B27219601j68591O07700Q65918O92691j23958L04470L72314j98021K13528L12443
$$ 227219601 227051010 227658710 228524628 229217319 229093361 229397831 229770145 229572124 229785652 230098095
3430.3B30098095J40781l01380M52481R05551L87211K32392L05442O24428K74735L23047
$$ 230098095 230238876 229937496 230389977 231295528 231682739 231915131 232220573 232845001 233119736 233442783
3439.9B33442783K52800L57075N29080K85778P49645P68757N20000k38323J96323Q29964
$$ 233442783 233695583 234052658 234581738 234867516 235617161 236385918 236905918 236667595 236863918 237693882
3449.6B37693882P32727O63528J1025R39884J225948K18125L83587P61108K08149J07670
$$ 237693882 238426609 239090137 239101162 240041046 241266994 241485119 241868706 242629814 242837963 242945633
3459.2B42945633J034679O30951P06826M08039Q1787J227264J208763R61209M24671
$$ 242945633 243980312 244611263 245318089 245726128 245807915 247035179 248243942 249205151 249629822
3467.9B49629822L09200N18723J024246J138573M02755J001778M49333J25427J016388
$$ 249629822 249939022 250457745 251481991 252620564 253023319 254025097 254474430 254599857 255616245
3476.6B55616245Q78163N59501J196137J664238L37009M88758J059132Q41560P60231
$$ 255616245 256494408 257053909 258250046 259914284 260251293 260740051 261799183 262640743 263400974
3485.2B63400974O29750J050357P69005Q55980N93510O17599J331845J095981N44758
$$ 263400974 264030724 265081081 265850086 266706066 267299576 267917175 269249020 270345001 270889759
3493.9B70889759L51734P74212O00872J350632J655903J059952P94086N63889J395435
$$ 270889759 271241493 272015705 272616577 273967209 275623112 276683064 277477150 278041039 279436474
3502.6B79436474R91306J025906R72233K58369Q29220J329002J195011L28427J146583
$$ 279436474 280427780 281453686 282425919 282684288 283513508 284842510 286037521 286365948 287512531
3511.3B87512531J300869J316452J413479N22518J224099R02042J080170J421337Q81805
$$ 287512531 288813400 290129852 291543331 292065849 293289948 294191990 295272160 296693497 297575302
3520B97575302J403198J369686Q81615L83034J335125J643982J438808J265049P86476
$$ 297575302 298978500 300348186 301229801 301612835 302947960 304591942 306030750 307295799 308082275
3528.6C08082275R61113R36451J466885J237049J480446J517124J073074J140938N11399
$$ 308082275 309043388 309979839 311446724 312683773 314164219 315681343 316754417 317895355 318406754
3537.3C18406754J331310J662769J453133J331520J481857J399689R85603J772080
$$ 318406754 319738064 321400833 322853966 324185486 325667343 327067032 328052635 329824715
3545C29824715J769638J470756M86870K004471K609711J404495J759529N41573J737213
$$ 329824715 331594353 333065109 333551979 335556450 338166161 339570656 341330185 341871758 343608971
3553.7C43608971J996307J731339J802291Q14248J996231J370735J745186J854171
$$ 343608971 345605278 347336617 349138908 349953156 351949387 353320122 355065308 356919479
3561.4C56919479J878739K118225J052513K421532L12080J262169K314911J122360
$$ 356919479 358798218 360916443 361968956 364390488 364702568 365964737 368279648 369402008
3569.1C69402008K882767J854210K305755K249909J471176J494484K442283K517701
$$ 369402008 372284775 374138985 376444740 378694649 380165825 381660309 384102592 386620293
3576.9C86620293J400413K726517J705055J220780K308731K941513K511940R78851
$$ 386620293 388020706 390747223 392452278 393673058 395981789 398923302 401435242 402414093
3584.6D02414093K967606K106971J393013K318573M71268K911339K737465K498054
$$ 402414093 405381699 407488670 408881683 411200256 411671524 414582863 417320328 419818382
3592.3D19818382J789208J875229L426513Q98590K487107L406181K214394K872352
$$ 419818382 421607590 423482819 426909332 427807922 430295029 433701210 435915604 438787956
3600D38787956J300278K279205L320618K365494K449035K793808K512322M59556K958107
$$ 438787956 440088234 442367439 445688057 448053551 450502586 453296394 455808716 456268272 459226379
3608.7D59226379J251030J288491O307792J929169N48096L817138N12124M179382M283256
$$ 459226379 460477409 461765900 468073692 470002861 470550957 474368095 474880219 479059601 483342857
3617.4D83342857K090302K716026J0834K066040M502029L533516K410355L336639L004189
$$ 483342857 485433159 488149185 488160019 490226059 494728088 498261604 500671959 504008598 507012787
3626E07012787L240471N587158j70898m401093M915810N583496N140152K225494Q60062
$$ 507012787 510253258 515840416 515669518 511268425 516184235 521767731 526907883 529133377 529993439
3634.7E29993439L298263L680458L062897J648254J866036L156776L422127K603302
$$ 529993439 533291702 536972160 540035057 541683311 543549347 546706123 550128250 552731552
3642.4E52731552K303925K895965L096543M228057n12771j319084N824814J722068
$$ 552731552 555035477 557931442 561027985 565256042 564743271 563424187 569249001 570971069
3650.1E70971069L61328J813813N335273M815102L627930M464340m210892K551117
$$ 570971069 571332397 573146210 578481483 583296585 586924515 591388855 587177963 589729080
3657.9E89729080N474053K050094K574806J961022K764549J370926J740418K039337
$$ 589729080 595203133 597253227 599828033 601789055 604553604 605924530 607664948 609704285
3665.6F09704285Q11538M078446J865883j54534J237335l029632K854729O394767O882134
$$ 609704285 610515823 614594269 616460152 616305618 617542953 614513321 617368050 623762817 630644951
3674.3F30644951j759377j1431198L744278O927262M612503q51899R56879K344360
$$ 630644951 628885574 617454376 621198654 628125916 632738419 631886520 632843399 635187759
3682F35187759J708451J190262N82809J090126L599663N190811p457428j979179O480827
$$ 635187759 636896210 638086472 638669281 639759407 643359070 648549881 641092453 639113274 645594101
3690.6F45594101m160690J325760N317535J182098J125031L26080j36871J365967Q95462
$$ 645594101 641433411 642759171 648076706 649258804 650383835 650709915 650573044 651939011 652834473
3699.3F52834473K374496K773285m480133j695633M410248K072449N34210Q8806K073135
$$ 652834473 655208969 657982254 653502121 651806488 656216736 658289185 658823395 658912201 660985336
3708F60985336L103867n710526K550507K107391r393234N314713M817962O79016O7063
$$ 660985336 664089203 658378677 660929184 663036575 653643341 658958054 663776016 664455032 664522095
3716.7F64522095J767349J239319k904587J532898L835754l874130j530151N027389
$$ 664522095 666289444 667528763 664624176 666157074 669992828 666118698 664588547 669615936
3724.4F69615936O80847j814117j965713J352386L304672P40204M251633k073822n976486
$$ 669615936 670296783 668482666 666516953 667869339 671174011 671914215 676165848 674092026 668115540
3733.1F68115540O023864j123962m335785J448441O84204J167144K233963J860810
$$ 668115540 674139404 673015442 668679657 670128098 670812302 671979446 674213409 676074219
3740.8F76074219l089524K828522R311524r755478j1738282Q010331M195861M469758
$$ 676074219 672984695 675813217 685124741 675369263 663630981 671641312 675837173 680306931
3748.5F80306931l020936p103881R549636m319610n951157N750733M039077K521439
$$ 680306931 677285995 670182114 679731750 675412140 669460983 675211716 679250793 681772232
3756.2F81772232l802795J775818M174270n960083q97827L261032J482926O83746K219848
$$ 681772232 677969437 679745255 683919525 677959442 677061615 680322647 681805573 682489319 684709167
3764.9F84709167k193450l844147K176361L576660l4027o594696J645355L117752O25687
$$ 684709167 682515717 678671570 680847931 684424591 684390564 677795868 679441223 682558975 683184662
3773.6F83184662M79050L6239J084290J06964K060928j57165n794983K392502J849823
$$ 683184662 683663712 683699951 684784241 684891205 686952133 686794968 680999985 683392487 685242310
3782.3F85242310K95715J161957j777954m83704J188202P62863j34354n01785M90418
$$ 685242310 685538025 686699982 684922028 684438324 685626526 686389389 686255035 685753250 686243668
3790.9F86243668O13784L86963l23105J048127K290649k681122k142792J980439K772751
$$ 686243668 686857452 687244415 686921310 687969437 690260086 687578964 685436172 687416611 690189362
3799.6F90189362K908020p743454o048127M380799K406921L608170L082122p572631
$$ 690189362 693097382 685353928 679305801 683686600 686093521 689701691 692783813 685211182
3807.3F85211182k254258L745423J588211K53296N70602J75553O14166L711242j500244
$$ 685211182 682956924 686702347 688290558 688543854 689114456 689290009 689904175 693615417 692115173
3816F92115173r936371M284821M528961K706070o5765j2348786K600708M469071J304474
$$ 692115173 682178802 686463623 690992584 693698654 693632889 681284103 683884811 688353882 689658356
3824.7F89658356J136779o60781k130127O34308J362304J836472l0747n788726K931137
$$ 689658356 690795135 690134354 688004227 688638535 690000839 691837311 691806564 686017838 688948975
3833.4F88948975M854583n018081J496963P002487p491684m330062N133285k751770
$$ 688948975 693803558 688785477 690282440 697284927 689793243 685463181 690596466 687844696
3841.1F87844696R43985M614334k882843k002106K515870L06015l61100J367417p65000
$$ 687844696 688788681 693403015 690520172 688518066 691033936 691339951 690978851 692346268 691581268
3849.8F91581268J631089N165481l451614q24662j2894439J906433Q355102r79080
$$ 691581268 693212357 698377838 694926224 694101562 681207123 683113556 691468658 690489578
3857.5F90489578j084976J602936J922302J942597m472275K48260M554367l792495
$$ 690489578 689404602 691007538 692929840 694872437 690400162 690648422 695202789 691410294
3865.2F91410294l755799L182450L820953K568588o105575n661469L136597M991684
$$ 691410294 687654495 690836945 694657898 697226486 691120911 685459442 688596039 693587723
3872.9F93587723K541885p166443j66092K738495K78168J946106K463226n571213m150009
$$ 693587723 696129608 688963165 688797073 691535568 691813736 693759842 696223068 690651855 686501846
3881.6F86501846N624390J212540P05032K833786j0403519J119919L962937J063079
$$ 686501846 692126236 693338776 694043808 696877594 686474075 687593994 691556931 692620010
3889.3F92620010K764206j089630o241836K60009K556229R9411J841583P56684J159210
$$ 692620010 695384216 694294586 688052750 688312759 690868988 690968399 692809982 693566666 694725876
3898F94725876J319733p097321L572998J189346m638824K351837k629852l8986R36584
$$ 694725876 696045609 688948288 692521286 693710632 689071808 691423645 688793793 688754807 689691391
3906.7F89691391O91071J764984K31399o8970l68270P05871O22406k45132J71356P62482
$$ 689691391 690382462 692147446 692378845 692309875 691941605 692647476 693269882 693024750 693196106 693958588
3916.3F93958588k427445k811127K906724J16729k561340J397171J009827K34451j483078
$$ 693958588 691531143 688720016 691626740 691743469 689182129 690579300 691589127 691823578 690340500
3925F90340500j029358J769180J077118O63834p84149j177979R03931j303787r21021
$$ 690340500 689311142 691080322 692157440 692821274 692037125 690859146 691763077 690459290 689538269
3933.7F89538269J276856N96542O35605J73263q07800q45032K12097J637726M77066
$$ 689538269 690815125 691411667 692047272 692220535 691412735 690567703 690779800 692417526 692894592
3942.3F92894592l033905q15353J290588J024781J136245j228561K32315J87454j899643
$$ 692894592 689860687 689045334 690335922 691360703 692496948 691268387 691500702 691688156 689788513
3951F89788513J215820O4393p28150M26483N19562J99890j121597j23596J58767M68293
$$ 689788513 691004333 691068726 690340576 690767059 691286621 691486511 690364914 690241318 690400085 690868378
3960.7F90868378n34668j088333M03213o9656O74896L17078r1324M5166l92914N40619
$$ 690868378 690333710 689245377 689648590 689578934 690253830 690570908 690479584 690524750 690131836 690672455
3970.3F90672455R23462M6081j285705m13437K07290J60141L44162L5325O20956q7585
$$ 690672455 691595917 691641998 690356293 689942856 690150146 690310287 690654449 690689774 691310730 691223145
3980F91223145p43714J4038M36249K6627l1434j15280l24859K01492j16043j92642
$$ 691223145 690479431 690493469 690929718 690956345 690924911 690809631 690484772 690686264 690570221 690377579
3989.6F90377579m84467j32065L35465q7891M04816K45361N37873M0588p64847l83148
$$ 690377579 689893112 689761047 690096512 690008621 690413437 690658798 691196671 691237259 690472412 690089264
3999.2F90089264Q4610
$$ 690089264 690173874
4000.2F90173874
$$ 690173874
##END=$$ End of the data block
