##TITLE=$$ Begin of the data block
##JCAMP-DX=5.00 $$ ACD/SpecManager v 10.08
##SPECTROMETER/DATA SYSTEM=Varian
##DATE=15 Jan 2013 10:02:32
##DATA TYPE=INFRARED SPECTRUM
##DATA CLASS=XYDATA
##ORIGIN=
##OWNER=
##NPOINTS=3735
##FIRSTX=399.26403809
##LASTX=4000.35498047
##MAXX=4000.35498047
##MINX=399.26403809
##MAXY=75.37834930
##MINY=22.57763481
##XFACTOR=1.0000000000
##YFACTOR=0.000000100000000
##FIRSTY=46.27959442
##DELTAX=0.96440572
##XUNITS=1/CM
##YUNITS=TRANSMITTANCE
##XYDATA=(X++(Y..Y))
399.3D62795944O140709q371658m899597j061135r832725l467369J1373520O881065
$$ 462795944 468936653 460564995 455665398 454604263 444771538 441304169 452677689 459558754
407D59558754K695541J443215m695015j758042R77440J51329Q80661k329216k263641
$$ 459558754 462254295 463697510 459002495 457244453 458221893 458373222 459253883 456924667 454661026
415.7D54661026K550125J240692k197265N221519j882896m234009J850510P337799
$$ 454661026 457211151 458451843 456254578 461476097 459593201 455359192 457209702 464547501
423.4D64547501j365853j1394539m328689M825363L26843p43179j4229r04121M732170
$$ 464547501 463181648 451787109 447458420 452283783 452610626 451867447 451853218 450949097 455681267
432.1D55681267K950821l580590m195556p68776J754494k159501M68483K775345j84250
$$ 455681267 458632088 455051498 450855942 450087166 451841660 449682159 450150642 452925987 452741737
440.7D52741737K305642k23771J870461L682442l826638n004158k814750R94949J464462
$$ 452741737 455047379 454823608 456694069 460376511 456549873 451545715 448730965 449725914 451190376
449.4D51190376J111908P7362m433860J257820O267204K198830k994767q288307n501442
$$ 451190376 452302284 452379646 447945786 449203606 455470810 457669640 454674873 446386566 440885124
458.1D40885124O96678P60651M725914N784874L157425k311897l075104R4604l125839
$$ 440885124 441581802 442342453 447068367 452853241 456010666 453698769 450623665 450718269 447592430
466.8D47592430j575584J74675m328308k437249l439293k923812O085205K687416l877106
$$ 447592430 446016846 446191521 441863213 439425964 435986671 433062859 439148064 441835480 437958374
475.5D37958374r81140N900917K557220n33523o90499m589309m651528n15251j329536
$$ 437958374 436977234 442878151 445435371 444901848 444211349 439622040 434970512 434455261 433125725
484.1D33125725l627434J778984L891907N98221J84059m24309j22681J95999j460342
$$ 433125725 429498291 431277275 435169182 435767403 435951462 435527153 435404472 435600471 434140129
492.8D34140129j602783k170944k254372K46620N29175O67763L151397Q66051l397178
$$ 434140129 432537346 430366402 428112030 428358650 428887825 429555588 432706985 433573036 430175858
501.5D30175858r34945K843171J075363m46663k250328l274231J146850Q86994k016258
$$ 430175858 429240913 432084084 433159447 432712784 430462456 427188225 428335075 429222069 427205811
510.2D27205811J67350J22490j400451K78129j214905m721794j737480L002853m39605
$$ 427205811 427373161 427495651 426095200 426373329 425158424 420436630 418699150 421702003 421262398
518.9D21262398j179009K113724Q02078k41966j121826j499748m55284j825638k47269
$$ 421262398 420083389 422197113 422999191 422757225 421635399 420135651 419680367 417854729 417607460
527.5D17607460O67419j122551K24953J630135M15001o3057J35154p54585o57310p85713
$$ 417607460 418274879 417152328 417377281 419007416 419422417 419359360 419494514 418739929 418082619 417296906
537.2D17296906k016564j128197j25007J65062P50808R6360j051293M4022K27470j030349
$$ 417296906 415280342 414152145 414027138 414192200 414943008 415039368 413988075 414032097 414259567 413229218
546.8D13229218q26569j838722r93691J13144j412964r10568L12996Q19092J95732
$$ 413229218 412402649 410563927 409570236 409683380 408270416 407359848 407672844 408491936 408687668
555.5D08687668p73850j649818j721230m55665l04108o29806l39775L20777M22707
$$ 408687668 407913818 406264000 404542770 404087105 403782997 403153191 402813416 403134193 403556900
564.2D03556900J391983J594658N99289N26543K21252j56097r76906j345024j278000
$$ 403556900 404948883 406543541 407142830 407669373 407890625 407734528 406757622 405412598 404134598
572.9D04134598j415749j17149J304436J782074l19672j379585p16744j137543p04269
$$ 404134598 402718849 402601700 403906136 405688210 405368538 403988953 403272209 402134666 401430397
581.5D01430397O27975J035080Q4534R9068L60985O32515J323013N3787m539K64129
$$ 401430397 402058372 403093452 403177986 403277054 403638039 404270554 405593567 405647354 405642815 405906944
591.2D05906944r31587n97229r5749N11971O83517J266365J561890p87392q98132L60908
$$ 405906944 404975357 404378128 404282379 404794350 405477867 406744232 408306122 407518730 406620598 406981506
600.8D06981506M4823L41034q1329j103363j470528l72009L700q27141n7716M04930
$$ 406981506 407026329 407367363 407286034 406182671 404712143 404340134 404343834 403516693 403458977 403863907
610.5D03863907P0343j226349j499977N30128L84865p20672l48053J77421n82962p44934
$$ 403863907 403934250 402707901 401207924 401738052 402122917 401402245 401054192 401231613 400648651 399903717
620.1C99903717M64249J397438K120552J081466K73133L78952K82516N54047O62003
$$ 399903717 400367966 401765404 403885956 404967422 405240555 405619507 405902023 406456070 407118073
628.8D07118073M17633J85241J577034K488175J966285J198159J778412K576904J540222
$$ 407118073 407535706 407720947 409297981 411786156 413752441 414950600 416729012 419305916 420846138
637.5D20846138J104431j49917j01929J106453J048317J477623J607742J022759K34718
$$ 420846138 421950569 421800652 421698723 422805176 423853493 425331116 426938858 427961617 428196335
646.2D28196335J309814J670037Q39195O92367M77372J9035r05838P63206J409150
$$ 428196335 429506149 431176186 432015381 432707748 433185120 433204155 432298317 433061523 434470673
654.8D34470673O75048J086464K59285K34337n69114j672974o88706q0299o29234k07520
$$ 434470673 435145721 436232185 436491470 436725807 436156693 434483719 433795013 433714714 433085480 432877960
664.5D32877960Q59375K62261j835518l318520M754906K885437O99768J37482N03769
$$ 432877960 433737335 433999596 432164078 428845558 433600464 436485901 437185669 437323151 437826920
673.2D37826920Q35685M39034J92642Q26759J749535J810913J409454J445923J062088
$$ 437826920 438662605 439101639 439294281 440121040 441870575 443681488 445090942 446536865 447598953
681.8D47598953J763573J779060O93207N70755n8784P7743J864433J848908O08368
$$ 447598953 449362526 451141586 451834793 452405548 452346764 452424507 454288940 456137848 456746216
690.5D56746216J597824J718788J87721m50630k21023K00920k4567O17371Q44230L67050
$$ 456746216 458344040 460062828 460250549 459799919 459578896 459779816 459755249 460372620 461216850 461583900
700.2D61583900J583748J939888R22203N39589K31285L45536J117782K86598l19824
$$ 461583900 463167648 465107536 466029739 466569328 466800613 467146149 468263931 468550529 468230705
708.8D68230705R75456J196366P44438J282883J407280O74820O21986J426659J319313
$$ 468230705 469206161 470402527 471146965 472429848 473837128 474511948 475133934 476560593 477879906
717.5D77879906l37868n9090M71688o06385J489678K407150K90184J36070K194100
$$ 477879906 477542038 477482948 477954636 477348251 478837929 481245079 481535263 481671333 483865433
726.2D83865433K718277K85873l41339n4665j14173P09304J460953J796379O29311
$$ 483865433 486583710 486869583 486528244 486473579 486359406 487068710 488529663 490326042 490955353
734.9D90955353O72111K051468J577568J23139m95987o31295R1858K61689p56684O46553
$$ 490955353 491627464 493678932 495256500 495379639 494883652 494252357 494344215 494605904 493849220 494495773
744.5D94495773J805497J197395R99260J725158J805726J69601N42030K51656o97327
$$ 494495773 496301270 497498665 498497925 500223083 502028809 502198410 502740440 502992096 502294769
753.2E02294769R37729J833077L20167j22833K050133K318916J889076J578789M19312
$$ 502294769 503232498 505065575 505385742 505262909 507313042 509631958 511521034 513099823 513519135
761.9E13519135J41525q3084O16569J398468J562081J518211J201057N85480Q44040
$$ 513519135 513660660 513577576 514194145 515592613 517154694 518672905 519873962 520459442 521303482
770.6E21303482R02519j73454l57399j585007j329651l49655N1499Q37783M7226R33648
$$ 521303482 522206001 522032547 521675148 520090141 518760490 518410835 518462334 519300117 519347343 520280991
780.2E20280991J767006J115150N61638O10084P14150l92151q28514l50609M47807
$$ 520280991 522047997 523163147 523724785 524334869 525049019 524656868 523828354 523477745 523925552
788.9E23925552j0719J069222J593895j29204K75192N20058J59874j253052j401291
$$ 523925552 523914833 524984055 526577950 526448746 526723938 527243996 527403870 526150818 524749527
797.6E24749527j309967j367607m8714p78694n07164o59485r17206l83072q92791j519661
$$ 524749527 523439560 522071953 522023239 521244545 520737381 520077896 519160690 518777618 517884827 516365166
807.2E16365166k540436j633072j415215k193260k396469k143364p81364l00446l88527
$$ 516365166 513824730 512191658 510776443 508583183 506186714 504043350 503261986 502961540 502573013
815.9E02573013o52580j344223j146202Q5602o04248q27790J440430K120590J733322
$$ 502573013 501920433 500576210 499430008 499515610 498911362 498083572 499524002 501644592 503377914
824.6E03377914J779175K788697L020782K750816K944451K629204L049697K228737
$$ 503377914 505157089 507945786 510966568 513717384 516661835 519291039 522340736 524569473
832.3E24569473K761803L554573K384377K264595L474998L811035J650009K272606
$$ 524569473 527331276 530885849 533270226 535534821 539009819 542820854 544470863 546743469
840E46743469K084809J086883K136345J364784J323128J205139J410980K214890K229042
$$ 546743469 548828278 549915161 552051506 553416290 554739418 555944557 557355537 559570427 561799469
848.7E61799469J219101J819496J835175l43781P97348J411171J768341Q45032N65529
$$ 561799469 563018570 564838066 566673241 566329460 567126808 568537979 570306320 571151352 571716881
857.4E71716881J928520R05190J970596J746902J590729J122971r03130j138649q79631
$$ 571716881 573645401 574550591 576521187 578268089 579858818 580981789 580078659 578940010 578060379
866E78060379k77672j169128j256218j196480p83958m82102q67958q81615j889343
$$ 578060379 577782707 576613579 575357361 574160881 573376923 572894821 572026863 571145248 569255905
874.7E69255905j898079j649551q07915j474304j473198l00522o19697o10314r17091
$$ 569255905 567357826 565708275 564900360 563426056 561952858 561652336 561032639 560422325 559505234
883.4E59505234J0986o97441l26157l204j515617r38416r66720N19218O2790n05867
$$ 559505234 559516220 558818779 558492622 558489418 556973801 556035385 555068665 555587883 555650673 555144806
893E55144806Q70552J203117J310616L20740N85327K02026K37618q03299j449890j98403
$$ 555144806 556015358 557218475 558529091 558849831 559435158 559637184 559874802 559071503 557621613 557423210
902.7E57423210k8801J995850K426910K873383L097114K978821K519837N92536O40717
$$ 557423210 557394409 559390259 561817169 564690552 567787666 570766487 573286324 573878860 574519577
911.4E74519577p10754j48316o90002j481323l88222j695671j870766k185516j884842
$$ 574519577 573808823 573660507 572970505 571489182 571100960 569405289 567534523 565349007 563464165
920E63464165k403641k991524l085251l900108m237480m124375l049621l543243k670670
$$ 563464165 561060524 558069000 554983749 551083641 546846161 542721786 539672165 536128922 533458252
928.7E33458252k886505l583222k549247k592888j433869j886940k210006j677590
$$ 533458252 530571747 526988525 524439278 521846390 520412521 518525581 516315575 514637985
936.4E14637985q03070o6185o61926j16310j041832j007271n84984j178970j261139
$$ 514637985 513834915 513768730 513106804 512990494 511948662 510941391 510356407 509177437 507916298
945.1E07916298j116829k73132n87426N2033O01234R41124P10640p28035o33659q55675
$$ 507916298 506799469 506526337 505938911 505990944 506592178 507533302 508243942 507515907 506882248 506026573
954.8E06026573q00247j242981k030983k675056k702980k105904k088432j401406j964645
$$ 506026573 505226326 503983345 501952362 499277306 496574326 494468422 492379990 490978584 489013939
963.4D89013939k037392j516342j885376k115326k507973k085418j957894k355728
$$ 489013939 486976547 485460205 483574829 481459503 478951530 476866112 474908218 472552490
971.2D72552490k547760k289161k332383k646598l054734l887214m091301m383965
$$ 472552490 470004730 467715569 465383186 462736588 459681854 455794640 451703339 447319374
978.9D47319374m593124n086060n088386m978562n465317n167579n604325n781059
$$ 447319374 442726250 437640190 432551804 427573242 422107925 416940346 411336021 405554962
986.6D05554962m493217m120865m862518n059014m364242m034043m757232m535943
$$ 405554962 401061745 396940880 392078362 387019348 382655106 378621063 373863831 369327888
994.3C69327888l778038l737220m168816l989525k988624l112145l257561l304939
$$ 369327888 365549850 361812630 357643814 353654289 350665665 347553520 344295959 340991020
1002C40991020k453079k511635l349571k058563k032700k358589j805992r75304j983909
$$ 340991020 338537941 336026306 332676735 330618172 328585472 326226883 324420891 323445587 321461678
1010.7C21461678k675515j723175k092361j695957k533951k593250k512246k648277
$$ 321461678 318786163 317062988 314970627 313274670 310740719 308147469 305635223 302986946
1018.4C02986946j943264k991867k346992k412415k510510k241420j542702j311817
$$ 302986946 301043682 298051815 295704823 293292408 290781898 288540478 286997776 285685959
1026.1B85685959k661934j970406j788578q54015j468487j066894K09808m71458K7256
$$ 285685959 283024025 281053619 279265041 278411026 276942539 275875645 276085453 275613995 275641251
1034.8B75641251n33562R01089J001987J076984J567688J571599K560768J301384J067638
$$ 275641251 275107689 276008778 277010765 278087749 279655437 281227036 283787804 285089188 286156826
1043.5B86156826k70653K6398J92509r97792p48615r98993l13225j831569j031628
$$ 286156826 285886173 285912571 286105080 285107288 284358673 283359680 283046455 281214886 280183258
1052.2B80183258r07650j719093o86264j216812q7109l65257J41887K12765J192284
$$ 280183258 279275608 277556515 276870251 275653439 275566330 275201073 275342960 275555725 276748009
1060.9B76748009K407760J540356J789322P65266K061463K186146J667327K194367
$$ 276748009 279155769 280696125 282485447 283250713 285312176 287498322 289165649 291360016
1068.6B91360016K213631J463642j31035J110191J141529M05350o69613K58236J231461
$$ 291360016 293573647 295037289 294906254 296016445 297157974 297563324 296893711 297151947 298383408
1077.2B98383408M62093J316814k24437N73673J273518J255512J146164L54232K046719
$$ 298383408 298845501 300162315 299937878 300511551 301785069 303040581 304186745 304540977 306587696
1085.9C06587696J457138J562100J534328J953487K518311J772346J906548Q39424
$$ 306587696 308044834 309606934 311141262 313094749 315613060 317385406 319291954 320131378
1093.6C20131378J376572J864166J589966J337242J176987J768722K625618K129059
$$ 320131378 321507950 323372116 324962082 326299324 327476311 329245033 331870651 333999710
1101.4C33999710R12514K312698J816712J571083J665878P82204J395454J121864J175957
$$ 333999710 334912224 337224922 339041634 340612717 342278595 343060799 344456253 345578117 346754074
1110C46754074P61490J055412R04160R32617J668663O90155J284409J025924L15171
$$ 346754074 347515564 348570976 349475136 350407753 352076416 352766571 354050980 355076904 355392075
1118.7C55392075p38373j522408L1548R50355R73969J40304M75083O46057J110077
$$ 355392075 354653702 353131294 353162842 354113197 355087166 355227470 355702553 356348610 357458687
1127.4C57458687J819076J433907K442779K689133K143212J916809K072067K036018
$$ 357458687 359277763 360711670 363154449 365843582 367986794 369903603 371975670 374011688
1135.1C74011688K930527L920822K803726J748543J630516J791153J262093J037368
$$ 374011688 376942215 380863037 383666763 385415306 387045822 388836975 390099068 391136436
1142.8C91136436N39933M30908J123466P72171J111603J203079M66576K02026J85547
$$ 391136436 391676369 392107277 393230743 394002914 395114517 396317596 396784172 396986198 397171745
1151.5C97171745k07176o3400r7695j183853l52821j83296j164284o57501J0032K62795
$$ 397171745 396964569 396901169 396803474 395619621 395266800 395083504 393919220 393261719 393271751 393534546
1161.1C93534546m71573k73552L01743O17561J161118J395034K183457K298813K390136
$$ 393534546 393062973 392789421 393091164 393708725 394869843 396264877 398448334 400747147 403137283
1169.8D03137283L210183L975029L356056K820778K916221K767029K652626K084084
$$ 403137283 406347466 410322495 413678551 416499329 419415550 422182579 424835205 426919289
1177.5D26919289K335281K666130K642822K659493K383804J553040J775284K494087
$$ 426919289 429254570 431920700 434563522 437223015 439606819 441159859 442935143 445429230
1185.3D45429230J595382P53251J16615J93596j44043l81279K09999l29895n21469
$$ 445429230 447024612 447777863 447894478 448088074 447944031 447562752 447772751 447442856 446921387
1193.9D46921387Q01p0267q38165j328049j714668j738434j386948j166610j094666
$$ 446921387 446922188 446851921 446013756 444685707 442971039 441232605 439845657 438679047 437584381
1202.6D37584381j599083j005096j57051m00010n66024o21910p24755q96492l78685
$$ 437584381 435985298 434980202 434823151 434423141 433857117 433235207 432510452 431613960 431235275
1211.3D31235275k52037m91485j05172j34506J40534K20832J58921L12843m13322j188927
$$ 431235275 430983238 430491753 430386581 430252075 430392609 430613441 430772362 431085205 430671883 429482956
1220.9D29482956r32007k93274o97746r39217k98042l52325n81513m51088m63791m85611
$$ 429482956 428550949 428257675 427559929 426620712 426322670 425970345 425388832 424937744 424473953 423988342
1230.6D23988342r36775j394348r99031q86231r93995o23398k49558l814j67198l06702
$$ 423988342 423051567 421657219 420658188 419771957 418777962 418154564 417905006 417901192 417733994 417427292
1240.2D17427292m2458N5046k68211o31905p72209r54399q09135p16629m49639J77613
$$ 417427292 417384834 417439880 417171669 416539764 415767555 414813156 414004021 413287392 412837753 413015366
1249.9D13015366J81541k1248j93443n0926n9662l62816o92978p15103l0441j31264
$$ 413015366 413196907 413175659 412982216 412931290 412871628 412508812 411815834 411100731 411070290 410939026
1259.5D10939026k2125N44242N84641N23491M66156P74727M75311L47824J82381L97911
$$ 410939026 410916901 411461143 412045784 412569275 413035431 413810158 414285469 414633293 414815674 415213585
1269.2D15213585R45473P25021J111412J063309R08432Q96682J459885J904564R47952
$$ 415213585 416159058 416884079 417995491 419058800 419967232 420863914 422323799 424228363 425176315
1277.8D25176315N79682P99408J051902O63834P50084J813126K209091J524277J358413
$$ 425176315 425755997 426555405 427607307 428271141 429021225 430834351 433043442 434567719 435926132
1286.5D35926132J972161J428642J234360J264877J050873N37033O62575R28764K72941
$$ 435926132 437898293 439326935 440561295 441826172 442877045 443414078 444076653 445005417 445278358
1295.2D45278358R22051J115036R16557Q02498M28429J70212K87399N30777l54691
$$ 445278358 446200409 447315445 448232002 449034500 449462929 449633141 449920540 450451317 450096626
1303.9D50096626k92511m64554m44603M2649K13127M41208p32956j057358r51881o13327
$$ 450096626 449804115 449339561 448894958 448937607 449150734 449591942 448858986 447801628 446849747 446236420
1313.5D46236420m61731p61910k14348j30844K55776O83861J349945J306762J013565
$$ 446236420 445774689 445012779 444798431 444667587 444923363 445607224 446957169 448263931 449277496
1322.2D49277496J375580P85637L71056J02195L15247o104L930K65159l66211l62663
$$ 449277496 450653076 451438713 451809769 451911964 452227211 452221107 452225037 452490196 452123985 451761322
1331.8D51761322p88307k88353R9029k62603o4164J05935J487q61473O7940J110649
$$ 451761322 450973015 450684662 450783691 450521088 450456924 450562859 450564346 449702873 449770813 450881462
1341.5D50881462J057358Q74061J068154J459808O16150M62265K19307p0419j71738
$$ 450881462 451938820 452812881 453881035 455340843 455956993 456419258 456638565 456568146 456396408
1350.2D56396408P8201M4899l39470j69525n58242j81962k62413k46391l29170n83534
$$ 456396408 456474609 456519508 456180038 456010513 455452271 455270309 455007896 454761505 454432335 453848801
1359.8D53848801o63567j143188l53737p88040J32942K09770o53458m65011r82056
$$ 453848801 453185234 452042046 451688309 450900269 451033211 451242981 450589523 450124512 449142456
1368.5D49142456l25088k58828n94139j030960n71747L87078l93143N61027R1172j77880
$$ 449142456 448817368 448558540 447964401 446933441 446361694 446748772 446355629 446916656 447007828 446829948
1378.1D46829948j69105k06833l33748j264839j244736j609192j398239j410599j446685
$$ 446829948 446660843 446454010 446120262 444855423 443610687 442001495 440603256 439192657 437745972
1386.8D37745972k346955j492996k56042j593666j725960j793328j841278k931976
$$ 437745972 435399017 433906021 433649979 432056313 430330353 428537025 426695747 423763771
1394.5D23763771l593292j560631k102432j973267l276748k221680r37500k116623
$$ 423763771 420170479 418609848 416507416 414534149 411257401 409035721 408098221 405981598
1402.2D05981598j815872j864357k642479k476311j885338k101135k403984j528359
$$ 405981598 404165726 402301369 399658890 397182579 395297241 393196106 390792122 389263763
1409.9C89263763j626586j502533r12819p70645r49135j117745q57887j395912O7215
$$ 389263763 387637177 386134644 385221825 384451180 383502045 382384300 381526413 380130501 380197716
1418.6C80197716j099243o80581J035309J15166Q79288P5721P61796J344337Q16574
$$ 380197716 379098473 378417892 379453201 379568367 380447655 380523376 381285172 382629509 383446083
1427.3C83446083J198921K60010J011963J406593K038765J509896J211090K363739
$$ 383446083 384645004 384905014 385916977 387323570 389362335 390872231 392083321 394447060
1435C94447060J936264K599945J473961K574081J964340J774369K034797J259499J921310
$$ 394447060 396383324 398983269 400457230 403031311 404995651 406770020 408804817 410064316 411985626
1443.7D11985626R94301J674805J596145J470986J423530J524315K209893Q53843J600647
$$ 411985626 412979927 414654732 416250877 417721863 419145393 420669708 422879601 423733444 425334091
1452.4D25334091J059036J443673J480522O03523J373596k98996M263115K382813K417793
$$ 425334091 426393127 427836800 429317322 429920845 431294441 430995445 435258560 437641373 440059166
1461.1D40059166K243309J648064J677284M13551K999497K182769K733117K641220
$$ 440059166 442302475 443950539 445627823 446041374 449040871 451223640 453956757 456597977
1468.8D56597977L067321L077202J485520L812523K893333L780899K810822K331619
$$ 456597977 459665298 462742500 464228020 468040543 470933876 474714775 477525597 479857216
1476.5D79857216K985687K195397K489357K520980K523346K047692K280311J946602
$$ 479857216 482842903 485038300 487527657 490048637 492571983 494619675 496899986 498846588
1484.2D98846588J460838J500969R71375J399078J130982q98819l36113J190758L21617
$$ 498846588 500307426 501808395 502779770 504178848 505309830 504411011 504074898 505265656 505587273
1492.9E05587273p18994n37072r06677l795052q4190j954803k965813j54991j164856
$$ 505587273 504868279 504331207 503424530 499629478 499545288 497590485 494624672 494469681 493304825
1501.6D93304825j212387j039009q1864p26394n844803n075150K498512K241478l45382
$$ 493304825 492092438 491053429 490971565 490245171 484400368 479325218 481823730 484065208 483719826
1510.2D83719826Q12530j102409k025528j26877q66623o63414j224632j206665J84822
$$ 483719826 484532356 483429947 481404419 481277542 480410919 479747505 478522873 477316208 477501030
1518.9D77501030M47311k371711j948738K042198J085586J566658J63422Q84018J227836
$$ 477501030 477948341 475576630 473627892 475670090 476755676 478322334 478485756 479369774 480597610
1527.6D80597610Q38318Q74596O59904P18766K96516K82898m88167J878243J281929
$$ 480597610 481435928 482310524 482970428 483689194 483985710 484268608 483780441 485658684 486940613
1536.3D86940613K59781M09202n614776N9127M720002J541900J15738J499329P97462
$$ 486940613 487200394 487609596 481994820 482053947 486773949 488315849 488431587 489930916 490728378
1545D90728378p27462J685714N74417R02024j94321n60875J405792J71166L28254j977462
$$ 490728378 490000916 491686630 492261047 493163071 492968750 492407875 493813667 493984833 494313087 492335625
1554.6D92335625Q26034R68247j338692o192474m524231L448486l14064J116791q08258
$$ 492335625 493161659 494129906 492791214 486598740 482074509 485522995 485208931 486325722 485517464
1563.3D85517464j057854k833252k854042j159935l006935k549172q969574j335983
$$ 485517464 484459610 481626358 478772316 477612381 474605446 472056274 463086700 461750717
1571D61750717j971054l998222k918053l331413j475754j2686539k040405l255234
$$ 461750717 459779663 455781441 452863388 449531975 448056221 435369682 433329277 430074043
1578.7D30074043m621010m389305n954590m019393o441727l827782n516548m812126
$$ 430074043 425453033 421063728 415109138 411089745 404648018 400820236 395303688 390491562
1586.4C90491562m766541n670395l496894o515160l726997n966797l940583m845199
$$ 390491562 385725021 380054626 376557732 370042572 366315575 360348778 356408195 351562996
1594.1C51562996n504646k962304n400886j980133m806290k619552l975754l841973
$$ 351562996 346058350 343096046 337695160 335715027 330908737 328289185 324313431 320471458
1601.9C20471458k445163m663182j123771l941784j534825l384952j571293j178360
$$ 320471458 318026295 313363113 312239342 308297558 306762733 303377781 301806488 300628128
1609.6C00628128k592621L27492l064365K12097k307854m12807r33590m624749K935887
$$ 300628128 298035507 298362999 295298634 295510731 293202877 292790070 291856480 287231731 290167618
1618.2B90167618j247769J366082j154671J180592n43023j380138K241974m55322K242507
$$ 290167618 288919849 290285931 289131260 290311852 289768829 288388691 290630665 290175343 292417850
1626.9B92417850j354923K016678Q03604R91211J480045M0360K862759J61686L023929
$$ 292417850 291062927 293079605 293883209 294874420 296354465 296394825 299257584 299419270 302443199
1635.6C02443199j265488L158093K033081J015224K599812O05183L569545J099682
$$ 302443199 301177711 304335804 306368885 307384109 309983921 310589104 314158649 315258331
1643.3C15258331K674218J758346n84297L025780o73790M308128Q95729L022652K188225
$$ 315258331 317932549 319690895 319106598 322132378 321458588 325766716 326662445 329685097 331873322
1652C31873322j608086J281547P23839M318695P28760K489090J039162J531296J972274
$$ 331873322 330265236 331546783 332270622 336589317 337318077 339807167 340846329 342377625 344349899
1660.7C44349899J504746L608169J145592L968277K129974L249665L199310K995796
$$ 344349899 345854645 349462814 350608406 354576683 356706657 359956322 363155632 366151428
1668.4C66151428M143143R30214N795784L482056M376602L202934K958260N031127
$$ 366151428 370294571 371224785 377020569 380502625 384879227 388082161 391040421 396071548
1676.1C96071548L594132N490990L541641M983559M454765N266876N303764P54471
$$ 396071548 399665680 405156670 408698311 413681870 418136635 423403511 428707275 429461746
1683.8D29461746P043572M485702O575813M497643M501724N314331N372429N967598
$$ 429461746 436505318 440991020 447566833 452064476 456566200 461880531 467252960 473220558
1691.5D73220558M751206N633278N003662N225677L040733N341607O160850N190125
$$ 473220558 477971764 483605042 488608704 493834381 496875114 502216721 508377571 513567696
1699.3E13567696M752044K340203P528419N417938M189911L866272L793144L360596
$$ 513567696 518319740 520659943 528188362 533606300 537796211 541662483 545455627 548816223
1707E48816223L357353M243050K540398K071876K725754K718620L155937J568566J057243
$$ 548816223 552173576 556416626 558957024 561028900 563754654 566473274 569629211 571197777 572255020
1715.6E72255020K938500J486167j635780M080429L272171J777916J599732J204528
$$ 572255020 575193520 576679687 575043907 579124336 582396507 584174423 585774155 586978683
1723.4E86978683J460877J899605J550522J661987K184372J850624k08893O25572L020287
$$ 586978683 588439560 590339165 591889687 593551674 595736046 597586670 597377777 598003349 601023636
1732F01023636K235947k146912k137337N109863M650650K658501K780152J235771L88450
$$ 601023636 603259583 601112671 598975334 604085197 608735847 611394348 614174500 615410271 615798721
1740.7F15798721L660050K273979J037559K404442L742371L026504K233086L167267
$$ 615798721 619458771 621732750 622770309 625174751 628917122 631943626 634176712 637343979
1748.4F37343979K787018M328079J876068K142181N114747L484191K858277K372513
$$ 637343979 640130997 644459076 646335144 648477325 653592072 657076263 659934540 662307053
1756.2F62307053P63397K509308L387375K770843K934342J1520J083755L403702J739502
$$ 662307053 663070450 665579758 668967133 671737976 674672318 674683838 675767593 679171295 680910797
1764.8F80910797J910477J829681J034851j387329K097397L473206N8364l67584L5324
$$ 680910797 682821274 684650955 685685806 684298477 686395874 689869080 689927444 689559860 689595184
1773.5F89595184L922959K148895j49612J781387P13119J297989j54800j13297J900559
$$ 689595184 693518143 695667038 695517426 697298813 698011932 699309921 699155121 699041824 700942383
1782.2G00942383K312546J878204K0752J007843J179199Q69522M11301R56726J27258
$$ 700942383 703254929 705133133 705153885 706161728 707340927 708210449 708621750 709578476 709705734
1790.9G09705734o53229j450805Q44726M337464J099472K29339J636048J400757M22058
$$ 709705734 709052505 707601700 708446426 712783890 713883362 714112701 715748749 717149506 717571564
1799.5G17571564j281357J500091j64337R06601J554871M32739J487579N98526P92237
$$ 717571564 716290207 717790298 717625961 718532562 720087433 720520172 722007751 722606277 723398514
1808.2G23398514J137008Q73795j115494O1341P62634K77252J312180L63922J138229
$$ 723398514 724535522 725409317 724293823 724355164 725117798 725395050 726707230 727071152 728209381
1816.9G28209381K79846O19583J191178N61828J341858m05807M12445L6468j781234
$$ 728209381 728489227 729108810 730299988 730861816 732203674 731797867 732210312 732246780 730465546
1825.6G30465546R00039J829911J549148n04532j479950J338349K254181L15780j8005
$$ 730465546 731365585 733195496 734744644 734240112 732760162 734098511 736352692 736668472 736650467
1834.3G36650467Q4228k03018Q0490m19922J094132O48117J122208Q49228N92346N4779
$$ 736650467 736734695 736531677 736612167 736192245 737286377 737934494 739056702 739905930 740498276 740553055
1843.9G40553055l615647K856369J731568r94644p87201N54580J513443L78190Q10775
$$ 740553055 736937408 739793777 741525345 740530701 739743500 740298080 741811523 742189713 743000488
1852.6G43000488N1575N79987O12640j55258K94723m36477k50245l85055M68140L22418
$$ 743000488 743052063 743632050 744244690 744089432 744384155 743947678 743697433 743312378 743780518 744102936
1862.2G44102936N00793R33762P22885N39474o97402M53033j385574j022950J275101
$$ 744102936 744603729 745537491 746260376 746799850 746102448 746555481 745169907 744146957 745422058
1870.9G45422058Q32138L77731j10397P29218R6664Q00934O06537J31378K96326n27497
$$ 745422058 746254196 746631927 746521530 747250748 747347412 748148346 748754883 748886261 749182587 748655090
1880.6G48655090J2513o57120L26614J86157L2807N14679K60620J389007m82940j084671
$$ 748655090 748667603 748010483 748337097 748523254 748556061 749070740 749331360 750720367 750237427 749152756
1890.2G49152756M40445O43997o4850k67258l79562r82513J087570N46798M95835P83691
$$ 749152756 749593201 750237198 750172348 749905090 749525528 748543015 749630585 750177383 750673218 751456909
1899.8G51456909L68271L02506o11802n9967m06570J79825l35770n62973N51300L18756
$$ 751456909 751825180 752127686 751515884 751455917 751049347 751229172 750893402 750330429 750881729 751200485
1909.5G51200485N42908K22549R28040p7133k2431k53982p91397N14373j449584N8517
$$ 751200485 751743393 751965942 752893982 752816849 752794418 752540436 751749039 752263412 750813828 750872345
1919.1G50872345O60706N70831R08508o64520J73721P27997N33905o36215p65076m50363
$$ 750872345 751533051 752103882 753012390 752347870 752521591 753249588 753783493 753147278 752382202 751931839
1928.8G51931839L3722L12805K7390O67801l6545M58755J18103J1750m5319j035843
$$ 751931839 751965561 752278366 752305756 752973557 752937012 753395767 753513870 753525620 753480301 752444458
1938.4G52444458l42102l53317O77032n47714j031723J047897N90897J92795n9281
$$ 752444458 752102356 751749039 752426071 751878357 750846634 751894531 752485428 752678223 752618942
1947.1G52618942O73447l18756o32019j15357k15377j83793m27780N33142J60141K59858
$$ 752618942 753292389 752973633 752341614 752226257 752010880 751827087 751399307 751932449 752092590 752352448
1956.7G52352448J99050J05820N5771o60553r537m74395m09775l50266K68326L35770
$$ 752352448 752551498 752657318 752713089 752052536 752042999 751568604 751158829 750808563 751076889 751412659
1966.4G51412659n83725N49392N20859M23889l45153q09327o23092j62430o4316n88913
$$ 751412659 750828934 751378326 751899185 752323074 751977921 751168594 750545502 750383072 750318756 749729843
1976G49729843O33850N04227L80020K47498J4648L5706l05939N0278o78788k86789
$$ 749729843 750363693 750867920 751247940 751495438 751510086 751545792 751239853 751290131 750611343 750324554
1985.7G50324554m18014m17481L04566J65558N64728J3961j29623j05209L83682k42844
$$ 750324554 749906540 749489059 749793625 749959183 750523911 750537872 750408249 750303040 750686722 750443878
1995.3G50443878j040039k94342l60184J59684P1792L34244L72543o5994n9128k22854
$$ 750443878 749403839 749109497 748749313 748908997 748980789 749315033 749687576 749621582 749562454 749339600
2005G49339600N6305m13132k50244o06690m25873m2190k52991L31955O6605M10995
$$ 749339600 749395905 748982773 748732529 748125839 747699966 747657776 747404785 747736740 747803345 748214340
2014.6G48214340J55030j87989m89731m36859j72653o52771j67999m11606K78168K91519
$$ 748214340 748369370 748181381 747691650 747254791 747082138 746429367 746261368 745849762 746127930 746419449
2024.2G46419449n5390L35923p8430J71966k98386j3656o88782j024017j04447k73590
$$ 746419449 746364059 746699982 746621552 746793518 746495132 746481476 745792694 744768677 744664230 744390640
2033.9G44390640K11182J89209K31094N4474K90146O6528m94919k97012n12009j52587
$$ 744390640 744601822 744791031 745022125 745076599 745366745 745433273 744938354 744641342 744129333 743976746
2043.5G43976746o05469k01798j57318j18789N10177J1444L82386J58386j56327p73849
$$ 743976746 743371277 743169479 743012161 742893372 743403549 743414993 743797379 743955765 743799438 743025589
2053.2G43025589n20554k93579l69720K61459n82123L30201P37075L86506p6676m64249
$$ 743025589 742505035 742211456 741841736 742103195 741521072 741851273 742588348 742974854 742898178 742433929
2062.8G42433929K55967n29023l03344l51944k24533K7771j3810M76838o4850J03607
$$ 742433929 742689896 742160873 741857529 741505585 741281052 741308823 741295013 741771851 741707001 741810608
2072.5G41810608K9831K59704l49502m75922J40763n03846k36740k95334K16065J0147
$$ 741810608 741840439 742100143 741750641 741274719 741415482 740911636 740674896 740379562 740595627 740605774
2082.1G40605774N8441L51715k19498J08719k72827L1738k98233m83703k71988o4011
$$ 740605774 740664215 741015930 740796432 740905151 740632324 740664062 740365829 739882126 739610138 739546127
2091.7G39546127L28827k71301K25754j39618J89819L22876n25970k66342l16544r1782
$$ 739546127 739874954 739603653 739829407 739689789 739879608 740202484 739676514 739410172 739093628 739001846
2101.4G39001846l90091l82843n65185M2343L20969k22855K70309p3852K92282k19193
$$ 739001846 738611755 738228912 737663727 737706070 738027039 737804184 738074493 738000641 738292923 738073730
2111G38073730l53393l07160o90536j297j96762L47214j63727j69678L19824p5531
$$ 738073730 737720337 737413177 736722641 736721344 736524582 736871796 736708069 736538391 736858215 736782684
2120.7G36782684J2360j64566Q1406l93677j18485n68237m72870M93240K0524L73687
$$ 736782684 736795044 736630478 736711884 736318207 736199722 735631485 735158615 735651855 735672379 736046066
2130.3G36046066m6158K37809L61099M4174k59781o93130k08817p86133k28576M08554
$$ 736046066 735999908 736237717 736598816 736642990 736383209 735690079 735481262 734695129 734466553 734875107
2140G34875107O52313L36685q4762K54669k06375K4261l05710n3253j95770m59976
$$ 734875107 735527420 735864105 735779343 736034012 735827637 735851898 735546188 735492935 735297165 734837189
2149.6G34837189J50909K31018N50919k53372L7613J83792K78854L42865k89307k0980
$$ 734837189 734988098 735219116 735770035 735516663 735554276 735738068 736016922 736359787 736070480 736049500
2159.3G36049500p17545j90048o1035R3765M28314N8899K64816k69851L48587j06049
$$ 736049500 735331955 735141907 735080872 735174637 735602951 735661850 735926666 735656815 736005402 735899353
2168.9G35899353l33252K36511N5619l55454o47278P33795M66462L35693J16425l12500
$$ 735899353 735566101 735802612 735858231 735502777 734855499 735589294 736055756 736391449 736507874 736195374
2178.5G36195374O1874l14331K07825k03476n7297N7602J65863M35562j08871K26287
$$ 736195374 736257248 735942917 736150742 735947266 735889969 735947571 736113434 736548996 736440125 736666412
2188.2G36666412k27584J42211J01624k63214j19553K289K62833k60239M17252J39541
$$ 736666412 736438828 736581039 736682663 736419449 736299896 736302185 736565018 736304779 736722031 736861572
2197.8G36861572k46887Q2169K09884O0654j70441M30832k68249j11771p4005K441
$$ 736861572 736614685 736696854 736906738 736967392 736796951 737227783 736959534 736847763 736773758 736776199
2207.5G36776199L62397r7809K22320j26342K33993j86768j82113K13852p0267L32184
$$ 736776199 737138596 737040787 737263107 737136765 737370758 737183990 737001877 737215729 737145462 737477646
2217.1G37477646k89078R6130k62603j33362N16510N7907j9989k27051L88184k74887
$$ 737477646 737188568 737284698 737022095 736888733 737405243 737463150 737443161 737216110 737604294 737329407
2226.8G37329407j24588J56555k28272m0664n10330K92968L27606L01133j38169l71933
$$ 737329407 737204819 737361374 737133102 737092438 736582108 736875076 737202682 737503815 737365646 736993713
2236.4G36993713L46299j08796k61230m03519L41263L51334J52359M6081m01001J03836
$$ 736993713 737340012 737231216 736969986 736566467 736907730 737259064 737411423 737457504 737056503 737160339
2246G37160339j06125P3166l44009k69089O9580K1057L07236j51596M7989j91269J31226
$$ 737160339 737054214 737127380 736783371 736514282 736583862 736604919 736912155 736760559 736808548 736617279 736748505
2256.7G36748505J13678n6458J41525k50244J80130k22091j20850k23999k77100Q3008
$$ 736748505 736862183 736805725 736947250 736697006 736877136 736655045 736534195 736310196 736033096 736116104
2266.3G36116104J71051L14331l68652Q8653j12381J11084N2720o59180q0414k00500
$$ 736116104 736287155 736601486 736232834 736321487 736209106 736320190 736372910 735713730 735633316 735432816
2275.9G35432816L81851K43301N9433j40457l24707J72424o8054K2278n19409j86768
$$ 735432816 735814667 736057968 736117401 735976944 735652237 735824661 735756607 735778885 735259476 735072708
2285.6G35072708j36871k73819k50244l17154N76019j03760K71988L23639l89480l95737
$$ 735072708 734935837 734662018 734411774 734094620 734670639 734566879 734838867 735162506 734773026 734377289
2295.2G34377289l64151K8076l60794L43094J30844m3259j55182p95745l20588k88620
$$ 734377289 734013138 734041214 733680420 734023514 734154358 734111099 733955917 733160172 732839584 732550964
2304.9G32550964L19214k13241l18146l22723n06135k65121l88565P82089j49536l34320
$$ 732550964 732870178 732656937 732338791 732016068 731509933 731244812 730856247 731638336 731488800 731154480
2314.5G31154480k02560l35846L4866p18308l54385n55878J16272k67639k98538q392
$$ 731154480 730951920 730616074 730650940 729932632 729578247 729022369 729138641 728871002 728572464 728564072
2324.2G28564072J17950J084137o25153o37359j233139o34842q8501n97763j97754
$$ 728564072 728682022 729766159 729141006 728503647 727270508 726635666 726547165 725949402 725751648
2332.8G25751648o38428J409989L0670j91345o0654m69742J80512q82416M17633p00913
$$ 725751648 725113220 726523209 726553879 726362534 726301880 725832138 726012650 725130234 725547867 724846954
2342.5G24846954l3798J72959j61744M99039L29666J124802l10288n52368o48117o26221
$$ 724846954 724813156 724986115 724824371 725323410 725653076 726777878 726467590 725915222 725267105 724640884
2352.1G24640884n67169j178894p3318n98908N88455j251297o34079J305085K17895
$$ 724640884 724073715 722894821 722821503 722222595 722811050 721559753 720925674 722230759 722448654
2360.8G22448654O95191r06907n92575j372222L27758M51432p98035N61523P75528
$$ 722448654 723143845 722236938 721644363 720272141 720599899 721051331 720253296 720814819 721590347
2369.5G21590347k365j189422J199264O24619o11191k1210l04413J6251k20490M57459
$$ 721590347 721587982 720398560 721597824 722222443 721611252 721590042 721285629 721301880 721081390 721538849
2379.1G21538849K89688K60315M32663L04031J31455o51703p4539l06855o25915l21732
$$ 721538849 721828537 722088852 722521515 722825546 722957001 722305298 722230759 721923904 721297989 720976257
2388.8G20976257n7907k7618m02909K54212K98767m1580n71747l44467j87836n86166
$$ 720976257 720918350 720890732 720487823 720742035 721040802 720999222 720427475 720083008 719895172 719309006
2398.4G19309006k87323o74057k97089k15301j77002j81504k63595O06231J51673n10254
$$ 719309006 719021683 718347626 718050537 717835236 717658234 717476730 717213135 717819366 717971039 717460785
2408.1G17460785p29675m01154n63049p03812k57950j75476J62659j89743q1101j98516
$$ 717460785 716731110 716329956 715766907 715063095 714805145 714629669 714792328 714602585 714521484 714322968
2417.7G14322968l8300l3722o20651m42124r62448m41131k83966l04032l9749k72522
$$ 714322968 714284668 714250946 713630295 713188171 712225723 711784592 711500626 711196594 711156845 710884323
2427.3G10884323J39618K0981K0370p56836o93054k57339o40030m32968n78385p7820
$$ 710884323 711023941 711044922 711065292 710308456 709615402 709358063 708718033 708285065 707706680 707628860
2437G07628860J63651K43912k94571o58112l45917n26199J4267m11682o20422n38254
$$ 707628860 707792511 708036423 707741852 707083740 706737823 706211624 706225891 705814209 705193787 704655533
2446.6G04655533n43595k42385k59934J42822j57394k50473l63312k85568j84326n85098
$$ 704655533 704111938 703869553 703609619 703752441 703595047 703344574 702981262 702695694 702511368 701926270
2456.3G01926270o38352o48880j40839l37600n32913n82581k56653J75858j40457n5085
$$ 701926270 701287918 700639038 700498199 700160599 699627686 699045105 698788452 698964310 698823853 698768768
2465.9F98768768o24695n15365m35944o33850m45328n24902q9645j66550j24359n29556
$$ 698768768 698144073 697628708 697192764 696558914 696113586 695588684 695499039 695332489 695208130 694678574
2475.6F94678574o73752j96915k28577l64151o18057o64444j073684k53144O943o88934
$$ 694678574 694004822 693807907 693579330 693215179 692597122 691932678 690858994 690605850 690612793 689923859
2485.2F89923859k93427j39847N0049j46026m7226m71573j049576q92563p39288j52664
$$ 689923859 689630432 689490585 689540634 689394608 689347382 688875809 687826233 686933670 686194382 686041718
2494.8F86041718l00370m60663n60150j91650j84021n05447k73972q18787n46875l94134
$$ 686041718 685741348 685280685 684720535 684528885 684344864 683839417 683565445 682746658 682199783 681805649
2504.5F81805649n53971o56967n14373k61536o62232k50320q1635j29776o42471o53610
$$ 681805649 681251678 680594711 680080338 679818802 679156570 678906250 678824615 678694839 678052368 677398758
2514.1F77398758l98483n84717l68576q20084k29492q9645l891o7749o50101N8899
$$ 677398758 677000275 676415558 676046982 675226898 674997406 674907761 674903870 674836121 674186020 674244919
2523.8F74244919l54843m35715p58362j029968n79147l40806m9667m98581P6828l35388
$$ 674244919 673890076 673454361 672695999 671666031 671086884 670746078 670696411 670197830 670274658 669939270
2533.4F69939270o84509k47803m82330j71738n43747o00052m51431k01569l25317m52728
$$ 669939270 669254761 669006958 668524628 668352890 667809143 667209091 666757660 666556091 666230774 665778046
2543.1F65778046j67466n40390m15191m27170k67792m55932m45786l67432o66198k93579
$$ 665778046 665610580 665070190 664654999 664227829 663960037 663504105 663058319 662690887 662024689 661731110
2552.7F61731110n90592m61197l22876r0484l08380q22754m21906m88129k21099m68140
$$ 661731110 661140518 660679321 660356445 660265961 659957581 659134827 658712921 658224792 658003693 657535553
2562.4F57535553j34506o5232o85958l22190o20880l91464j82266l87421m82864k84424
$$ 657535553 657401047 657335815 656649857 656327667 655706787 655315323 655133057 654745636 654262772 653978348
2572F53978348k99835l45154K4948q30307p42874l99857m40445l89938m01535o9351
$$ 653978348 653678513 653333359 653358307 652528000 651785126 651385269 650944824 650554886 650153351 650084000
2581.6F50084000n73960l23944l90396n65262m08706m83857j84250n44052n08422m57230
$$ 650084000 649510040 649186096 648795700 648230438 647821732 647337875 647153625 646609573 646101151 645643921
2591.3F45643921L9978J3733n85098n95551r10568k98310j17797m47617p32880n82122
$$ 645643921 645683899 645697632 645112534 644516983 643606415 643308105 643190308 642742691 642009811 641427689
2600.9F41427689l27912n18951j59760n02357n82276n33294l75977l07884m42963j34582
$$ 641427689 641099777 640580826 640421066 639918709 639336433 638803139 638427162 638119278 637676315 637541733
2610.6F37541733o66085n79376n73349p30858p28302l78074J35155r15566r40552m62913
$$ 637541733 636875648 636296272 635722923 634992065 634263763 633885689 634020844 633105278 632164726 631701813
2620.2F31701813m62303k95067m33350p53097o35186K7161k74124n30510p63054o28281
$$ 631701813 631239510 630944443 630511093 629757996 629122810 629149971 628875847 628345337 627582283 626954002
2629.9F26954002l20320n97725n01327p69501n01404l96003o79055n74302l05710k18353
$$ 626954002 626633682 626035957 625534630 624765129 624263725 623867722 623188667 622614365 622308655 622090302
2639.5F22090302n42489l23219n68809o32706o39420p20482n20286o18286l62587l98750
$$ 622090302 621547813 621224594 620655785 620023079 619383659 618663177 618142891 617524605 617162018 616763268
2649.1F16763268m7265l31192p15942m43916p71752o72950o07644k19383l8261j73836
$$ 616763268 616716003 616384811 615668869 615224953 614453201 613780251 613172607 612953224 612914963 612741127
2658.8F12741127m00238q51936o38237k15836j9798n93300n38368l70179m39224m44870
$$ 612741127 612340889 611488953 610850716 610634880 610615082 610021782 609483414 609113235 608674011 608229141
2668.4F08229141p40242k46582l95698m12560j12610o3820k20069m30069k18277o31104
$$ 608229141 607488899 607242317 606846619 606434059 606321449 606257629 606037560 605607491 605389214 604758110
2678.1F04758110k39296k56386o39076m86336m97703r2049l02238j96076k73895o12412
$$ 604758110 604518814 604262428 603623352 603137016 602639313 602547264 602245026 602048950 601775055 601162643
2687.7F01162643p45048o49147k08931k52457p7209n62287m87594j4038n1461k00729
$$ 601162643 600417595 599768448 599559517 599307060 599229851 598667564 598179970 598165932 598114471 597913742
2697.4E97913742p93495n20058l54004k39372m66995o23131l80898n03654k2163k10762
$$ 597913742 597120247 596600189 596246185 596006813 595539818 594916687 594535789 594032135 594009972 593799210
2707E93799210l97644l09945k65350l59535n71671l45726n19256l63274m10843j49803
$$ 593799210 593401566 593091621 592826271 592466736 591895065 591549339 591030083 590666809 590255966 590106163
2716.6E90106163P7171j77230k60048m90227k6665m78210o22712j7204k84157m51278
$$ 590106163 590183334 590006104 589746056 589255829 589229164 588750954 588128242 588111038 587826881 587375603
2726.3E87375603k79312r9945m27323j06201n2185l89557j49918j19323m13742p18613
$$ 587375603 587096291 586996346 586569023 586462822 586410637 586021080 585871162 585751839 585338097 584619484
2735.9E84619484k66304m16489m89616k2736K77329J61857m66423m55055n80482J63612
$$ 584619484 584353180 583936691 583447075 583424339 583701668 583863525 583397102 582942047 582361565 582525177
2745.6E82525177K66609o51474m57954k50206q3237l78113l84865j99775m9210l24936
$$ 582525177 582791786 582140312 581682358 581432152 581348915 580970802 580585937 580386162 580336952 580012016
2755.2E80012016m03328J53656l45306j45416n50118q07457l34892n37720k44980m32472
$$ 580012016 579608688 579762344 579417038 579271622 578721504 577914047 577579155 577041435 576796455 576363983
2764.9E76363983l2425j20506k41089q0109n55725l39965l92724l3798m41932n25170
$$ 576363983 576331558 576211052 575969963 575889854 575334129 574994164 574601440 574567642 574125710 573600540
2774.5E73600540J27411j29471l76014j010514p85789k71340J58768n19485j191597
$$ 573600540 573727951 573598480 573222466 572211952 571426163 571154823 571313591 570794106 569602509
2783.2E69602509k2088k53601p33032l66478k1705k60544o90346p78046j024475o48155
$$ 569602509 569580421 569326820 568593788 568227310 568205605 567945061 567254715 566476669 565452194 564804039
2792.8E64804039m97093j04180q3618p82203o70243l74756m06189q29238j042290r59244
$$ 564804039 564306946 564202766 564119148 563336945 562666702 562291946 561885757 561056519 560014229 559054985
2802.5E59054985m69933m17594m42582r7198n34630p46269r86023q00514o07376j108017
$$ 559054985 558585052 558167458 557724876 557627678 557093048 556346779 555360756 554560242 553952866 552844849
2812.1E52844849q22525n85709j063232j088143k25487j94130q67385j108742r68704
$$ 552844849 552022324 551436615 550373383 549285240 549059753 548865623 547998238 546889496 545920792
2820.8E45920792q59833r13963n73006o40831q89931j220589r06791l67241p72476
$$ 545920792 545060959 544146996 543573990 542933159 542043228 540822639 539915848 539548607 538776131
2829.5E38776131p08695r63249j215057j059075r31625j037026j274757p89032r03320
$$ 538776131 538067436 537104187 535889130 534830055 533898430 532861404 531586647 530797615 529894295
2838.2E29894295j373406j718673j487122j284523j845894k069969k346344j896019
$$ 529894295 528520889 526802216 525315094 524030571 522184677 520114708 517768364 515872345
2845.9E15872345j455307j773911j877746j656342j813011j951866j204796j290054
$$ 515872345 514417038 512643127 510765381 509109039 507296028 505344162 504139366 502849312
2853.6E02849312r56383k82631k31323Q1558k13432r0294L0365o11382r83581l37067
$$ 502849312 501892929 501610298 501378975 501460533 501247101 501156807 501187172 500575790 499592209 499255142
2863.2D99255142k30293r00650p52525j167260j210365p63016r79499j136284n75219
$$ 499255142 499024849 498124199 497371674 496204414 494994049 494231033 493251534 492115250 491540031
2871.9D91540031k16026q93860o27823n42602r42421q53272o90727n22156q12759o98891
$$ 491540031 491324005 490430145 489802322 489259720 488317299 487464027 486773300 486251144 485438385 484739494
2881.6D84739494q41102q69675q78143j086006o47011q25463r11712j018982j260491
$$ 484739494 483898392 483028717 482150574 481064568 480417557 479592094 478680382 477661400 476400909
2890.2D76400909j320953j295662r07440j011505p51419l37448p72019j111374p18727
$$ 476400909 475079956 473784294 472876854 471865349 471113930 470776482 470004463 468893089 468174362
2898.9D68174362n82962o36825n23873q29620p02515m93240m90608r52683j203155
$$ 468174362 467591400 466954575 466430702 465601082 464898567 464405327 463914719 462962036 461758881
2907.6D61758881n84183p93877j071892j157341j442108j573639j433715j197701j562691
$$ 461758881 461174698 460380821 459308929 458151588 456709480 455135841 453702126 452504425 450941734
2916.3D50941734j701355j262436r10224r21364r61571j117668r80530j024704j180000
$$ 450941734 449240379 447977943 447067719 446146355 445184784 444067116 443086586 442061882 440881882
2925D40881882j60408j51902k86140J94397J58997K50244q354K17208K87743J8883
$$ 440881882 440721474 440569572 440283432 440477829 440636826 440887070 440878716 441095924 441383667 441402550
2934.6D41402550K55203P55386N94750j6060P01866P87888K68478N59464J093902J055985
$$ 441402550 441657753 442413139 443007889 442991829 443693695 444481583 444750061 445309525 446403427 447459412
2944.2D47459412K20565M00467O61011O11839J051293R81254N73960P44476O26526
$$ 447459412 447679977 448080444 448741455 449353294 450404587 451385841 451959801 452704277 453330803
2952.9D53330803J21193O97822Q30498O45943L47023j97907N48745J253585J123009
$$ 453330803 453451996 454149818 454980316 455626259 455973282 455775375 456324120 457577705 458700714
2961.6D58700714J98517Q1062Q33092P91168P46422O41632O61850P03545M21600M79050
$$ 458700714 458899231 458980293 459813385 460604553 461350975 461992607 462654457 463358002 463779602 464258652
2971.2D64258652J144256J136170M40063N52979O71501O22024M14696K65694M45328
$$ 464258652 465402908 466539078 466979141 467532120 468203621 468825645 469240341 469506035 469951363
2979.9D69951363L93829L82996L50761M38347J36223j17035M94995N07202k13203l9864
$$ 469951363 470345192 470728188 471078949 471517296 471653519 471536484 472031479 472538681 472325478 472285614
2989.6D72285614L40958R765o5117j41143r4529N7297r7999k69013l76358l17802k80304
$$ 472285614 472626572 472636337 472571220 472430077 472335548 472392845 472294846 472025833 471649475 471331673 471051369
3000.2D71051369j3008m16832o38924n18646j104889q65021p44591o69555m49868o02645
$$ 471051369 471038361 470621529 469982605 469463959 468359070 467494049 466749458 466079903 465630035 465027390
3009.8D65027390m95186m87519l03154o08902q34655o78139p12700o63910p61833p19338
$$ 465027390 464532204 464044685 463741531 463132629 462297974 461619835 460907135 460243225 459481392 458762054
3019.5D58762054q38661p43332l48320o06956r75914m73976n63546j353721r24339
$$ 458762054 457923393 457180061 456831741 456224785 455248871 454774895 454211349 452857628 451933289
3028.1D51933289l74642l74145r96094j305504r15832q82798p39174r51118p41844
$$ 451933289 451558647 451184502 450188408 448882904 447967072 447084274 446345100 445393982 444652138
3036.8D44652138n73845q75244q00133r12399r62983j150970r75342p54165q73795
$$ 444652138 444078293 443203049 442402916 441490517 440527534 439376564 438401222 437647057 436773262
3045.5D36773262q74176q47626p28874q70132q54988q54950p44019j041489j261482
$$ 436773262 435899086 435051460 434322586 433452454 432597466 431742516 430998497 429957008 428695526
3054.2D28695526n92193q97408j041336m67186p76596j404534j128463n97954l84407
$$ 428695526 428103333 427205925 426164589 425697403 424920807 423516273 422387810 421789856 421405449
3062.9D21405449l85437j007500r57985r67865j001014o32821q53843o07147p26357
$$ 421405449 421020012 420012512 419054527 418086662 417085648 416452827 415598984 414991837 414265480
3071.5D14265480p44705k37465o09398j327972j204262n70488o46477o75926p41615
$$ 414265480 413520775 413283310 412673912 411345940 410141678 409571190 408924713 408248787 407507172
3080.2D07507172o65398l78876m17557m16183j027412j244240r14040p22999p02553
$$ 407507172 406841774 406462898 406045341 405629158 404601746 403357506 402443466 401720467 401017914
3088.9D01017914j081391r18502n50499p74689o83250l40615j001015j178703l49693
$$ 401017914 399936523 399018021 398467522 397692833 397009583 396668968 395667953 394489250 394139557
3097.6C94139557j66626q08449j267891q29010q39958o53076m01840p04804o90079
$$ 394139557 393972931 393164482 391896591 391067581 390227623 389574547 389172707 388467903 387777824
3106.2C87777824r53750q34160p42989p30667o95343j082916q91228n43594o76117
$$ 387777824 386824074 385989914 385246925 384516258 383820915 382737999 381846771 381303177 380627060
3114.9C80627060j026611q79479p61833m72107n12238j157493r09882r95712j120949
$$ 380627060 379600449 378720970 377959137 377487030 376974792 375817299 374907417 373911705 372790756
3123.6C72790756j007919p28493n71899r65500n51605m99268n44014n74264q88138
$$ 372790756 371782837 371054344 370482445 369516945 368965340 368466072 367922058 367347794 366459656
3132.3C66459656j013756j190071j066055r26171m95529q14476r15604n64041p69081
$$ 366459656 365445900 364255829 363189774 362263603 361768074 360953598 360037994 359473953 358704872
3141C58704872o78940j241760r01604m34379p68852p39289j386642j354370n64270
$$ 358704872 358025932 356784172 355882568 355448189 354679337 353940048 352553406 351199036 350634766
3149.6C50634766l98941q59147p83157m95186p33032r09576j329003r46426o60324
$$ 350634766 350235825 349376678 348593521 348098335 347365303 346455727 345126724 344180298 343519974
3158.3C43519974j050644q10776n55496o31714p13768q43773j017876m83970p30667
$$ 343519974 342469330 341658554 341103058 340471344 339757576 338913803 337895927 337411957 336681290
3167C36681290j526680r75418o69213j095543r38186j50338m70314r35363p90253q56171
$$ 336681290 335154610 334179192 333509979 332414436 331476250 331325912 330855598 329920235 329129982 328273811
3176.6C28273811n72242r23996j066780j187668j082344l20092r58900j050987n05486
$$ 328273811 327701569 326777573 325710793 324523125 323440781 323120689 322161789 321110802 320605316
3185.3C20605316m51774l86658p73506j053734j111889p69730m53357m39263n48706
$$ 320605316 320153542 319766884 318993378 317939644 316827755 316058025 315604668 315165405 314616699
3194C14616699j061344j155338p35893m29688p02801j154709q19168m64401m38061
$$ 314616699 313555355 312400017 311664124 311234436 310531635 309376926 308557758 308093357 307655296
3202.7C07655296o07662j191177q07553k54421m11663m19254r52645j071605o63834
$$ 307655296 307047634 305856457 305048904 304794483 304382820 303963566 303010921 301939316 301275482
3211.4C01275482j39446K26364o72398j201877r73492n66768m23222p16744q28533
$$ 301275482 301136036 301362400 300690002 299488125 298514633 297947865 297524643 296807899 295979366
3220B95979366r39560n22384l28141n36003o82106q09211q07896q21171l37086k70843
$$ 295979366 295039806 294517422 294189281 293653278 292971172 292161961 291354065 290532894 290195808 289924965
3229.7B89924965m49658m44927m75864m88033r71718p39479m45614q79307r04598m13990
$$ 289924965 289475307 289030380 288554516 288066483 287094765 286355286 285909672 285030365 284125767 283711777
3239.3B83711777k1916m23374r29012p57618k59552m65698n20287j02310l68710k58903
$$ 283711777 283689861 283266487 282337475 281579857 281320305 280854607 280334320 280232010 279863300 279604397
3249B79604397m44527j045284p72820l38897l05539l50112p0210n51186j062221n13477
$$ 279604397 279159870 278114586 277341766 277002869 276697330 276347218 276277008 275725822 274663601 274150124
3258.6B74150124l13111m26082n47886o50025n73806k46983r0504m63276m48551k70557
$$ 274150124 273837013 273410931 272863045 272213020 271639214 271392231 271301727 270838451 270389900 270119343
3268.3B70119343l32203o59924p71770l34187o39038p37381J6880j05457p14321m47693
$$ 270119343 269787140 269127216 268355446 268021259 267382221 266644840 266661720 266556263 265841942 265394249
3277.9B65394249o3744n45292m22477K3899l30067l09276k59362n54447n97916k78110
$$ 265394249 265330505 264785213 264362736 264386635 264056568 263747292 263487930 262933483 262335567 262057457
3287.5B62057457m09527q65021k37732l1776l91006j526j76907m39491l9482l20854
$$ 262057457 261647930 260782909 260545177 260513401 260122395 260120869 259943962 259504471 259464989 259144135
3297.2B59144135p15256l77274m31347k63424J93882Q97j72177m89921p12624m45175
$$ 259144135 258428879 258051605 257620258 257356834 257550716 257551613 257379436 256889515 256176891 255731716
3306.8B55731716j73664k24400p34291j014309m22248N5637k84615r2353k86560r65233
$$ 255731716 255558052 255333652 254599361 253585052 253162804 253218441 252933826 252841473 252554913 251589680
3316.5B51589680p94545n91812j21784j63269l50037k14176m89864n21603o61220k19460
$$ 251589680 250795135 250203323 250081539 249918270 249568233 249354057 248864193 248342590 247681370 247461910
3326.1B47461910m45652j080551m46014j89820j7357n87863j012040n41191q02860
$$ 247461910 247016258 245935707 245489693 245299873 245282516 244694653 243682613 243141422 242338562
3334.8B42338562n28488k53143p29657q43391l58524k91367q24280q29754m16011J08566
$$ 242338562 241810074 241556931 240827274 239983883 239625359 239333992 238509712 237679958 237263947 237372513
3344.4B37372513j66493p91320q84247o05488n9452j75476k24419j05514l69511k86789
$$ 237372513 237206020 236414700 235530453 234924965 234865513 234690037 234465618 234360104 233990593 233703804
3354.1B33703804k98843p59468n04456M80442K46410o06632n72262k71759j49402j25027
$$ 233703804 233404961 232645493 232141037 232621479 232867889 232261257 231688995 231417236 231267834 231142807
3363.7B31142807j10569R1457J14842n78385m61654J16939k43797k75421k67296m17767
$$ 231142807 231032238 231123695 231238537 230660152 230198498 230315437 230071640 229796219 229528923 229111156
3373.4B29111156n56488n52311m5127Q7757K54974Q0586l57323k18010j17092L7746
$$ 229111156 228554668 228002357 227957230 228044987 228299961 228380547 228023224 227805214 227688122 227725868
3383B27725868j88942l55682n8346j61457J53790M38900l22571n82752K14214K89097
$$ 227725868 227536926 227181244 227122898 226961441 227115231 227554131 227231560 226648808 226863022 227152119
3392.7B27152119m18701l84331k03476k13795J86081L93772Q8558q5373j2779j69811
$$ 227152119 226733418 226349087 226145611 225931816 226117897 226511669 226600227 226514854 226502075 226332264
3402.3B26332264l73402j82514J02482J41067r403j1215L26653P07130K65942n43271
$$ 226332264 225958862 225776348 225878830 226019897 226010494 225999279 226325932 227033062 227299004 226755733
3412B26755733k38819K73648J60637K03991J83391k7542L12595O69060L86543j00917
$$ 226755733 226516914 226790562 226951199 227155190 227338581 227311039 227623634 228292694 228679237 228578320
3421.6B28578320m38424K17839R26952N84412K13813r1819k61498k4853N69954O11477
$$ 228578320 228139896 228357735 229284687 229869099 230082912 229991093 229729595 229704742 230274696 230886173
3431.2B30886173K22149J89266K81983N84526K11983L64437N57670L55606J055127
$$ 230886173 231108322 231297588 231579571 232164097 232376080 232740517 233298187 233653793 234708920
3439.9B34708920K11391o05202L83110J389370O73580j07135N29728k69757K75250
$$ 234708920 234920311 234315109 234698219 236087589 236761169 236654034 237183762 236914005 237189255
3448.6B37189255J030254L11661O76727P61395P42511K60506L92838J014919Q20675
$$ 237189255 238219509 238531170 239207897 239969292 240711803 240972309 241365147 242380066 243200741
3457.3B43200741Q80890M27856M74987L03116N11913J140423N98641O54010M63791
$$ 243200741 244081631 244509487 244984474 245287590 245799503 246939926 247538567 248192577 248656368
3466B48656368O46591R87378N69076R28612J179161P52029O42243N54619L44734R96742
$$ 248656368 249302959 250290337 250859413 251788025 252967186 253719215 254361458 254916077 255260811 256257553
3475.6B56257553R37500O36253Q51708M42943O18802P09915P42073J242313Q94261
$$ 256257553 257195053 257831306 258683014 259125957 259744759 260454674 261196747 262439060 263333321
3484.3B63333321K32486R64356J919956Q04501J47743Q46920J034679O94428Q23021
$$ 263333321 263565807 264530163 266450119 267254620 267402363 268249283 269283962 269978390 270801411
3493B70801411J027660P48272J090679J056671J019993P67727K62737Q78315J210995
$$ 270801411 271829071 272577343 273668022 274724693 275744686 276512413 276775150 277653465 278864460
3501.6B78864460J110840J142521J426162P98665K27336J216488J572514P64389P32689
$$ 278864460 279975300 281117821 282543983 283342648 283569984 284786472 286358986 287123375 287856064
3510.3B87856064J304397R34945J171741J382980Q99086J052800J094017J104889J090316
$$ 287856064 289160461 290095406 291267147 292650127 293549213 294602013 295696030 296800919 297891235
3519B97891235J287995P76100K41642Q74195J750431K103500J257706J129360J156178
$$ 297891235 299179230 299955330 300196972 301071167 302821598 304925098 306182804 307312164 308468342
3527.7C08468342P46403P96394J264191J638698J214390J452713J114273J329498J248341
$$ 308468342 309214745 310011139 311275330 312914028 314128418 315581131 316695404 318024902 319273243
3536.4C19273243Q99525J859893Q41942J013985J973953J937943J021690O67839J833840
$$ 319273243 320172768 322032661 322874603 323888588 325862541 327800484 328822174 329490013 331323853
3545C31323853J594963J885566P80030J449928K251816J647644K081794P17965J646614
$$ 331323853 332918816 334804382 335584412 337034340 339286156 340933800 343015594 343733559 345380173
3553.7C45380173J740303J779213K060508J124573K214050J729432J565055J320992
$$ 345380173 347120476 348899689 350960197 352084770 354298820 356028252 357593307 358914299
3561.4C58914299K153473J936340Q86116L245583J124534J190644J496467K68784K605286
$$ 358914299 361067772 363004112 363890228 367135811 368260345 369450989 370947456 371216240 373821526
3570.1C73821526K454032K545434J801795J979828J895066K095070K189521J071473
$$ 373821526 376275558 378820992 380622787 382602615 384497681 386592751 388782272 389853745
3577.8C89853745K736015K613220K040634J383705J669045K134323J986847M202270
$$ 389853745 392589760 395202980 397243614 398627319 400296364 402430687 404417534 408619804
3585.5D08619804J206818j53236K970810J768112K983246K625236K729874J511841
$$ 408619804 409826622 409673386 412644196 414412308 417395554 420020790 422750664 424262505
3593.2D24262505J999092L169250M48990K925682L161278K024307L465462J956215
$$ 424262505 426261597 429430847 429879837 432805519 435966797 437991104 441456566 443412781
3601D43412781J866569K560959K133484K884178L713570K183990m196L953858J492233
$$ 443412781 445279350 447840309 449973793 452857971 456571541 458755531 458751335 462705193 464197426
3609.6D64197426Q38737O276017J890106J02577M421043J378746L930321M159851J795006
$$ 464197426 465036163 471312180 473202286 473304863 477725906 479104652 483034973 487194824 488989830
3618.3D88989830K265205R45549K559281L295631K868500K871628L505668L106003
$$ 488989830 491255035 492200584 494759865 498055496 500923996 503795624 507301292 510407295
3626E10407295L233071N972976O22483n324822M790268N266228N186310K536392Q7433
$$ 510407295 513640366 519613342 520235825 514911003 519701271 524967499 530153809 532690201 532777634
3634.7E32777634L121376M117584K876091J728172K940521L661957K706337J754265
$$ 532777634 535899010 540016594 542892685 544620857 547561378 551223335 553929672 555683937
3642.4E55683937K232285L348350L772659M292756j428261p99637O296310J769410
$$ 555683937 557916222 561264572 565037231 569329987 567901726 567102089 573398399 575167809
3650.1E75167809J619415J345062L963242M102401M055558M956207m386025K893944
$$ 575167809 576787224 578132286 582095528 586197929 590253487 595209694 590823669 593717613
3657.9E93717613N657921J785507K201576J708985K929993J423912J510734K205162
$$ 593717613 599375534 601161041 603362617 605071602 608001595 609425507 610936241 613141403
3665.6F13141403J329880M223824J182975j31874J911812m259033L108673P391281
$$ 613141403 614471283 618695107 619878082 619746208 621658020 617398987 620507660 627898941
3673.3F27898941Q199883n86434j4941444L682823P617149M480553j059570J084327
$$ 627898941 636098824 635512390 620570946 624253769 631870918 636351471 635291901 636376228
3681F36376228K464486J478347J365280J141663M52576K667923N618667o126938k704696
$$ 636376228 638840714 640319061 641684341 642826004 643278580 645946503 651565170 645438232 642733536
3689.7F42733536O106796l272018J428146M993134J155090J027450J25580L9978J267700
$$ 642733536 648840332 645568314 646996460 651989594 653144684 654172134 654297714 654337692 655605392
3698.4F55605392J98517K187958L249130l794098j432418M079666J646423N39093N75028
$$ 655605392 655803909 657991867 661240997 657446899 656014481 660094147 661740570 662279663 662854691
3707F62854691K088317K628403n085296K939758K067871r186478N099716M209595M64401
$$ 662854691 664943008 667571411 662486115 665425873 667493744 658307266 663406982 667616577 668080978
3715.7F68080978N70374J499634J061630k611465J416702M430694l813095j916504
$$ 668080978 668651352 670150986 671212616 668601151 670017853 674448547 670635452 668718948
3723.4F68718948N110245J00861j349411j246186O89774L174362J081238M378357j998902
$$ 668718948 673829193 673930054 672580643 671334457 672024231 675198593 676279831 680658188 678659286
3732.1F78659286p013092N274506j040497m447403J481400N32455J026078K536239
$$ 678659286 671646194 676920700 675880203 671432800 672914200 673446655 674472733 677008972
3739.8F77008972K633438k460251K473603R727325q785477j2714767Q723526M500122
$$ 677008972 679642410 677182159 679655762 689383087 680597610 667882843 676606369 681106491
3747.5F81106491M253769l174057q087921Q868332l221588n452347N000076L999024
$$ 681106491 685360260 682186203 674098282 682966614 679745026 674292679 679292755 683291779
3755.3F83291779K698288m000702J696243L622055o930237n76324L750610J533661
$$ 683291779 685990067 681989365 683685608 687307663 680377426 679801102 683551712 685085373
3763F85085373P74155K620773j770249l313980K303086L123779r0866o129761J279907
$$ 685085373 685859528 688480301 686710052 683396072 685699158 688822937 688732071 682602310 683882217
3771.7F83882217K279663O72379J068344o38122Q23898Q59146K241592q74633o176224
$$ 683882217 686161880 686834259 687902603 687264481 688088379 688947525 691189117 690314484 684138260
3780.3F84138260K890701K003021P18155J187668k668152m94613J329727J139221L47977
$$ 684138260 687028961 689031982 689750137 690937805 688269653 687775040 689104767 690243988 690591965
3789F90591965m07334N0125k4948O00663j25351O80236J795502l214340k037659K790070
$$ 690591965 690184631 690234756 690209808 690810471 690685120 691365356 693160858 689946518 687908859 690698929
3798.7F90698929L184967L233337o319275p990570M005661L246765L553696K740708
$$ 690698929 693883896 697117233 690797958 682807388 686813049 690059814 693613510 696354218
3806.4F96354218q223114j338349M755707J823730k04773j42135J89514J156006M001617
$$ 696354218 688131104 686792755 691548462 693372192 693167419 693025284 693214798 694370804 698372421
3815.1F98372421k503738j0879135M492035M896621L659821J014557j2869110J422958
$$ 698372421 695868683 684989548 689481583 694378204 698038025 699052582 686183472 687606430
3822.8F87606430M228897J524582J476898p44095k175064J551819J411438J468582
$$ 687606430 691835327 693359909 694836807 694092712 691917648 693469467 694880905 696349487
3830.5F96349487N91660n839768J816254M803085m550247R3689O456528o291962l792648
$$ 696349487 696941147 691101379 692917633 697720718 693170471 693264160 699720688 693428726 689636078
3839.2F89636078N060501l867874L75137M776383j964035j757813K623596J008377
$$ 689636078 694696579 690828705 691203842 695980225 694016190 692258377 694881973 695890350
3846.9F95890350l41873J277619q13675R41314M072266m331589j196975j2730103L028030
$$ 695890350 695548477 696826096 696012421 696953735 701026001 696694412 695497437 682767334 685795364
3855.6F85795364Q834153n60761j284485J670914K217483K055817l953323n4627L527985
$$ 685795364 694629517 694068756 692784271 694455185 696672668 698728485 694775162 694720535 698248520
3864.2F98248520l991776k388763K920990K899017J963349p820816m100571M208221
$$ 698248520 694256744 691867981 694788971 697687988 699651337 691830521 687729950 691938171
3871.9F91938171M430695K741547o091156K77404K793351k76947R00268J887436m058914
$$ 691938171 696368866 699110413 693019257 693296661 696090012 695813065 696713333 698600769 694541855
3880.6F94541855l913193M323578J246033J950683L467942j0245667O80161L449173
$$ 694541855 690628662 694952240 696198273 698148956 701616898 691371231 692051392 695500565
3888.3F95500565J034698L186188o33240o912460M58908L335647l99398N07736l0136
$$ 695500565 696535263 699721451 699088211 692175751 692634659 695970306 695570908 696078644 696048508
3897F96048508J240463J519012n734863L874436Q7356m436035K626114k523117O5994
$$ 696048508 697288971 698807983 693073120 696947556 697034912 692598877 695224991 692701874 692767868
3905.7F92767868R26514Q06732J618500L67660j8844l24784L52860m06876m07028Q49686
$$ 692767868 693694382 694501114 696119614 696487274 696468430 696143646 696496506 696089630 695682602 696532288
3915.3F96532288J154708l286514k439728L952103k80914k487335J857910J060486
$$ 696532288 697686996 694400482 691960754 695912857 695631943 693144608 695002518 696063004
3923.1F96063004J51596j896286j245041J634750J173401R36432m29611j212998L21732
$$ 696063004 696214600 694318314 693073273 694708023 695881424 696817856 696388245 695175247 695496979
3931.7F95496979j861344q62121K201385O65589J2664l9520r50393m19159M15191J551972
$$ 695496979 693635635 692773514 694974899 695640488 695653152 695613632 694663239 694244080 694659271 696211243
3941.4F96211243j54496l337020M92630J370544N32150Q93708j389008O05774p2250
$$ 696211243 696056747 692719727 693212357 694582901 695115051 696008759 694619751 695225525 695153275
3950.1F95153275j900254J471329L17764j41830M41818L45001J47400r17282q6136
$$ 695153275 693253021 694724350 695042114 694900284 695342102 695687103 695834503 694917221 694831085
3958.7F94831085m52881L44696j97143o24161Q15888j016922k61307O75277l32946
$$ 694831085 694378204 694722900 694525757 693901596 694717484 693700562 693439255 694114532 693781586
3967.4F93781586L93524O86874O5308L11050l91845j283265N27115Q15888j10398p90939
$$ 693781586 694175110 694861984 694927292 695238342 694846497 693563232 694090347 694906235 694795837 694004898
3977.1F94004898k35367N98526n90591j26343K29263M05960N39170m37317o42090j57166
$$ 694004898 693769531 694368057 693777466 693651123 693880386 694286346 694825516 694388199 693746109 693588943
3986.7F93588943N16739q3465K47726K11792m19616L01361K51922j58462m41742J20773
$$ 693588943 694105682 694022217 694269943 694481735 694062119 694363480 694615402 694456940 694015198 694135971
3996.3F94135971k5635K07444L60870k45819
$$ 694135971 694110336 694317780 694678650 694432831
4000.2F94432831
$$ 694432831
##END=$$ End of the data block
