##TITLE=$$ Begin of the data block
##JCAMP-DX=5.00 $$ ACD/SpecManager v 10.08
##SPECTROMETER/DATA SYSTEM=Varian
##DATE=15 Jan 2013 10:02:28
##DATA TYPE=INFRARED SPECTRUM
##DATA CLASS=XYDATA
##ORIGIN=
##OWNER=
##NPOINTS=3735
##FIRSTX=399.26403809
##LASTX=4000.35498047
##MAXX=4000.35498047
##MINX=399.26403809
##MAXY=75.56945801
##MINY=22.61544037
##XFACTOR=1.0000000000
##YFACTOR=0.000000100000000
##FIRSTY=47.89271164
##DELTAX=0.96440572
##XUNITS=1/CM
##YUNITS=TRANSMITTANCE
##XYDATA=(X++(Y..Y))
399.3 478927116 470457726 460929146 464860382 468396606 467461662 466645355 467943420 469284668 467285385
407.9 467285385 463394279 457076340 454043884 456745720 462179184 465084343 457891006 450930672
415.7 450930672 450881500 448813171 448601990 454044266 457138062 459715767 456127739 451283112 453679962
424.3 453679962 455748100 452764740 448273659 449749870 456389847 462438812 465493202 465524025 463290443
433 463290443 458382301 454681816 455008507 456510849 455904274 457159462 457836952 453318100 450757751
441.7 450757751 454395332 461202583 461650085 453499680 447478027 447415886 450224648 452243118 451844215
450.4 451844215 450884094 448951912 447541313 451493530 458151512 457583656 444846992 438060188 447377129
459.1 447377129 449554443 449590454 451205788 450988083 449969101 449904633 451144409 450757294 450485077
467.7 450485077 447944756 442839394 442576828 443086967 441592102 443094368 447651711 446120834 440711136
476.4 440711136 443289070 444478607 443141861 443208961 441012650 437098503 434977798 435631104 433447762
485.1 433447762 432881126 437294884 439936218 440588112 441192513 438859673 435572586 434436150 432812195
493.8 432812195 433509903 433398247 432175484 431772003 429871101 431994057 434342461 433250542 433381042
502.5 433381042 433701782 432371407 429458160 429491806 432399254 432140083 430187874 428838043 428373985
511.1 428373985 429069328 429181824 428239441 426707573 423072968 421079025 420557098 418644295 420249405
519.8 420249405 422958870 422362671 421488495 421909943 419683418 416146812 418245430 420939102 420019760
528.5 420019760 418346748 418546600 420571518 422790298 423557472 421739540 419941101 418960495 416660004
537.2 416660004 415178337 415930290 417039757 416502228 414552612 415907860 417163658 414692345 414374886
545.9 414374886 414402885 413290482 412640572 411068497 410328445 409432983 408925896 409445038 409071922 408692398
555.5 408692398 408112602 407519913 406298447 404504318 404911804 405442123 405696793 406418343 405427551
564.2 405427551 405827560 406831207 407232666 409096642 409585304 408564186 407188797 406121368 406056404
572.9 406056404 405551414 405055695 404465256 404654198 405489388 405665588 405928955 405998688 405890923 405314255
582.5 405314255 404301834 404218636 403777924 403358803 404428673 404798012 404710236 405576706 406089630 405333939
592.1 405333939 405048599 406598625 407522430 406378021 405417747 406944847 408362312 407744255 408129120
600.8 408129120 409154015 410089417 408953781 406565361 405783463 404613533 404304276 404439430 405253067
609.5 405253067 406434517 405553589 404926720 403252945 401574745 401499863 401563759 400748138 398977814
618.2 398977814 400097427 401606293 401659050 402197037 403171654 404545212 405303040 405841026 405628166
626.9 405628166 405485611 407033882 408294601 409315186 411161842 413071289 415032539 417046661 418796310
635.5 418796310 421208611 423681221 424256020 423637428 423710060 424392242 424740562 425744514 428236847
644.2 428236847 429773483 429582520 429709282 431366539 433783302 435388603 435872307 434978256 434698792
652.9 434698792 434766541 433749313 434618683 436418686 437674446 438712654 438120995 436573830 435432663
661.6 435432663 435122795 435085640 435020981 435176353 434842186 431187630 427328072 434255829 436566200
670.3 436566200 438076477 439309654 439098167 439473953 440656090 441305847 442545319 444616623 445740433
678.9 445740433 446937828 448630028 448887978 449424667 451587143 452402954 452084694 453088341 453675575
687.6 453675575 454237938 456363831 458386536 459712715 460644684 461605453 462483940 462342682 460957031
696.3 460957031 460642052 461823692 462839279 463539085 463973122 465992165 467908058 468092651 468880539
705 468880539 469107552 468790283 469308052 470074501 471053581 472460785 473654556 474313660 474972153 476460495
714.6 476460495 477720833 478124771 479059563 478380699 477956200 479117699 479427528 480518074 480974770
723.3 480974770 482273865 484680367 485807076 486749535 487640800 488688698 488498726 488737793 489133759
732 489133759 489485664 491155624 491768265 493380127 495574493 496707954 497229729 497597771 497320938
740.7 497320938 495567818 494859695 495005646 496253510 497692451 498607788 500605392 502795677 503412895
749.3 503412895 502459602 503847618 505117912 504087257 503860054 504659309 505827065 506487045 508664932
758 508664932 511683121 513302689 514255257 515755386 516930580 516278191 516337128 516633568 517434273 519045753
767.7 519045753 519875374 521467094 523429985 524358521 523445663 521880226 521066017 520648537 520058937
776.4 520058937 519915657 520643845 521688538 522722664 523303566 524428787 525279427 525786819 525587921
785 525587921 524654541 524884682 524720650 525106468 525825844 526621170 527784348 528306694 528474045 527699203
794.7 527699203 527986984 527850609 526850967 525274925 522914352 522285271 521898422 521858292 521361237 520365562
804.3 520365562 519843521 519139938 517946625 514689789 511477623 509774017 508657494 507141953 505913200
813 505913200 505535355 504894485 503825150 502237129 501875610 501983109 501034584 499904633 499727440 500447922
822.6 500447922 501272659 503126869 505276680 508126221 511801910 515854378 519225502 520855446 523138809
831.3 523138809 525137367 528307343 531535645 533166771 536182671 539972343 543933258 546213188
839 546213188 548157310 549301262 550335388 553089447 554453354 556099396 557250252 557680588 558844223
847.7 558844223 560902214 563365631 565246239 566764679 566806068 567872734 569846153 571094055 571725235
856.4 571725235 572642326 574226723 575510788 577575455 578864136 579942398 580759773 581415215 581635056
865.1 581635056 579692497 578214149 577554855 577051277 575476875 574723587 574526253 572973099 571936455
873.8 571936455 570669441 568931503 566480751 564993477 563922691 562598457 561672554 560562706 560261993
882.4 560261993 559864616 560415497 560783310 560186462 559111710 558209457 557701187 555797997 556064034
891.1 556064034 556335220 555455894 556204872 557430077 558555489 559250526 560565109 560805740 560452194
899.8 560452194 559771309 559296837 559104195 558015671 559673233 562364464 565398407 567952728 569954834
908.5 569954834 573034248 574626694 575627403 575292015 574552612 573418045 572146950 571553993 569854698
917.2 569854698 568245354 566868935 565486183 562257195 558755379 555671425 551741219 547609215
924.9 547609215 543409309 540488091 536574516 532832031 530310211 527849464 525381889 522696533
932.6 522696533 520999947 518772316 517167320 515747948 514280853 514179153 513809052 513399506 512182426
941.3 512182426 511617546 511377754 509866066 508394394 507524529 507585831 507569847 507666283 507621918 508084030
950.9 508084030 508637199 508165131 507443886 506058159 505137939 503817902 501740150 499373131 497028160
959.6 497028160 495140419 493116264 491498718 489146080 486980934 485462265 483709869 482103233
967.3 482103233 480006104 477883377 475918350 473492813 470012207 467290192 465290108 461939125
975 461939125 458509483 454987831 451020584 447179642 442753983 437766533 432841225 427375031 421940804
983.7 421940804 416764832 411546288 406807175 401552696 396593208 392411766 387381401 382386894
991.4 382386894 377895317 373076553 369286156 366093712 362246437 358274078 354808464 351729660
999.1 351729660 347957764 344347000 340976944 338292122 336029778 333330498 331151085 328857231
1006.8 328857231 326657486 324104767 322610207 321366806 318786030 316788521 314766388 313413849
1014.6 313413849 311419621 308632088 305717106 302674255 300632973 298455200 296558971 294040585
1022.3 294040585 291436577 288750019 286629467 285273762 283059635 281554108 279823818 279026527
1030 279026527 277996159 276678162 276316833 276117191 276640415 275971031 276327496 277177811 278290062
1038.7 278290062 279969463 281601715 283828144 284693031 285681629 286401386 287049408 286383419 284866219
1047.4 284866219 284182949 282644424 281943626 280882912 280502415 279674549 278085403 277424278 276609077
1056 276609077 276438885 274954548 274786224 275256042 275967999 278493462 280865517 283378506 285229645
1064.7 285229645 286950569 287632217 289188461 291388702 293160305 295208225 296154289 297495556 298073807
1073.4 298073807 298356152 297841320 297612209 298689423 299017735 300099792 301304531 302617970 302607040
1082.1 302607040 303190289 304779224 305438023 306705914 307945709 310022163 311361065 313296070 315585651
1090.7 315585651 317342529 319850597 321037292 322241440 323119164 324797707 327153969 328568306
1098.5 328568306 330114250 332327118 334892273 336035690 337757797 340171280 342059250 343033943
1106.2 343033943 344077988 345767174 346211205 346704674 347052116 348067284 349495964 350614204 351905174
1114.9 351905174 352825356 354633408 355340729 355241051 354756012 354038086 354545479 354675713 355066757 355354195
1124.5 355354195 355544891 356501694 357662849 358822708 360825195 363207550 365171547 368004761 370494194
1133.2 370494194 372839813 375020676 377407188 380464706 382578735 384614220 386566620 388349152
1140.9 388349152 390029831 391551590 392455063 392710381 393209496 393938332 395407639 396695671 397314796
1149.6 397314796 397171707 397093391 397651482 397250404 396614571 395898209 395339317 395069084 394462128 394192657
1159.2 394192657 393681450 392972031 392477951 392680855 393407631 394153862 395014267 396547546 399153519
1167.9 399153519 401740875 404669418 407480164 410544357 414042702 416587448 419283295 422514496
1175.6 422514496 425249367 427746811 430133209 432177162 434662285 437240677 439672318 441977348
1183.3 441977348 443982048 445798302 447331238 448422356 448496323 448329811 448029861 447970848 448375168
1192 448375168 448402328 448040161 447404442 446701241 445709648 444584084 443072853 441684113 440687561 439332542
1201.6 439332542 438228645 437143135 435900764 435177345 434891663 434287605 433286781 432590828 432051239
1210.3 432051239 431621552 431223183 430739250 430560379 430684395 431031418 431432495 431330070 430809097 430477867
1220 430477867 429782944 428818779 428120270 427555466 426989098 426256332 425967216 425788383 425481834 425075722
1229.6 425075722 424044418 423120003 422068100 420582657 419491386 418932304 418814735 418616180 417964973
1238.3 417964973 417952957 418479805 417930527 417216454 417217941 416976624 416295776 415148888 414253731 413780785
1247.9 413780785 413291855 413121681 413064117 412957458 412789497 412832146 412826881 412514534 412203064 411838303
1257.6 411838303 411615448 411351471 411410217 411657524 411952820 412642288 412971268 413476448 414344711 414799500
1267.2 414799500 415004616 415856857 416617317 417031555 418132172 419076080 420306282 421597786 422688255
1275.9 422688255 423954277 424967461 426169319 427293510 428345413 429144249 430159111 431651001
1283.6 431651001 433323784 435106354 436559181 438391418 440149155 441386642 442387886 443276558
1291.3 443276558 443822441 444291649 444967995 445721207 446965790 448044815 449001579 449566803 449643021
1300 449643021 449617729 449789696 450131798 450053329 450144157 449649048 449375458 449544449 449663658 449996452
1309.7 449996452 449054413 448135071 447615662 447009201 446451569 445691757 445383949 445304184 445659828 446386909
1319.3 446386909 447472801 448696823 449771347 450768776 451583786 452361908 452754173 452973137 452791977
1328 452791977 452953682 453001480 452484169 452406578 452005615 451452446 451043167 451065826 450774803 450281906
1337.6 450281906 450413361 450159912 450557060 451592636 452727203 453514748 454559708 455880241 456343384
1346.3 456343384 456826820 456934967 457239189 457127609 456737671 456558495 456331558 456534462 455867195 455395164
1355.9 455395164 455229912 455179787 455028801 454482384 453513680 452250481 452468910 451728859 451334152 451304588
1365.6 451304588 450861816 450722580 449802055 449713135 449452248 448645554 447897873 447412491 447042961 446077881
1375.2 446077881 446674728 447014084 447012978 447139130 447274857 446908684 445587883 444178658 442238579
1383.9 442238579 440823402 439374275 437668266 435611343 434525223 433988457 432217102 430664787
1391.6 430664787 428918610 427251663 424402122 420620537 418942451 417050285 415602798 412326241
1399.3 412326241 409842644 408710861 406601906 404898987 402657547 399630852 397241478 395591431
1407.1 395591431 393920174 391831779 390277481 388589668 386901474 385479164 384685783 383920631 382613449
1415.7 382613449 381763191 380568237 380245934 378551559 378491135 380015488 380172310 380616798 380962753
1424.4 380962753 382501411 383650856 383936081 385259743 385820312 386780014 387707672 389270973 390897064
1433.1 390897064 392490540 394989929 396843910 398863602 400403557 403147011 405410347 407430954
1440.8 407430954 409364052 410739288 412724419 413560448 415211716 416633072 417721825 419488335
1448.5 419488335 421545792 423740921 424474106 425880661 426783600 428239708 429543495 429510117 429569206
1457.2 429569206 430089760 435305176 438121986 440835114 442601242 444058342 446298637 446680832 449456635
1465.9 449456635 451593475 454289780 456909523 459831314 463133049 464956779 468861847 471593361
1473.6 471593361 475145645 478185577 480897522 484116135 486412811 488632278 490916977 493180542
1481.3 493180542 494816132 497035980 499100456 500724907 502456284 502970009 503733063 505082474 505150719
1490 505150719 505765572 506647797 506836510 505970116 504930191 503516350 499335480 499578209 497972717
1498.7 497972717 495470924 495280800 493777313 492756805 491746826 491431656 490936623 487140656 482009506
1507.3 482009506 482656708 484767609 484518127 484920311 483578148 482293205 482396584 481067390 479556656
1516 479556656 476564178 476570435 477947426 478860054 476735992 473130760 476057587 477924271 479068794
1524.7 479068794 478618584 480179329 481813965 482158012 483099213 484011002 485021629 485308418 485539932
1533.4 485539932 485546150 486884651 488169365 488988190 490123405 486719093 484953728 487630577 488770103
1542.1 488770103 488647270 490055237 491516533 491854744 493690109 493872108 494325294 493912354 492941818
1550.7 492941818 494577637 495255775 495922318 493937340 494505539 495821800 496048317 490839767 479734116
1559.4 479734116 485391464 486435966 487513962 486461868 485311203 482887802 479748116 478238487
1567.1 478238487 475227432 472536774 464276390 463161888 461192818 457268906 454229813 450635262
1574.9 450635262 448369064 435190811 433451042 430305634 426102905 422156219 416115532 411980095
1582.6 411980095 405686073 401615829 395968590 391381187 386755409 380817871 376988335 370976677
1590.3 370976677 367370262 360694237 356746902 352648315 347651443 344433746 338653183 336364021
1598 336364021 331266785 328659134 324596672 320663452 318290329 313525906 312452755 308737087 307505131
1606.7 307505131 304382515 302770901 301381664 298555202 298904533 295971870 296150513 293747025 293415222
1615.4 293415222 293420849 288778305 290629921 289512787 291184711 289655647 290705986 290780392 289097309
1624 289097309 290814953 290335369 292448063 290706558 292668934 293860588 295278664 296874866 297072773
1632.7 297072773 299898434 299502048 302562027 301934948 305077591 307197075 308398705 311202717 311515942
1641.4 311515942 314531307 315537300 318327770 320406532 320745125 323934174 322923698 326657829
1649.1 326657829 327094345 329949150 332127342 330423813 331940727 332647171 337163200 338208580 340974998
1657.8 340974998 342205734 343995934 346032944 347133217 350048027 350887985 355053825 357609863
1665.5 357609863 361125259 364231186 366836739 371267319 373064079 378243599 380743828 385374298
1673.2 385374298 389098549 392167549 397224808 400832672 406032906 409449158 414702454 419550896
1680.9 419550896 424624176 429249878 430018921 438181839 441784859 448222847 452868729 457750511
1688.6 457750511 463118515 467932854 473743858 478642082 484459038 489514923 494154282 498093948
1696.4 498093948 503925247 509882431 515060768 518218651 521266212 529525871 535301323 539721832
1704.1 539721832 543100166 546605644 549839401 553210335 557392807 559917030 562194672 565253601
1711.8 565253601 568239822 570817451 571744728 573406830 577116966 578973389 575948219 580006943
1719.5 580006943 583794594 585936012 587183075 588053436 589815598 591991234 593651085 594794769
1727.2 594794769 596548347 598366776 598066216 599085236 602606316 605218277 602654037 600485954
1734.9 600485954 605619888 609803658 612427216 615897064 617133217 616553230 620378838 623146858
1742.7 623146858 624423943 626322632 629597244 632623253 635168571 638575249 641304474 645921860
1750.4 645921860 647617493 649276962 654499207 657992096 660951996 663250809 664143143 666762009
1758.1 666762009 670053024 673056717 675900497 675912170 677339096 680835495 682436447 683925400 685536270
1766.8 685536270 686318512 685165100 687750854 691459351 692129288 691853790 691371536 695150070 697019958
1775.4 697019958 696766510 698675232 699351959 700803146 701077499 701038132 702407990 704484863 706876755
1784.1 706876755 706919174 707502823 708827744 709792557 709920044 710531616 710986862 711324081 710710373 710839691
1793.8 710839691 714284439 715351257 715746918 717081146 718390656 719091644 717778702 719010544 718742828
1802.4 718742828 719394150 721033478 722018890 723740463 724326248 725010757 725769730 726492767 725670013
1811.1 725670013 726087265 727345963 727503433 728493729 729057388 730009613 729972534 730749817 732205353
1819.8 732205353 732600861 733450623 733069382 733989258 734286499 731721115 732361298 734717865 736366196
1828.5 736366196 735731049 734382324 735621948 737643585 737685165 737916260 738713608 738667603 738369446
1837.2 738369446 737774353 738944168 739696350 740744705 741725922 742658005 742617111 738259964 740796967
1845.8 740796967 742720032 741978760 741453094 742322464 743552551 743752670 744915466 745237274 745556564
1854.5 745556564 745603561 745582199 745988312 745339584 745460663 745225296 745452118 745739670 746332245 747178497
1864.2 747178497 747656326 748290405 747594681 747856827 746902390 746236267 747328644 747885513 748156662
1872.8 748156662 748210144 749275284 749546967 750196686 750685654 750614548 750614243 750059433 750346527 749993896
1882.5 749993896 750270920 750171432 750213013 751093292 751329269 752460480 752085190 751072006 751462631 751990662
1892.1 751990662 751912613 751619110 751015549 750319366 751694946 752258377 752844772 753506317 753691711 753900909
1901.8 753900909 753049393 752991104 752731323 752705841 752572403 752446365 752847214 752916260 753308563 753644028
1911.4 753644028 754849243 754846573 754637070 754211349 753480606 753874893 751976852 751807480 752961502
1920.1 752961502 754336548 755421371 754524536 754293365 754895935 755694580 755235367 754561996 753878403
1928.8 753878403 753584747 753900375 753947906 754543839 754486771 755132370 755508804 755311890 754980011 754385834
1938.4 754385834 754262466 753492203 753876801 753152237 752486877 753803406 754336395 754780807 754670868
1947.1 754670868 754936371 754540024 753897476 753638000 753619843 753738251 753289337 753558960 753448944 754149551
1956.7 754149551 754732895 754486618 754423141 753725739 753591537 753082733 752718811 752663574 752932968 753126144
1966.4 753126144 752716446 753289871 753844223 754379044 753991776 753323746 752718353 752332840 752373428 751842117
1976 751842117 752354431 752815018 753254547 753696213 753709335 753691254 753278885 753022842 752200012 751945572
1985.7 751945572 751713867 751352615 751332626 751401978 752319412 752564697 752528076 752631226 752823715 752376328
1995.3 752376328 751533051 751126938 750566025 750722275 750662079 751096268 751807709 751822357 751695404 751414795
2005 751414795 751316528 750601273 750060043 749606552 749417801 749329605 749380569 749898834 749660492 750116272
2014.6 750116272 750336609 750082474 749546890 748815079 748787994 748453598 748401566 748128281 748059082 748102417
2024.2 748102417 748342361 748730545 748434906 748751068 748635559 748277512 747479782 746562119 746246719 745932312
2033.9 745932312 746424561 746878052 746849899 746621780 747085419 747336426 747083130 746621017 745698471 745705338
2043.5 745705338 745292664 745080185 745008850 744950485 745439682 745560913 746016083 745747986 745505219 745329666
2053.2 745329666 744712982 743987122 743689270 744140778 743813095 743776169 743892212 744609222 745065765 744585190
2062.8 744585190 744591827 744063797 743806229 743502884 743548126 743415527 743210754 743943863 743857803 743685684
2072.5 743685684 743669815 744164810 744228592 743882828 743554459 742759323 742601013 742287292 742422104 742343140
2082.1 742343140 742526398 743030624 742977829 743094101 742454376 742316284 742052917 742002945 741921692 741370850
2091.7 741370850 741647568 741380539 741434555 741375198 741445389 741455002 741076202 741159592 740896149 740967865 740566864
2102.4 740566864 740246353 740047073 740018768 740243225 739912109 739971237 739764786 740024414 740086670 739827042
2112 739827042 739621429 738894501 738181839 737668610 738435364 738843155 739089355 739286194 738905334 738861465
2121.6 738861465 738572769 738588486 738124237 737897720 737828445 737667847 737768097 737595825 737911911 737896194
2131.3 737896194 738247757 738464966 738457870 738237228 737642670 737662659 737057190 737042542 737238007 737346420
2140.9 737346420 737501450 737500229 737869492 737668457 737991943 738245926 738230972 737774048 737334824 737573013
2150.6 737573013 737481842 737892838 737935257 737845535 737689972 737881622 738170929 737778778 737731628 737205811
2160.2 737205811 737324219 737380219 737353058 737790375 737943649 738167877 737809601 738217621 738487320 738296661
2169.9 738296661 738009491 737777939 737958908 737488098 737659531 737997055 738630905 738844299 738508759 738655701
2179.5 738655701 738328934 738406143 738321381 738323135 738345261 738475037 738784790 738722534 738782120 738289719 738486862
2190.1 738486862 738795547 738990555 739072876 738755951 738969345 738904343 739004059 738740005 738568039 738505936
2199.8 738505936 738747482 739364700 739178619 739495773 739479523 739147873 738746338 738796921 738994293 738493881
2209.4 738493881 738844070 739338608 740001678 739869232 739458618 739489212 739444351 739624939 739007034 738993683
2219 738993683 738850708 738911057 739671860 739820862 739676056 739286880 739502945 739239197 739235153 739303055 738818512
2229.7 738818512 738819656 738950958 739372940 739236526 739671631 739591522 738864670 739230194 739430161 739236298
2239.3 739236298 738824615 739184494 739126282 739187088 739561996 739261017 739512939 739273453 739072342 738856277
2248.9 738856277 738912125 739035568 738927155 739364548 739259796 739183731 738727036 738795471 739231720 739177704
2258.6 739177704 739213791 738830414 738685226 738325348 738377762 738485718 738580933 738694916 738178711 738254929
2268.2 738254929 738259659 738474503 738593903 738673248 738517685 737799225 737681122 737664413 737930298 738095856
2277.9 738095856 738426971 738176422 737772827 738292160 738228073 737847672 737362442 737421036 737133102 736679077
2287.5 736679077 736718826 736951141 737545242 737127533 737163925 737177963 736833344 736518097 735972519 736032181
2297.2 736032181 735587234 735622940 735699310 735741730 735483704 735009842 735421982 735312195 735102997 734108582
2306.8 734108582 733780594 733830185 733157654 733239899 733350754 733570175 732869339 733116074 733574982 732952957
2316.4 732952957 732251663 731311493 731544113 731096802 730796585 730579758 730423965 730669861 730741882 731202545
2326.1 731202545 730135803 729592819 729049911 728581467 727477951 726893921 727951431 727479248 727807388
2334.8 727807388 726588669 725887451 726127319 726456223 727429810 726592636 727018280 726351318 726355438 725849457
2344.4 725849457 725180893 726761017 727316666 728193893 728311005 728094482 727530594 726979294 726634064
2353.1 726634064 725678253 724869843 722675247 722636490 721887207 721585236 722436066 721919098 722871323 722830963
2362.7 722830963 722150269 719933090 720577698 721891327 722181854 722883911 722077789 722588425 722372894
2371.4 722372894 722985306 723473434 723301392 723662186 722874527 722670898 722632065 722706375 723174973 724244766
2381.1 724244766 724990921 725042038 725244675 724612503 724070740 723724976 723295975 722907486 722813950 722770462
2390.7 722770462 722411804 722895508 722951889 722602463 722466736 722406540 722209854 721482773 720971985 720379257
2400.3 720379257 720122986 720066528 720073929 719895782 719629517 719673538 719482193 719546204 719052277 718628845
2410 718628845 718069000 717259827 717242508 716937943 716672287 716408615 716833878 717072525 716417618 716134338
2419.6 716134338 715803757 715500793 714677582 713987274 713634949 713412170 713264008 712791519 713143921 713738403
2429.3 713738403 713673477 712835999 712038193 711258240 710538406 710319138 709829407 709739227 709746552 709861908
2438.9 709861908 709756165 709209061 709022369 708705597 708469620 707996902 707205811 706487427 706427460 706264267
2448.6 706264267 705560455 705393829 705197449 705233002 705192947 704766388 704095612 703538666 703192749 702612839
2458.2 702612839 702585068 702234039 701745300 701396942 701118317 701096649 700879822 700741272 699997635 699520874
2467.8 699520874 698911514 698072281 697877655 697468567 697240448 697145004 697368011 696998062 696025391 695483093
2477.5 695483093 695355759 695407791 694570923 693797226 693279800 692871552 692691650 692567368 692539062 692156219
2487.1 692156219 691998978 691434021 690859375 690648575 690028076 689263153 688829041 688586349 687704086 687010727
2496.8 687010727 686636734 686559753 686309738 685683670 685339355 684551697 684088058 683690948 683287048 682783356
2506.4 682783356 682014236 681895905 681662827 681326218 680975037 680807343 680267715 679611511 679287338 678639908
2516.1 678639908 678283463 677516022 676893234 676853638 677153091 676989059 675882721 675536652 675368195 675070267
2525.7 675070267 674445267 673865662 673468628 672787552 672613144 672175751 671707764 671485596 671707840 671665421
2535.4 671665421 671071777 670855331 670056000 669253922 668773422 668471298 668026352 667613831 667459335 666863556
2545 666863556 666672974 666485596 665994415 665160522 664725418 664718781 664044418 663726120 663530426 662978439
2554.6 662978439 662145157 661945572 661866455 661074905 660784225 660528488 660131149 659794312 659871674 659490967
2564.3 659490967 658821182 658619080 657690887 657197876 656892853 656420746 656280899 655969391 655410614 654791107
2573.9 654791107 654549255 654054718 653865967 653894119 653733597 653193054 652280579 651978531 651453171 651088409
2583.6 651088409 650783997 650348511 650066147 649449463 649082870 648840027 648601990 647921066 647466431 647460480
2593.2 647460480 647119980 646551895 645736618 645470047 645188751 644592209 644064636 643872604 643717270 642949600
2602.9 642949600 642469025 642002945 641446075 640808029 640189056 639913712 639617424 639251328 638799362 638583374
2612.5 638583374 637835159 636919823 636419907 636134033 635896416 635023041 634478302 634071884 633406181 632807312
2622.1 632807312 632051010 631165314 630610657 630739899 630690536 630465851 629939651 629176064 628323402 627779922
2631.8 627779922 627577286 626428642 625783310 625803642 625573349 625080833 624247742 623613243 622966270 622851791
2641.4 622851791 622714729 622201576 621468391 620585022 620287781 619927101 619411583 618820457 618470535 617969475
2651.1 617969475 617239151 616992950 616472549 616019402 615530815 614844360 614604225 614380264 613772278 613420410
2660.7 613420410 613280983 612699127 612383003 611971283 611252670 610736008 610372925 610195427 610012474 609885597
2670.4 609885597 609511261 609050713 608725243 608625488 608301849 607632446 607235565 606727333 606430283 605907173
2680 605907173 605350151 605156975 604702835 604304886 603852348 603874245 603873177 603256493 602397423 601575928
2689.6 601575928 601285820 600976028 600637932 600351830 600047226 599577217 599392891 599629173 599324570 598779640
2699.3 598779640 598147736 597828903 597632980 597227325 596781845 596241989 596072350 595553780 594918137 594941826
2708.9 594941826 595020409 594450760 593824234 593539047 592966805 592767296 592633591 592185974 591688690 591513062
2718.6 591513062 591756592 591520462 591402168 591135559 590318146 589681358 589398155 589210052 588937988 589014130
2728.2 589014130 588816376 588273087 588032570 588020821 587963295 587636871 587278442 586970444 586660576 586443367
2737.9 586443367 586354980 585920105 585590057 585463829 585070839 584877777 584589462 584505234 584567184 584185181
2747.5 584185181 583399391 582812271 582945099 583090782 583052330 582481308 581796417 581529999 581400185 581384697
2757.2 581384697 581260910 580980873 580471687 580420456 580032501 579361191 579404526 579125481 578614120 578090744
2766.8 578090744 578050270 578141289 577900887 577491951 576885757 576682053 576132164 575917091 575999947 575425758
2776.4 575425758 574727135 573989105 573360825 572817650 572697067 572306480 571891479 571608124 570998840 570936775
2786.1 570936775 570636101 570291939 569767151 568983574 568585358 567705231 566838760 566478844 566306458 565934639
2795.7 565934639 565455132 564894333 564224358 563416519 562422371 561908188 561245117 560418816 559916687 559641342
2805.4 559641342 559243507 558363342 557570839 556780510 556149483 555513229 554702454 554117584 553505821 552615738
2815 552615738 551775246 551245461 550354843 549739952 549378777 548572578 547695274 546462669 545294762 544408875
2824.7 544408875 543609543 542773743 541806259 540884171 540161438 539481316 538576736 537611885 536577721
2833.3 536577721 535995789 534996376 533570213 532506523 530945740 529782600 528789291 527337570 525593414
2842 525593414 523774376 522177353 520163078 518197250 516240273 514532089 512923584 510851593 508855057
2850.7 508855057 507020836 505545273 504282951 503710327 503456497 503065453 502826614 502773514 502928619
2859.4 502928619 502518196 502065697 501316910 500663643 500515671 499767609 499190636 498452225 497342300
2868.1 497342300 496104927 494799767 493979759 493403244 493045197 492400551 491517029 490866013 490161324
2876.7 490161324 489223137 488317680 487484627 486720123 486152687 485453072 484507103 483281517 482392044
2885.4 482392044 481661797 480742264 479946518 478877792 477902069 477265053 476610909 475028038 473706970
2894.1 473706970 473504066 472627983 471560936 470729713 470315437 469716988 468650627 468125992 467263908
2902.8 467263908 466337128 465720062 465382462 464745102 463689232 463133965 462094879 460584106 459110489
2911.4 459110489 457887878 456806030 455395584 453736534 452108307 451179657 450075645 448542023
2919.2 448542023 447581177 446612473 445359612 444680634 443909378 442953186 442502174 441984520 442088089
2927.8 442088089 442278023 442676582 443117065 442179947 441939583 442328949 442753296 443481331 443684540 444085121
2937.5 444085121 445093803 446128845 446498833 446907845 447502289 448078232 448953438 449527359 450048103
2946.2 450048103 450818672 451938095 452901230 453282318 453658791 454275017 454881783 455405273 456024475
2954.8 456024475 456535759 457067795 457172508 457404251 458273773 458963852 459689255 460091057 460347900 460969963
2964.5 460969963 462090111 463244820 463953400 464697495 465396652 466183205 466617432 466910324 467569160
2973.2 467569160 468551712 469598885 470235519 470907402 471370316 472001152 472497482 472749557 473162422
2981.8 473162422 473007507 473078575 473446541 473884506 474074249 474186440 474392090 474377670 474645081 474413185
2991.5 474413185 474500427 474688416 474464607 474623413 474357300 474120483 473741112 473195229 472757454 472295380
3001.1 472295380 471809959 471089897 470621910 469995499 469493446 469138298 468407021 467639923 467013550 466547241
3010.8 466547241 466299324 465997581 465037804 464430466 463680420 462501183 462034073 461534958 461007080
3019.5 461007080 460327415 459586296 458935547 458203392 457399597 456367531 455746727 454928284 453824768
3028.1 453824768 453025856 452286263 451474991 450770073 450060234 449186592 448457375 447238655 446367645
3036.8 446367645 445909119 445006027 444555855 443861847 442706070 441614189 440645866 439764061 438781471
3045.5 438781471 437928085 437222404 436451836 435422325 434679947 433804016 432749329 432157936 431456604
3054.2 431456604 430365028 429051285 428444519 428105125 427018089 425713081 424591141 423794632 423568268
3062.9 423568268 423108101 421758614 421029243 420555763 419658661 418580475 417384644 417056160 416449051
3071.5 416449051 415723267 415257568 414143562 413082275 412159615 411714592 411245422 410362129 409718704
3080.2 409718704 409051399 408113594 407389565 407164421 406545181 405522270 404384499 403454781 402871475
3088.9 402871475 402208939 401432343 400461082 399947510 399525146 398958969 398254776 397097130 396448593
3097.6 396448593 395876160 394931259 393927879 393012009 392095375 391183052 390745430 390504913 390127678
3106.2 390127678 389327888 388649635 388056259 386859627 385849915 384929924 383599091 382424812 381863785
3114.9 381863785 381504593 380701065 379860497 379367104 378607635 377835464 377196922 376048546 375166168
3123.6 375166168 374287376 372993584 372051315 371464577 371028328 370445137 369944687 369326553 368331985
3132.3 368331985 367067528 365671043 364872093 364425812 363850937 363286667 362851791 361882858 360521698
3141 360521698 359516487 358496819 357357407 356347809 355968819 355187225 353788872 353181801 352851257
3149.6 352851257 352355232 351720581 351005630 349996490 349111176 348465958 347420311 346593552 345671577
3158.3 345671577 344643135 343910866 343240852 342196159 341194763 340599403 339444504 338819008 338320007
3167 338320007 337251511 336473312 335459366 334464760 333311539 332658310 332620049 331897545 330801315
3175.7 330801315 329754410 328865013 327897453 326903229 326054115 325588531 325255356 324505577 323475113
3184.4 323475113 322417984 321694908 320895348 320294533 319753609 318953991 318322525 317296677 316189976
3193 316189976 315290089 314658203 314240913 313631229 312857265 311928329 310990677 310175323 309825077 309438038
3202.7 309438038 308860855 307873344 306511307 305952358 305669365 305228271 304693623 304243679 303446503
3211.4 303446503 302297363 302011395 301996441 301661720 300663109 299514103 298673496 297553234 296806488
3220 296806488 296581707 296524105 296095409 295559464 294837589 293440361 292564602 292475414 292367077 291733112
3229.7 291733112 291134605 290665646 289971733 289178047 288382511 288048973 287583370 287038765 286585026 285977974
3239.3 285977974 285477619 284799309 283970776 283131027 282892876 282619934 282121506 282131023 281495380 280849743
3249 280849743 280754223 280282803 279553165 278718510 277924824 277605743 277417889 276522846 275610161 275230236
3258.6 275230236 275023003 274972706 274477272 273589745 272897530 272385998 272498283 272783451 272003555 270773487
3268.3 270773487 270064259 270041924 269911327 269278107 269135208 268885098 268303757 267946510 267387314 266983643
3277.9 266983643 266822681 266467171 265883427 265355911 265210800 265440578 265232239 264421768 263815422 263508835
3287.5 263508835 263177986 262449017 262120209 262353268 261971016 261129780 260675850 260903206 261060448 260745754
3297.2 260745754 259963989 259374695 259085560 258421879 258449936 258520756 258076630 257988281 257976971 257906837
3306.8 257906837 257248173 256464119 255971031 255344448 254948196 254727097 254514484 254254284 253755455 253167095
3316.5 253167095 252961655 252720737 251999340 251325569 251213856 251200905 250585747 250106144 249633694 248842468
3326.1 248842468 248142471 247401657 247049103 246906853 246394024 245515518 244856281 244312267 243552570 243336830
3335.8 243336830 242938385 241849098 241207771 241042862 240451221 239655895 239320335 239109230 238705311
3344.4 238705311 238105087 237760296 237347870 236610699 236388607 236412125 236032772 235383739 235209846 235222912
3354.1 235222912 234785061 234447956 234316254 234240303 233812885 232862339 232339783 232633781 232969360 232756214
3363.7 232756214 232376289 232060509 231456814 231101475 231157589 231140823 231289177 230725574 229992485 229999828
3373.4 229999828 229536572 229405975 229918518 230025635 229524174 228863201 228567505 228542633 228843498 228677216
3383 228677216 228435230 228450127 228127785 227893295 227382450 227349033 227700214 227474251 227531109 228091717
3392.7 228091717 228436947 228022537 227588043 227549210 226974506 226432858 227083683 227180252 226168671 226154404
3402.3 226154404 226627197 226683960 226746731 227100353 227302876 227187233 227317162 227392921 227698650 227939930
3412 227939930 227886829 227811222 227738705 228013973 228267860 228679256 228772011 228949547 229471722 229007511 228878765
3422.6 228878765 229438839 229969044 230371265 230542011 231081429 231640854 231689472 231815987 232192383 232377682
3432.2 232377682 232574139 232927265 233048763 232970657 233748837 234734001 234851646 235171452 235454655 235876465
3441.8 235876465 236374474 236520348 236899300 237376995 238408318 238977757 239224586 239701996 240116177
3450.5 240116177 240990868 241463318 242162323 242813225 242949276 243456421 244079628 244973297 245874729 246600456
3460.2 246600456 247089729 247470589 247739048 248382130 249413776 249882736 250463428 251150475 252141171
3468.8 252141171 252979889 253146915 253703995 254542885 255651436 256624641 257535038 258485565 259193001
3477.5 259193001 259852161 260467300 261342258 262115707 262741222 263309975 264119205 265281086 266559753
3486.2 266559753 267633038 268388653 269303513 269581871 270284672 271696682 272756367 273889599 274603539
3494.9 274603539 275457058 276343651 277031956 277916489 278880596 280188313 281465797 282398643 282807808
3503.6 282807808 283538170 284518642 285428848 286502151 287977467 289217129 289457722 290768337 292065258
3512.2 292065258 292981358 294308510 295131721 296270428 297470150 298609276 299591103 300369663 301256657
3520.9 301256657 302247505 303468437 304572735 306371899 308203869 309601784 310450020 311151695 312280293
3529.6 312280293 313419971 315032463 316500950 318122559 319289494 319830952 320620461 321677017 323484802
3538.3 323484802 324915771 326197662 327637215 329153824 330710144 332145462 333430824 334482956
3546 334482956 336459694 337996292 339875107 341686783 343429146 345330391 345763741 347866516 349591141
3554.7 349591141 351238899 353335114 354362144 355956192 357213593 359255791 360966454 363145866
3562.4 363145866 364951935 365802956 369352455 370393524 371065102 372916031 373775482 376536789 378922653
3571.1 378922653 381306267 383238449 385221062 386631927 388483734 391068802 392631340 395574379
3578.8 395574379 398108597 400048523 401882362 403832741 406050949 407770348 411739616 413885651
3586.5 413885651 413862572 416157722 417131577 420060463 423208046 425874023 427624474 429505196 432359543
3595.2 432359543 433088913 436596107 440253334 441680412 445368881 447419815 448580246 451227684
3602.9 451227684 453522301 456270981 459524422 462718697 463710175 466491356 467688560 468643570 474860306
3611.6 474860306 477024765 477415924 481382828 482229996 485882568 489123230 490937920 494323730 495701752
3620.3 495701752 498015862 501648560 505327339 508166542 511502953 514577408 517516937 523851318
3628 523851318 525907555 519468880 523088226 528340759 533218498 535603790 536798401 540239143 544196014
3636.6 544196014 547219009 548671455 551018410 554266205 557061081 559410629 561971779 565289650
3644.4 565289650 568857422 573568764 574354553 574172401 579854469 581114693 580045929 580319862 585813370
3653 585813370 590993042 594726753 599494209 594835243 596869049 602350616 604792824 607426224 608982544
3661.7 608982544 611888084 613452797 615222855 617514725 618316689 622027168 623317528 623193550 624540825
3670.4 624540825 621325531 625135918 632457314 640162582 638021431 623989296 628182449 635634232
3678.1 635634232 640230484 639121017 640607986 643377838 644726562 645612106 646083374 647406082 651212158
3686.8 651212158 656382294 649064407 647374649 654654083 649334869 649471817 655085297 656793442
3694.5 656793442 658424988 658592758 658633270 660158768 660432587 662890015 665797501 661139374 659670868
3703.2 659670868 663900299 665472946 666124039 666999664 669144669 671965103 667205276 670773697 673077011
3711.9 673077011 662147369 666668472 671309738 672749634 673635788 674948959 675695496 672716599
3719.6 672716599 673763809 678126144 675700302 673702087 677807617 677910156 676109695 674085922
3727.3 674085922 675145416 678538589 679562988 684340363 683451309 677119751 682668381 682414322 676973190
3736 676973190 677949142 679118195 679595795 681616211 683555908 680999451 684572449 694136887 683114090
3744.7 683114090 670422897 679332428 683862610 688444824 686074295 678579865 686997757 681778564
3752.4 681778564 677036743 682841415 687200623 690422440 686496506 687985535 691096573 684028931
3760.1 684028931 684132462 688535690 689950180 689941864 692251892 690074539 686934738 689806137 693522568
3768.8 693522568 693203506 685697784 687896805 691269989 691539230 691998444 691645279 692468872 692764359
3777.4 692764359 695137253 694946213 688538284 690971756 693113785 693685150 694756165 692621994 692681503
3786.1 692681503 694047775 694244385 694600677 694819260 694756317 694840546 695338135 695541611 696921539 697933350
3795.8 697933350 693315659 691362152 694058304 697602997 701488571 695034027 688025894 692382202
3803.5 692382202 695449219 698670654 701516571 692894974 690464783 695275040 696899033 697209167
3811.2 697209167 697736053 697590561 698832169 702899551 700026093 689280777 694452820 699476929
3818.9 699476929 702362900 702041779 688866348 691302643 695693054 697597427 699283447 698581924
3826.6 698581924 695931396 696415634 698539581 701054382 701270218 695373154 698205185 703191757 697937088
3835.3 697937088 697904282 702628937 694568329 692313385 698207932 694921951 695298920 700508194 698858261
3844 698858261 696536484 698423004 699258118 699097061 700179749 699842911 701557999 705742874 700780106
3852.7 700780106 700972748 689486084 691084366 699466629 698441467 697125931 698497162 700583267
3860.4 700583267 702818451 698710709 698841324 702623901 699098740 696145096 699236221 703279419
3868.1 703279419 707011185 700020142 692535400 696395035 701524429 703797836 696272354 696778870
3875.8 696778870 700469894 700155029 701145325 703488770 698400955 694098892 699505692 701211548 702416992
3884.5 702416992 705630341 695533829 696384048 699777145 700940552 704258575 701985703 695425186
3892.2 695425186 696761932 699049988 698777313 700494537 701152725 702905121 704398117 696967850 701080017
3900.9 701080017 702226868 697050247 699658203 696782684 695656891 696793137 698599625 700596848
3908.6 700596848 700597763 700534515 700285263 700725327 700566864 700012589 700765305 702213287 699491577 697203903
3918.2 697203903 700937271 700107040 696958618 698932495 700257034 700527573 698846664 697526855 698993759
3926.9 698993759 700148392 700988464 700186005 699152298 700081787 698656464 697538071 698905411 699595947
3935.6 699595947 699966125 700184708 699722137 699217834 699395828 700831833 701490402 698167953 697143860
3944.3 697143860 698824463 699897461 700965652 699993057 699961395 699378204 697588425 699124603 699125061
3953 699125061 698756332 699141693 699046021 699065399 698477936 698780975 698407974 698774567 698931503 698258362
3962.6 698258362 698974915 698686676 699035187 699210129 698534164 698650284 698536224 698861237 699688568 699377365
3972.2 699377365 698350143 698566055 698728104 698721466 698813400 698787689 699144821 698678818 698138580 698117905
3981.9 698117905 698650818 699241104 699260101 698718109 698270721 698723679 698938141 698984451 698376236 698058624
3991.5 698058624 698501511 698892365 699322433 698660965 698711777 699236221 699281311 698898087 698512421
4000.2 698512421
##END=$$ End of the data block
