##TITLE=$$ Begin of the data block
##JCAMP-DX=5.00 $$ ACD/SpecManager v 10.08
##SPECTROMETER/DATA SYSTEM=Varian
##DATE=15 Jan 2013 10:11:52
##DATA TYPE=INFRARED SPECTRUM
##DATA CLASS=XYDATA
##ORIGIN=
##OWNER=
##NPOINTS=3735
##FIRSTX=399.26403809
##LASTX=4000.35498047
##MAXX=4000.35498047
##MINX=399.26403809
##MAXY=67.61714935
##MINY=14.04380703
##XFACTOR=1.0000000000
##YFACTOR=0.000000100000000
##FIRSTY=33.26356888
##DELTAX=0.96440572
##XUNITS=1/CM
##YUNITS=TRANSMITTANCE
##XYDATA=(X++(Y..Y))
$$ plain form
399.3 332635689 314907207 307061424 311988316 314437828 319012585 314020290 309977112 309724941
407 309724941 304838676 302290802 305493908 305706902 304515057 311967602 315742302 313389244 309395752
415.7 309395752 306577301 310135479 320183220 317597084 308142567 311180592 314251404 315467281
423.4 315467281 312020683 305822906 308371582 308003902 306834183 305724792 304241066 307260990 310125237
432.1 310125237 312449646 310534077 309483204 308728676 306017075 305610294 304406414 305199699 301641960
440.7 301641960 299520931 306482868 307252026 306562958 309187164 311002769 306607380 302731438 307679386
449.4 307679386 309671841 306317081 306777458 308070488 310649757 312285328 310866737 313974895 314622746
458.1 314622746 307390995 303237267 299815273 297340221 297647457 300655651 303469830 302500534 300230427
$$ packed form
399.3C32635689j7728482p845783M926892K449512M574757m992295m043178k52171
407C09724941m886265k547874L203106K12994j191845P452545L774700k353058l993492
415.7C09395752k818451L558178J0047741k586136r454517L038025L070812J215877
423.4C15467281l446598o197777K548676l67680j169719j109391j483726L019924K864247
432.1C10125237K324409j915569j050873p54528k711601m06781j203880P93285l557739
440.7C01641960k121029O961937P69158o89068K624206J815605m395389l875942M947948
449.4C07679386J992455l354760M60377J293030K579269J635571j418591L108158O47851
458.1C14622746p231751m153728l421994k475052L07236L008194K814179r69296k270107
$$ plain form
466.8 300230427 301999588 303004227 302506638 302447224 299562607 295132904 294060802 297406521 300022678
475.5 300022678 298331127 295992374 295261612 292017422 288336124 291500854 294620361 296753960 297590485
484.1 297590485 294643364 293217678 292230988 293126583 293638420 293392220 291618996 288349037 289600677
492.8 289600677 291250076 289940605 287132587 286935272 287189846 287457943 289667759 290782337 291874027
501.5 291874027 289719238 287244644 287829762 287026730 285516109 285924282 286100159 284069042 284974670
510.2 284974670 286503830 286052837 285254059 282551975 281944981 281656284 279557133 279902401 280173435
518.9 280173435 280041981 280794411 281053486 281859283 281227417 279767532 280564461 280225868 277947464
527.5 277947464 275023613 274541645 276776009 278567047 279827080 279087105 278459969 276910686 274559021
$$ packed form
466.8C00230427J769161J004639m97589n9414k884617m429703j072102L345719K616157
475.5C00022678j691551k338753p30762l244190l681298L164730L119507K133599Q36525
484.1B97590485k947121j425686r86690Q95595N11837k46200j773224l269959J251640
492.8B89600677J649399j309471k808018j97315K54574K68097K209816J114578J091690
501.5B91874027k154789k474594N85118q03032j510621M08173J75877k031117R05628
510.2B84974670J529160m50993p98778k702084o06994k88697k099151L45268K71034
518.9B80173435j31454P52430K59075Q05797o31866j459885P96929l38593k278404
527.5B77947464k923851m81968K234364J791038J260033p39975o27136j549283k351665
$$ plain form
536.2 274559021 273207645 272396240 274572735 274254284 272388611 273500328 275376225 275579624 273193035
544.9 273193035 272672920 272516060 270863342 269030762 267855682 268160019 267207317 266522980 266987839
553.6 266987839 267829361 267754669 267307663 267754173 266565723 265323124 264924831 264029140 263795300 264481144
563.2 264481144 264732475 264841156 265883999 267334385 267165623 266111374 266044769 265547791 264761486
571.9 264761486 263602715 262508984 262794781 263460026 264142284 263896141 263922520 263289642 262853947 263514748
581.5 263514748 262228737 262056847 263188725 263775272 264157333 264462509 264018135 263473129 264769592
590.2 264769592 265249004 265285549 265821857 266105404 265778866 265314770 265991364 265438652 265468330 265790806
599.9 265790806 265770226 266708622 265650616 264936447 264891911 263308830 261477814 260697670 260716190 259761620
$$ packed form
536.2B74559021j351376q11405K176495l18451j865673J111717J875897K03399k386589
544.9B73193035n20115j56860j652718j832580j175080L04337r52702o84337M64859
553.6B66987839Q41522p4692m47006M46510j188450j242599l98293q95691k33840O85844
563.2B64481144K51331J08681J042843J450386j68762j054249o6605m96978p86305
571.9B64761486j158771j093731K85797O65245O82258k46143K6379o32878m35695O60801
581.5B63514748j286011j71890J131878N86547L82061L05176m44374n45006J296463
590.2B64769592M79412L6545N36308K83547l26538m64096O76594n52712K9678L22476
599.9B65790806k0580R38396j058006p14169m4536j583081j831016p80144J8520r54570
$$ plain form
609.5 259761620 258908558 258651752 258809814 259630280 259860935 259020519 258156509 256984749 255764122
618.2 255764122 256183357 257132111 258420029 259616852 260362358 261530132 262670765 263498936 264540005
626.9 264540005 264829540 263713360 264031639 266134186 268382759 270384579 272159729 273837280 274938278
635.5 274938278 275851326 276532364 277738132 278841534 279583359 279985485 278904209 279927616 282381535
644.2 282381535 283654366 285243797 286405125 286781063 286882267 287831249 289389591 290118618 290555325
652.9 290555325 290647907 290703011 291552887 291886883 290848637 289948406 290089359 290177402 290329838 290798035
662.5 290798035 290072899 288411751 287733383 288514118 289408436 289791832 292537422 293742542 293390713
671.2 293390713 293480396 293644314 293579483 293515835 294059258 296047077 297986088 299586391 301126347 301869812
$$ packed form
609.5B59761620q53062k56806J58062Q20466K30655q40416q64010j171760j220627
618.2B55764122M19235R48754J287918J196823P45506J167774J140633Q28171J041069
626.9B64540005K89535j116180L18279K102547K248573K001820J775150J677551J100998
635.5B74938278R13048O81038J205768J103402P41825M02126j081276J023407K453919
644.2B82381535J272831J589431J161328L75938J01204R48982J558342P29027M36707
652.9B90555325R2582N5104Q49876L33996j038246r00231J40953Q8043J52436M68197
662.5B90798035p25136j661148o78368P80735Q94318L83396K745590J205120l51829
671.2B93390713Q9683J63918o4831o3648N43423J987819J939011J600303J539956P43465
$$ plain form
680.9 301869812 302604599 304360847 305456104 305799465 306494656 306671314 306617718 306755524 308162460
689.6 308162460 310141335 311018181 311999149 313247070 314685040 315958042 315652199 314497280 314565105
698.2 314565105 315056648 315667534 317786827 318792572 318895950 320252914 321777496 322944489 322942352
706.9 322942352 323240929 324399109 324736176 324977875 325133896 325695839 326869202 327297821 327790680
715.6 327790680 328867416 329518089 330393448 331744804 332239189 331757164 331597786 332878380 333702965
724.3 333702965 334261780 336265488 337274284 338482437 339776115 340104065 341700478 342617722 342542725
733 342542725 342587471 343335571 344621811 345289574 346128883 346336975 346609459 347503014 348297462 348591766
742.6 348591766 348438034 349023361 349127655 349674110 351147194 351847267 352299500 353051414 354340858
$$ packed form
680.9C01869812P34787J756248J095257L43361O95191J76658n3596J37806J406936
689.6C08162460J978875Q76846R80968J247921J437970J273002l05843j154919O7825
698.2C14565105M91543O10886K119293J005745J03378J356964J524582J166993k137
706.9C22942352K98577J158180L37067K41699J56021N61943J173363M28619M92859
715.6C27790680J076736O50673Q75359J351356M94385m82025j59378J280594Q24585
724.3C33702965N58815K003708J008796J208153J293678L27950J596413R17244p4997
733C42542725M4746P48100J286240O67763Q39309K08092K72484Q93555P94448K94304
742.6C48591766j53732N85327J04294N46455J473084P00073M52233P51914J289444
$$ plain form
751.3 354340858 356127586 357212639 356728172 357163124 358227615 358560905 359517021 360632095 361796684
760 361796684 362287560 363487167 366392632 368877640 370085907 370635872 370957260 369915047 369297981
768.6 369297981 369252396 369308052 370043755 371029396 372243080 372384644 373190613 373392639 372696381 372230835
778.3 372230835 370781822 370800285 370778770 370717659 371764069 372945709 374713821 376456833 377258835
787 377258835 376552086 376233940 375524788 374648476 374440536 374168396 374827652 375673981 376923103 377501755
796.6 377501755 377052650 375938759 375202065 374786301 372460213 370984306 370433121 369487648 368296471
805.3 368296471 367028313 365536728 363797226 363283005 362363930 360591240 358690414 357142334 355166435
814 355166435 352908134 352048264 351475601 350915260 350015793 350300255 351660423 352414742 353571167 354902954
$$ packed form
751.3C54340858J786728J085053m84467M34952J064491L33290R56116J115074J164589
760C61796684M90876J199607K905465K485008J208267N49965L21388j042213o17066
768.6C69297981m5585N5656P35703R85641J213684J41564Q05969K02026o96258m65546
778.3C72230835j449013J8463k1515o1111J046410J181640J768112J743012Q02002
787C77258835p06749l18146p09152q76312k07940k72140O59256Q46329J249122N78652
796.6C77501755m49105j113891p36694m15764k326088j475907n51185r45473j191177
805.3C68296471j268158j491585j739502n14221r19075j772690j900826j548080j975899
814C55166435k258301q59870n72663n60341q99467K84462J360168P54319J156425J331787
$$ plain form
823.6 354902954 356615257 358205795 360651131 363802338 367034378 370989456 373925514 376724663
831.3 376724663 379948044 383713188 386818695 389503632 392221375 393783531 395849037 397344131
839 397344131 399244537 401272087 403586540 406599884 408247452 409885902 410843887 411782532 412846069
847.7 412846069 414300919 414839592 414370804 415702515 417310143 419891548 422485313 424784813 426388817
856.4 426388817 427591705 429530983 430194931 430940781 431685638 433376236 434644012 435513878 436835861
865.1 436835861 436917534 437349586 436586151 435795975 434739265 432967682 430589905 427978554 426935997
873.8 426935997 425415230 424890213 424365387 424125748 423927956 422187157 421281471 420128632 418833847
882.4 418833847 416546440 415142860 415369492 414814568 414002266 412900162 413001785 413717308 414307976
$$ packed form
823.6C54902954J712303J590538K445336L151207L232040L955078K936058K799149
831.3C76724663L223381L765144L105507K684937K717743J562156K065506J495094
839C97344131J900406K027550K314453L013344J647568J638450R57985R38645J063537
847.7D12846069J454850N38673m68788J331711J607628K581405K593765K299500J604004
856.4D26388817J202888J939278O63948P45850P44857J690598J267776Q69866J321983
865.1D36835861Q1673M32052p63435p90176j056710j771583k377777k611351j042557
873.8D26935997j520767n25017n24826k39639j97792j740799r05686j152839j294785
882.4D18833847k287407j403580K26632n54924q12302j102104J01623P15523N90668
$$ plain form
891.1 414307976 413867645 412210884 410898323 410074387 409715996 409250755 409375648 409492264 409272690
899.8 409272690 408756180 408470993 407880135 406918526 408263741 410006676 412138977 415124893 417749748
908.5 417749748 419623756 420938835 422596092 423442192 424880753 424719734 422357521 419988441 417995224
917.2 417995224 416424789 413642120 411605988 409211311 406683655 404360046 401392822 399441147
924.9 399441147 396719666 393405991 389468155 385363998 381430931 378104248 375972443 373801270
932.6 373801270 372255707 370522919 369042740 367468567 365896797 365103035 363689613 362252960 359734879
941.3 359734879 357274971 355917168 354641838 353538551 352350044 351993179 351975403 351745872 351264725
949.9 351264725 350964622 350593872 349729042 349327888 348492584 347358894 345686646 343321419 341299667
$$ packed form
891.1D14307976m40331j656761j312561q23936l58391m65241J24893J16616k19574
899.8D09272690n16510k85187n90858r61609J345215J742935K132301K985916K624855
908.5D17749748J874008J315079J657257Q46100J438561j61019k362213k369080j993217
917.2D17995224j570435k782669k036132k394677k527656k323609k967224j951675
924.9C99441147k721481l313675l937836m104157l933067l326683k131805k171173
932.6C73801270j545563j732788j480179j574173j571770p93762j413422j436653k518081
941.3C59734879k459908j357803j275330j103287j188507l56865j7776k29531m81147
949.9C51264725l00103l70750q64830m01154q35304j133690j672248k365227k021752
$$ plain form
958.6 341299667 339488564 337500496 335263481 332989044 330489807 328427124 326766472 324850845
966.3 324850845 322859650 321626320 320720062 318526993 316206379 313586197 310296192 307682858 304749031
975 304749031 301326141 297969265 293952656 289323750 285254803 281992016 278350735 274172688 269311581
983.7 269311581 263839474 259179630 254658661 250165482 246132278 242780571 239982929 236468925
991.4 236468925 233437881 230756207 228413601 226199055 223751678 221483765 218946133 216984081
999.1 216984081 214258480 211531982 209762707 208351936 206563206 203583717 201798630 200264816
1006.8 200264816 198277035 196532669 195062923 193428974 191193485 189634132 188252335 187273788
1014.6 187273788 186016178 184485149 182636528 180426426 178807793 177060738 175345955 172754765
$$ packed form
958.6C41299667j811103j988068k237015k274437k499237k062683j660652j915627
966.3C24850845j991195j233330r06258k193069k320614k620182l290005k613334k933827
975C04749031l422890l356876m016609m628906m068947l262787l641281m178047m861107
983.7B69311581n472107m659844m520969m493179m033204l351707k797642l514004
991.4B36468925l031044k681674k342606k214546k447377k267913k537632j962052
999.1B16984081k725601k726498j769275j410771j788730k979489j785087j533814
1006.8B00264816j987781j744366j469746j633949k235489j559353j381797r78547
1014.6A87273788j257610j531029j848621k210102j618633j747055j714783k591190
$$ plain form
1022.3 172754765 170676880 169026985 167568111 166913567 166001587 165520763 164216595 163174191 161645851
1031 161645851 160588512 161159515 160710049 160529957 160725727 161824875 162866306 163774529 164858704
1039.6 164858704 166302586 168258038 168703423 169507713 170067959 170211506 170153885 169635620 169251595
1048.3 169251595 168240471 167404938 166318417 165878201 165145779 164188862 163145256 161862926 161614914
1057 161614914 160318222 159842720 160246296 161480961 163311481 164937153 166662922 167620926 168608208
1065.7 168608208 168535461 170127563 171846085 172546558 173754158 173951435 174988174 175486317 175996094
1074.4 175996094 175930595 176028156 176892071 176311035 176429195 176742229 177705441 178150749 178775425 179954510
1084 179954510 180195370 180710411 181393700 183171062 184116802 185378742 186845665 187724400 188607807
$$ packed form
1022.3A72754765k077885j649895j458874o54544r11980m80824j304168j042404j528340
1031A61645851j057339N71003m49466j80092J95770J099148J041431R08223J084175
1039.6A64858704J443882J955452M45385Q04290N60246J43547n7621n18265l84025
1048.3A69251595j011124q35533j086521m40216p32422r56917j043606j282330k48012
1057A61614914j296692m75502M03576J234665J830520J625672J725769R58004R87282
1065.7A68608208p2747J592102J718522P00473J207600J97277J036739M98143N09777
1074.4A75996094o5499R7561Q63915n81036J18160L13034R63212M45308O24676J179085
1084A79954510K40860N15041O83289J777362R45740J261940J466923Q78735Q83407
$$ plain form
1092.7 188607807 189111214 191057472 192102966 193258038 194018307 194547977 195702953 195867348 197421665
1101.4 197421665 198477859 199468880 200667915 201967411 203337307 203677425 205002193 205761185 206188450
1110 206188450 206223907 206616096 208131886 208992767 210166435 211118279 211539478 211957912 212530098 212396984
1119.7 212396984 212358246 212378426 211937618 212458515 212443771 212795124 213460350 214243565 215701675 217058659
1129.3 217058659 218841667 220681572 222739468 223650780 224630013 226615963 228373814 230173912 232306919
1138 232306919 234954491 236723595 238632870 240369930 241421700 242655869 243582420 244230595 244038296
1146.7 244038296 244079704 244234867 244515781 245373821 245610695 245512466 245310116 245311909 245145435 244990463
1156.3 244990463 244685116 243811588 242650242 241491394 241278934 241227665 241676884 242295666 243132839
$$ packed form
1092.7A88607807N03407J946258J045494J155072P60269N29670J154976J64395J554317
1101.4A97421665J056194R91021J199035J299496J369896L40118J324768P58992M27265
1110B06188450L5457L92189J515790Q60881J173668R51844M21199M18434N72186j33114
1119.7B12396984l8738K0180m40808N20897j4744L51353O65226P83215J458110J356984
1129.3B17058659J783008J839905K057896R11312R79233J985950J757851J800098K133007
1138B32306919K647572J769104J909275J737060J051770J234169R26551O48175j92299
1146.7B44038296M1408J55163K80914Q58040K36874r8229k02350J793j66474j54972
1156.3B44990463l05347q73528j161346j158848k12460n1269M49219O18782Q37173
$$ plain form
1165 243132839 244699097 246311207 248887672 251404381 253525791 255596466 258465099 261875992 264569778
1173.7 264569778 267464790 271070576 274871292 277627964 280043392 282835941 285343590 287467747
1181.4 287467747 290157299 292973728 294955959 296882057 298880844 301028099 302640381 304015102
1189.1 304015102 305182095 305374336 304981823 304450874 304235458 303986664 303894939 303546009 302927761 302457676
1198.8 302457676 301669617 300700893 299144440 297960052 297015648 295063839 293377934 292314320 291509190
1207.4 291509190 290948544 290632076 290444031 289932442 289343472 288820190 288309746 287335358 286172523
1216.1 286172523 285379047 284622116 284041538 283698673 283573418 283215504 282515392 281641502 280444870
1224.8 280444870 279490757 278510895 277388783 276759529 276056328 274971828 274430866 274307880 273816223
$$ packed form
1165B43132839J566258J612110K576465K516709K121410K070675K868633L410893K693786
1173.7B64569778K895012L605786L800716K756672K415428K792549K507649K124157
1181.4B87467747K689552K816429J982231J926098J998787K147255J612282J374721
1189.1C04015102J166993J92241l92513n30949k15416k48794r1725l48930o18248m70085
1198.8C02457676p88059r68724j556453j184388r44404j951809j685905j063614q05130
1207.4B91509190n60646l16468j88045n11589n88970n23282n10444r74388j162835
1216.1B86172523p93476p56931n80578l42865j25255l57914p00112q73890j196632
1224.8B80444870r54113r79862j122112o29254p03201j084500n40962j22986m91657
$$ plain form
1233.5 273816223 273468533 273496552 273290482 272346668 271363964 271121197 271365089 271267128 270746765 270778847
1243.1 270778847 270987606 271242332 271240444 270857010 270399990 269482365 268943005 268622074 268365955 268445950
1252.8 268445950 268476982 268397236 268519993 268871632 268440132 268256016 268510609 268590145 268784447 268829212
1262.4 268829212 268999157 269098301 269801197 270887146 271953316 272837296 273523445 274726086 275729637
1271.1 275729637 276716766 277524071 278370132 279129391 279754944 281000900 282299557 283701000 284833450
1279.8 284833450 285858154 286825447 288042965 289833412 291433086 292831383 294141159 295759926
1287.5 295759926 297098846 298421516 299826012 300864315 301822186 302568836 303372173 304252129 305156536
1296.2 305156536 305599689 306064796 306727428 307068806 307386513 307818241 308499641 309029846 309244080 308626175
$$ packed form
1233.5B73816223l47690K8019k06070r43814r82704k42767K43892r7961n20363L2082
1243.1B70778847K08759K54726j888l83434m57020r17625n39360l20931k56119P9995
1252.8B68445950L1032p9746J22757L51639m31500j84116K54593P9536J94302M4765
1262.4B68829212J69945R9144P02896J085949J066170Q83980O86149J202641J003551
1271.1B75729637R87129Q07305Q46061P59259O25553J245956J298657J401443J132450
1279.8B84833450J024704R67293J217518J790447J599674J398297J309776J618767
1287.5B95759926J338920J322670J404496J038303R57871P46650Q03337Q79956R04407
1296.2C05156536M43153M65107O62632L41378L17707M31728O81400N30205K14234o17905
$$ plain form
1305.8 308626175 308061142 307968464 307226944 306619282 306369781 305899124 305118484 304426594 304080429 304192772
1315.4 304192772 303956928 303539982 304005146 304118996 304825916 305707169 305987930 307091160 307992744
1324.1 307992744 308411922 308906231 309725647 310055714 309989719 309783955 308794327 307962780 307293587 306836243
1333.8 306836243 306322289 306015377 306227722 305981045 305893517 305972576 306557178 307402020 308083687 308491306
1343.4 308491306 308784924 309642544 310158386 310629520 311316719 312241993 312772141 312666245 312399788 311963024
1353.1 311963024 311817703 311125546 310534077 310183334 309866505 309775772 309367790 308937531 308628139 308779583
1362.7 308779583 308290005 308062649 307944450 307120514 306433353 305328979 304804440 304673901 304560432
1371.4 304560432 304759216 304892540 304858093 304817982 305579224 305673561 305328979 305124474 304941006 304481754
$$ packed form
1305.8C08626175n65033r2678p41520o07662k49501m70657p80640o91890l46165J12343
1315.4C04192772k35844m16946M65164J13850P06920Q81253K80761J103230R01584
1324.1C07992744M19178M94309Q19416L30067o5995k05764r89628q31547o69193m57344
1333.8C06836243n13954l06912K12345k46677q7528P9059N84602Q44842O81667M07619
1343.4C08491306K93618Q57620N15842M71134O87199R25274N30148j05896k66457m36764
1353.1C11963024j45321o92157n91469l50743l16829r0733m07982m30259l09392J51444
1362.7C08779583m89578k27356j18199q23936o87161j104374n24539j30539j13469
1371.4C04560432J98784J33324l4447m0111P61242R4337l44582k04505j83468m59252
$$ plain form
1381 304481754 303664570 303101921 302054596 301184654 300541248 299562645 297542591 296194458 295455818
1389.7 295455818 293799686 291938095 289938774 288687820 286641541 283424740 281850300 280082092
1397.4 280082092 278574829 275701504 273128395 271393566 269005985 267168026 265404015 262677517
1405.1 262677517 260195770 259187756 257868614 256032429 254626102 252837963 251930752 250667820
1412.8 250667820 249076977 247976704 246603699 245941124 245089874 244680309 243152390 243274307 244222298
1421.5 244222298 243762054 244063301 243780613 244673977 245748310 245528011 246197243 247255974 248637180
1430.2 248637180 249039650 250906067 252720184 253753815 255477161 256472607 258904495 260537853 262514095
1438.9 262514095 264181957 266111774 268005638 269267349 271274223 272437325 274676247 276277523
$$ packed form
1381C04481754q17184n62649j047325q69942o43406r78603k020054j348133p38640
1389.7B95455818j656132j861591j999321j250954k046279l216801j574440j768208
1397.4B80082092j507263k873325k573109j734829k387581j837959j764011k726498
1405.1B62677517k481747j008014j319142j836185j406327j788139r07211j262932
1412.8B50667820j590843j100273j373005o62575q51250m09565j527919J21917R47991
1421.5B44222298m60244L01247k82688Q93364J074333k20299O69232J058731J381206
1430.2B48637180M02470J866417J814117J033631J723346R95446K431888J633358J976242
1438.9B62514095J667862J929817J893864J261711K006874J163102K238922J601276
$$ plain form
1446.6 276277523 277896652 279773140 280857754 282724037 283712807 285669327 286860619 288749313
1454.3 288749313 290874233 291826420 294050674 295404701 299761906 301234093 303515034 305535412
1462 305535412 307396603 310150414 310905418 313649597 315795155 318966331 321950951 324858322 328298340
1470.7 328298340 330036240 334047318 337292862 341167030 344329338 346920319 350342522 353223495
1478.4 353223495 356174622 358527336 360901909 362795372 364236984 365497932 366830711 368381615
1486.1 368381615 368715439 369138184 370464630 370578766 370466766 371109352 371653938 370878563 369548988
1494.8 369548988 368155022 363704376 363448296 362203293 359762344 359074097 358056335 357526741 356568184
1503.5 356568184 356517220 355994492 351955872 349034729 349870071 350003128 348602753 349422913 348514099
$$ packed form
1446.6B76277523J619129J876488J084614J866283R88770J956520J191292J888694
1454.3B88749313K124920R52187K224254J354027M357205J472187K280941K020378
1462C05535412J861191K753811P55004K744179K145558L171176K984620K907371L440018
1470.7C28298340J737900M011078L245544L874168L162308K590981L422203K880973
1478.4C53223495K951127K352714K374573J893463J441612J260948J332779J550904
1486.1C68381615L33824M22745J326446J14136j12000O42586N44586p75375j329575
1494.8C69548988j393966m450646k56080j245003k440949o88247j017762n29594r58557
1503.5C56568184n0964n22728m038620k921143Q35342J33057j400375Q20160r08814
$$ plain form
1512.2 348514099 347054749 347029266 346127968 345310555 343358536 342444344 342990952 343918037 341945572
1520.8 341945572 338911171 340263786 341182480 342728806 342718010 343285522 343909683 343796501 343866959
1529.5 343866959 344146690 344453735 344187737 344351730 342566261 343412819 344110374 344495430 346127052
1538.2 346127052 345118027 344789238 343936386 343950195 343148384 343920975 345033150 343755569 344967117
1546.9 344967117 344913406 345271912 345693283 345192642 346101151 346596298 347239571 344622841 344882927 345910835
1556.5 345910835 346296158 345667953 342110786 343283310 341510582 341904182 340624390 339178467 336369896
1565.2 336369896 333681564 332553940 330040054 329422112 322703629 320040207 318047562 314768467
1572.9 314768467 311923218 308245544 305821781 294099503 292651062 289476585 285162792 281347942
$$ packed form
1512.2C48514099j459350k5483r01298q17413j952019r14192N46608R27085j972465
1520.8C41945572l034401J352615R18694J546326j0796N67512O24161j13182P0458
1529.5C43866959K79731L07045k65998J63993j785469Q46558O97555L85056J631622
1538.2C46127052j009025l28789q52852J3809q01811P72591J112175j277581J211548
1546.9C44967117n3711L58506M21371n00641R08509M95147O43273k616730K60086J027908
1556.5C45910835L85323o28205l557167J172524j772728L93600j279792j445923k808571
1565.2C36369896k688332j127624k513886o17942o718483k663422j992645l279095
1572.9C14768467k845249l677674k423763j1722278j448441l174477m313793l814850
$$ plain form
1580.6 281347942 276193886 272694664 267369175 264163761 258958282 255053921 251199818 246148663
1588.4 246148663 242891846 236890354 234114933 229513512 226563225 223193760 218993225 216706905
1596.1 216706905 212231979 210540409 206518936 204528408 201477432 198629646 197119064 193788910
1603.8 193788910 193279896 190470562 189789791 187242985 186027737 185066128 182789249 183129711 180696392
1612.5 180696392 180985832 179349022 179595890 179750271 175907269 177955532 176880016 177836380 176608334
1621.1 176608334 177812576 177945328 176046295 177304420 177059994 179126244 177584648 178764477 179349976
1629.8 179349976 180191021 181538448 181318150 183108101 182844601 185266800 183490276 185551033 186646233
1638.5 186646233 186988297 188925972 188894176 191257210 191609764 193423080 194695816 194605293 197914333
$$ packed form
1580.6B81347942n154056l499222n325489l205414n205479l904361l854103n051155
1588.4B46148663l256817o001492k775421m601421k950287l369465m200535k286320
1596.1B16706905m474926j691570m021473j990528l050976k847786j510582l330154
1603.8A93788910n09014k809334o80771k546806j215248r61609k276879L40462k433319
1612.5A80696392K89440j636810K46868J54381l843002K048263j075516R56364j228046
1621.1A76608334J204242J32752j899033J258125k44426K066250j541596J179829N85499
1629.8A79349976Q41045J347427k20298J789951k63500K422199j776524K060757J095200
1638.5A86646233L42064J937675l1796K363034L52554J813316J272736r0523L309040
$$ plain form
1647.2 197914333 196801319 199389515 199565849 202090206 203643837 202519531 205651054 205129032 209063873
1655.9 209063873 209967480 212124882 213231239 215101986 217083435 218540554 221562290 221877022 225103416
1664.5 225103416 226777515 229484921 232091370 234586582 238130417 238663406 242709827 244096394
1672.3 244096394 247964859 251083012 253081989 257386303 261052513 265568771 267916851 272380543
1680 272380543 275614700 279336472 283712044 285835609 293045616 294200268 299966068 304380264 309080143
1688.6 309080143 313687191 317628498 322870636 327223053 332519073 337434692 343049965 346108284
1696.4 346108284 351655273 357926865 362928200 368692665 370008430 376872635 382071724 386680298
1704.1 386680298 390864258 393909187 396864891 400575294 405302467 408520889 411827888 415150414
$$ packed form
1647.2A97914333j113014K588196J76334K524357J553631j124306L131523n22022L934841
1655.9B09063873R03607K157402J106357J870747J981449J457119L021736L14732L226394
1664.5B25103416J674099K707406K606449K495212L543835N32989M046421J386567
1672.3B44096394L868465L118153J998977M304314L666210M516258K348080M463692
1680B72380543L234157L721772M375572K123565P210007J154652N765800M414196M699879
1688.6C09080143M607048L941307N242138M352417N296020M915619N615273L058319
1696.4C46108284N546989O271592N001335N764465J315765O864205N199089M608574
1704.1C86680298M183960L044929K955704L710403M727173L218422L306999L322526
$$ plain form
1711.8 415150414 418006859 420889359 421857224 423530273 426867294 429497757 426481209 429348068
1719.5 429348068 433090019 435329552 437346878 438882103 440532913 442049065 443629646 445143852
1727.2 445143852 446740646 449006615 449297028 450404968 454003754 457765503 457516708 453902206 458817101
1735.9 458817101 463208466 465841484 469161186 470766907 470455055 474916916 478774223 480862923
1743.6 480862923 484077911 488462067 493315201 497068901 500989037 504884415 510361328 513516693
1751.3 513516693 516021881 522246170 526592827 531278267 535831604 537615089 541388969 545638466
1759 545638466 549813271 554275284 554665070 555858727 560287170 563146973 565566292 568734245 571477623
1767.7 571477623 571031914 573986702 578770866 580154037 579513359 578702126 583046570 585570908 585497704
$$ packed form
1711.8D15150414K856445K882500R67865J673049L337021K630463l016548K866859
1719.5D29348068L741951K239533K017326J535225J650810J516152J580581J514206
1727.2D45143852J596794K265969K90413J107940L598786L761749k48795l614502M914895
1735.9D58817101M391365K633018L319702J605721l11852M461861L857307K088700
1743.6D80862923L214988M384156M853134L753700L920136L895378N476913L155365
1751.3E13516693K505188O224289M346657M685440M553337J783485L773880M249497
1759E45638466M174805M462013L89786J193657M428443K859803K419319L167953K743378
1767.7E71477623m45709K954788M784164J383171o40678q11233M344444K524338p3204
$$ plain form
1776.4 585497704 588348160 590016594 592623672 594383507 594546013 596406288 598523521 600391731
1784.1 600391731 600436363 601044502 602813530 604478645 605969620 608414040 610083199 611348953 610780373
1792.8 610780373 610127411 614158478 615602417 615409355 617137451 619294319 620216331 619493713 622088661
1801.5 622088661 622810898 623819656 626015053 627195740 628665504 629369659 629977379 630526314 631626778
1810.2 631626778 631192474 632111053 633946342 634680023 636283722 636976929 638324890 638486900 638884735
1818.8 638884735 640009003 640038071 641196976 641501465 643339157 644781876 642652283 643039322 645521393
1827.5 645521393 648193817 648044434 644654007 645616608 648170166 648409882 648826141 650013580 651205750
1836.2 651205750 651879730 651112061 652275772 652946167 653837357 654468307 655769958 656820526 651427383
$$ packed form
1776.4E85497704K850456J668434K607078J759835J62506J860275K117233J868210
1784.1F00391731M4632O08139J769028J665115J490975K444420J669159J265754n68580
1792.8F10780373o52962M031067J443939j93062J728096K156868R22012p22618K594948
1801.5F22088661P22237J008758K195397J180687J469764P04155O07720N48935J100464
1810.2F31626778m34304R18579J835289P33681J603699O93207J347961J62010L97835
1818.8F38884735J124268K9068J158905L04489J837692J442719k129593L87039K482071
1827.5F45521393K672424j49383l390427R62601K553558K39716M16259J187439J192170
1836.2F51205750O73980p67669J163711O70395Q91190O30950J301651J050568n393143
$$ plain form
1844.9 651427383 653584747 656182175 656859741 657044449 657713623 659178619 659192047 659754410 659402466
1853.6 659402466 659608459 660052109 660284958 661115952 660980530 661652603 661899948 662866821 663506241 663792572
1863.2 663792572 664429626 664550476 664982986 664360962 665110550 664084549 662725372 664395905 665964050
1871.9 665964050 666976089 667044144 667645493 667555389 667611008 667339096 667502060 668137589 667660980 668554535
1881.5 668554535 669022980 669800415 669939041 669890137 670447998 670000763 670723114 669863434 668631821 669576492
1891.2 669576492 670438232 670592728 671178665 671931686 671165619 671720505 671954193 672182846 672422485 672515182
1900.8 672515182 672896423 672336578 672607346 672450790 673010254 673887558 674109116 674298248 674327393 674344940
1910.4 674344940 673658295 674262314 673867569 673597641 673849792 674163895 675479355 673335876 673169937
$$ packed form
1844.9F51427383K157364K597428O77566J84708O69174J464996J3428N62363l51944
1853.6F59402466K05993M43650K32849Q30994j35422O72073K47345R66873O39420K86331
1863.2F63792572O37054J20850M32510o22024P49588j026001j359177J670533J568145
1871.9F65964050J012039O8055O01349r0104N5619k71912J62964O35529m76609Q93555
1881.5F68554535M68445P77435J38626m8904N57861m47235P22351q59680j231613R44671
1891.2F69576492Q61740J54496N85937P53021p66067N54886K33688K28653K39639R2697
1900.8F72515182L81241n59845K70768j56556N59464Q77304K21558J89132K9145J7547
1910.4F74344940o86645O04019l94745k69928K52151L14103J315460k143479j65939
$$ plain form
1919.1 673169937 674655457 675331497 675910568 674856796 674116745 674213791 674732666 674541321 674948502
1927.8 674948502 675336151 675120392 675175018 675221786 675840225 675296707 675239944 675173721 675018768 675177612
1937.5 675177612 674701843 674835968 674808884 676131134 676171494 674403992 674827423 675150909 674952393 674521408
1947.1 674521408 674604034 674455185 674406204 673944168 673755035 674404907 674587784 675081558 674770126 674821625
1956.7 674821625 674472198 673836288 673876801 673483353 673626480 673391571 673514557 673493271 673737106 674364700
1966.4 674364700 673757858 673502502 673723755 673847656 673158875 672980270 672962341 673081284 673529968 673393555
1976 673393555 673757553 673499985 673511353 673351135 673041306 673013000 672490387 672252808 671739502 672187195
1985.7 672187195 672294159 672148819 672193451 672038269 672752914 672465515 671466751 670911407 671448288 671381531
$$ packed form
1919.1F73169937J485520O76040N79071j053772p40051R7046N18875j91345M07181
1927.8F74948502L87649k15759N4626M6768O18439n43518n6763o6223j54953J58844
1937.5F75177612m75769J34125k7084J322250M0360j767502M23431L23486j98516m30985
1947.1F74521408Q2626j48849m8981m62036j89133O49872J82877M93774l11432N1499
1956.7F74821625l49427o35910M0513l93448J43127k34909J22986k1286K43835O27594
1966.4F74364700o06842k55356K21253J23901o88781j78605j7929J18943M48684j36413
1976F73393555L63998k57568J1368j60218l09829k8306n22613k37579n13306M47693
1985.7F72187195J06964j45340M4632j55182P14645k87399r98764n55344N36881o6757
$$ plain form
1995.3 671381531 670743332 670871887 670702209 670900803 670746994 670966797 670573196 670112534 670422211 670184250
2005 670184250 670113297 669397659 669386902 669130936 668876266 669067917 668766861 669084473 668765488 668785019
2014.6 668785019 668486633 667883606 667410660 667078247 667103271 666326370 666470871 666456985 666391907 666429520
2024.2 666429520 666191406 665919266 665203476 665360260 665252914 665244141 664642639 664132309 664111328 663486176
2033.9 663486176 663823700 663674622 663517685 663142242 662548599 662354279 662159271 662130127 661552658 661542053
2043.5 661542053 661015701 660894699 661236725 661071701 661199188 660740204 660639496 660430222 660111618 659573135
2053.2 659573135 659224091 659102554 658830261 659302673 659160843 659105453 658778305 658645630 658721695 658510284
2062.8 658510284 658756790 658218994 658088455 657601471 657308884 657402039 657376328 657849808 657531357 657613068
$$ packed form
1995.3F71381531o38199J28555j69678J98594j53809K19803l93601m60662L09677k37961
2005F70184250p0953p15638j0757k55966k54670J91651l01056L17612l18985J9531
2014.6F68785019k98386o03027m72946l32413K5024p76901J44501j3886o5078L7613
2024.2F66429520k38114k72140p15790J56784j07346q773o01502n10330k0981o25152
2033.9F63486176L37524j49078j56937l75443n93643j94320j95008k9144n77469j0605
2043.5F61542053n26352j21002L42026j65024J27487m58984j00708k09274l18604n38483
2053.2F59573135l49044j21537k72293M72412j41830n5390l27148j32675P6065k11411
2062.8F58510284K46506n37796j30539m86984k92587R3155k5711M73480l18451Q1711
$$ plain form
2072.5 657613068 657434921 657239609 657154770 656770554 656508865 656385498 656760941 656086807 655837936 655754700
2082.1 655754700 655782089 656074753 655633087 655796967 655467606 655031586 654555511 654548111 654452515 653740921
2091.7 653740921 653921509 653773651 653630142 653233795 653152313 653213577 652927856 652612534 652127380 652357635
2101.4 652357635 651727753 651411209 651399918 651137161 651156006 650699158 650695877 650451126 650486603 650445633 650115891
2112 650115891 649628143 649025726 648989792 648724136 648955307 648758545 648603592 648554840 648398743 648615341
2121.6 648615341 648288727 648307266 647802505 647635345 647709274 647354965 647176666 647111435 647745819 647892075
2131.3 647892075 648090134 647814789 647528687 647498703 646911774 646970139 646819229 646604080 646305008 646685257
2140.9 646685257 647102814 646996994 647110138 647073822 647452316 646980133 646866150 646644363 646194916 646592255
$$ packed form
2072.5F57613068j78147j95312q4839l84216k61689j23367L75443o74134k48871q3236
2082.1F55754700K7389K92664m41666J63880l29361m36020m76075p400r5596p11594
2091.7F53740921J80588j47858j43509l96347q1482O1264k85721l15322m85154K30255
2101.4F52357635o29882l16544j1291k62757J8845m56848l281k44751L5477m0970l29742
2112F50115891m87748o02417l5934k65656K31171j96762j54953m8752j56097K16598
2121.6F48615341l26614J8539n04761j67160P3929l54309j78299o5231O34384J46256
2131.3F47892075J98059k75345k86102k9984n86929N8365j50910k15149k99072L80249
2140.9F46685257M17557j05820J13144l6316L78494m72183j13983k21787m49447L97339
$$ plain form
2150.6 646592255 646542816 646705170 646346588 646476135 646900024 647443848 647876740 647449799 647480469 646775742
2160.2 646775742 646675491 646720505 646467438 646692505 646674500 646924820 647047195 647434921 647226868 647376328
2169.9 647376328 647734375 647453384 647278976 646946945 647266693 647141266 647342224 647641144 647766342 648109436
2179.5 648109436 648056564 648254318 647961502 648374023 648189240 647770081 647984238 647738495 648260117 648392715
2189.1 648392715 648462982 648356705 648918610 649461212 648890076 648826370 648518982 648968735 649191055 649073486
2198.8 649073486 649050217 648932190 649239426 649217911 649588852 649663696 650145187 650176010 649655991 649593048
2208.4 649593048 649321136 649646225 649323349 649313049 649698715 650177231 650483780 650227432 650616226 650289078
2218.1 650289078 650044937 649714127 649512329 649733658 649947128 650656967 650746765 650817566 650465393 650202942
$$ packed form
2150.6F46592255m9439J62354l58582J29547M23889N43824M32892m26941L0670p04727
2160.2F46775742j00251M5014k53067K25067j8005K50320J22375L87726k08053J49460
2169.9F47376328L58047k80991j74408l32031L19748j25427K00958K98920J25198L43094
2179.5F48109436n2872J97754k92816M12521j84783m19159K14157k45743N21622J32598
2189.1F48392715P0267j06277N61905N42602n71136o3706l07388M49753K22320j17569
2198.8F49073486k3269j18027L07236k1515L70941P4844M81491L0823n20019o2943
2208.4F49593048k71912L25089l22876j0300L85666M78516L06549k56348L88794l27148
2218.1F50289078k44141l30810k01798K21329K13470P09839Q9798P0801l52173k62451
$$ plain form
2227.7 650202942 650162888 650383301 650590820 649933929 649853058 649478073 649548874 649837570 649948273 650026398
2237.4 650026398 649933014 650459595 650199280 650230637 650000534 649714966 649887314 649680405 649788895 649691849
2247 649691849 650156403 649959793 649789200 650051880 650062943 650420837 650056763 649978638 649811172 649972763
2256.7 649972763 649955521 649527893 649655380 649585342 649934998 649737244 649651489 649630051 649623871 649809875 649517517
2267.3 649517517 649424591 648798141 648924255 649370804 649436035 649304276 649258347 649666595 649607468 649690094
2276.9 649690094 649141693 649012756 648889771 648330307 648145676 647753067 648263245 648535080 648941727 648909073
2286.5 648909073 648538361 648707657 648338928 648457718 647990570 647566376 647303085 647227783 647621536 647899628
2296.2 647899628 648491058 648221436 648152313 647940750 647833939 647525864 646541672 646524658 646676331 647341690
$$ packed form
2227.7F50202942m0054K20413K07519o56891q0871l74985P0801K88696J10703P8125
2237.4F50026398r3384N26581k60315L1357k30103k85568J72348k06909J08490r7046
2247F49691849M64554j96610j70593K62680J1063L57894l64074p8125j67466J61591
2256.7F49972763j7242m27628J27487p0038L49656j97754q5755k1438o180J86004k92358
2267.3F49517517r2926o26450J26114M46549O5231j31759m5929M08248n9127Q2626
2276.9F49690094n48401j28937j22985n59464j84631l92609N10178K71835M06647l2654
2286.5F48909073l70712J69296l68729J18790m67148m24194k63291p5302L93753K78092
2296.2F47899628N91430k69622o9123k11563j06811l08075r84192j7014J51673O65359
$$ plain form
2305.8 647341690 647307205 647407990 647474060 647108078 647852554 647802124 647379761 646394272 646048584 645946732
2315.5 645946732 645798111 646542282 646334915 646369400 646265488 647147446 648221130 647786102 646852264 646509247
2325.1 646509247 647100296 646744385 647140732 646994553 646693726 646595306 646347351 646897964 646095657 645983276
2334.8 645983276 645458221 644593048 643557739 643205948 644121704 644035492 644616776 644005203 644173431 645100555
2344.4 645100555 644905853 644006042 642540588 642105103 642518997 643390045 643093033 643639603 644964523
2353.1 644964523 645587769 646369171 644795685 643991776 643281097 642935028 642350616 642179642 642761002
2361.8 642761002 642286835 642642441 641577759 641319351 640103607 640022125 641228790 641352463 642107925
2370.4 642107925 640633774 638345680 636452446 636199837 635810013 635219421 635716743 635623207 635625038 634483795
$$ packed form
2305.8F47341690l4485J00785O6070l65982P44476n0430m22363r85489l45688j01852
2315.5F45946732j48621P44171k07367L4485j03912Q81958J073684m35028r33838l43017
2325.1F46509247N91049l55911L96347j46179l00827r8420k47955N50613q02307j12381
2334.8F45983276n25055q65173j035309l51791R15756q6212N81284o11573J68228R27124
2344.4F45100555j94702q99811j465454m35485M13894Q71048k97012N46570J324920
2353.1F44964523O23246P81402j573486q03909p10679l46069n84412j70974N81360
2361.8F42761002m74167L55606j064682k58408j215744q1482J206665J23673P55462
2370.4F42107925j474151k288094j893234k52609l89824n90592M97322r3536J831j141243
$$ plain form
2380.1 634483795 633837852 633625717 632843323 632270432 631305428 630941505 630803413 631036644 630917206 630919037
2389.7 630919037 631153984 630281639 630055237 629797707 629339523 628762894 628218842 627925034 627506027 627460251
2399.4 627460251 627157288 627158852 626854515 626426544 625940437 625473137 625494499 624720993 624158249 623711815
2409 623711815 623517761 623416061 623316803 623553658 623230553 622806854 622032394 621829720 621606636 620844803
2418.7 620844803 619986610 619085503 619021835 618677254 618619385 618804741 618548393 617831078 617226372 617003326
2428.3 617003326 615991058 615358582 614969711 614698715 614393616 613960762 613811073 613717880 613951683 613294907
2438 613294907 612608719 611927147 611422157 611222687 610364571 609952354 609406929 609239426 609059181 608712425
2447.6 608712425 608413811 607721252 607456055 606725273 606154709 605627899 605156250 604738503 604047813 603931885
$$ packed form
2380.1F34483795o45943k12135p82394n72891r65004l63923j38092K33231j19438J831
2389.7F30919037K34947q72345k26402k57530m58184n76629n44052k93808m19007m5776
2399.4F27460251l02963J564l04337m27971m86107m67300K1362p73506n62744m46434
2409F23711815j94054j01700r9258K36855l23105m23699p74460k02674k23084p61833
2418.7F20844803q58193r01107o3668l44581n7869J85356k56348p17315o04706k23046
2428.3F17003326j012268o32476l88871k70996l05099m32854j49689r3193K33803o56776
2438F13294907o86188o81572n04990j99470q58116m12217n45425j67503j80245l46756
2447.6F08712425k98614o92559k65197p30782n70564n26810m71649m17747o90690j15928
$$ plain form
2457.2 603931885 603715897 603571625 603065224 602699051 602416916 601811714 601312981 600441933 599811401 598937759
2466.9 598937759 598187180 597721291 597423706 597184830 596755714 596565704 596018639 595487099 594541626 593962173
2476.5 593962173 593504028 592534752 592099342 591532288 591448097 591234245 590725060 590118217 589496193 589091454
2486.2 589091454 588199654 587697906 586996384 586347351 585795975 585346909 585137062 584491844 584279938 583812027
2495.8 583812027 583007202 582051125 581657143 581410217 580528412 580003624 579436798 579287987 578874245 578247643
2505.5 578247643 577446442 576543503 576203690 575598717 575269890 574316521 573646469 573229446 572266235 571914291
2515.1 571914291 571248055 570822182 570453033 570212669 570160370 569682045 568833122 567889137 567785034 567224655
2524.7 567224655 566506271 566127396 565738029 565333023 564685822 564411392 563847771 563301163 563008919 562346954
$$ packed form
2457.2F03931885k15988j44272n06401l66173k82135o05202m98733q71048o30532q73642
2466.9E98937759p50579m65889k97585k38876m29116j90010n47065n31540r45473n79453
2476.5E93962173m58145r69276m35410n67054q4191k13852n09185o06843o22024m04739
2486.2E89091454q91800n01748p01522o49033n51376m49066k09847o45218k11906m67911
2495.8E83812027q04825r56077l93982k46926q81805n24788n66826j48811m13742o26602
2505.5E78247643q01201r02939l39813o04973l28827r53369o70052m17023r63211l51944
2515.1E71914291o66236m25873l69149k40364n2299m78325q48923r43985j04103n60379
2524.7E67224655p18384l78875l89367m05006o47201k74430n63621n46608k92244o61965
$$ plain form
2534.4 562346954 561277161 560633965 560246620 559428978 559085732 558803253 558656349 558378181 557857056
2543.1 557857056 557338142 556679726 556155281 555191422 554683762 554415817 554097557 553594856 552884407 552638626
2552.7 552638626 552200890 551984749 551386757 550787354 550453072 549919624 549412766 548653526 548242874 547503128
2562.4 547503128 546952133 546374207 545774384 545915947 545677376 545010147 543957901 543509483 543131561
2571 543131561 542935371 542807999 541752892 541302109 540868568 540311852 539801140 539549179 539201241 538516006
2580.7 538516006 538221092 537460327 536899986 536162415 535721474 535551071 534879799 534633141 534180641 533780708
2590.3 533780708 533188705 532644501 531791229 530736656 530448494 530034370 529691696 529107819 528757668
2599 528757668 528240280 527551003 527119293 526363525 525936317 525011101 524492226 524286118 523703041 523353806
$$ packed form
2534.4E62346954j069793o43196l87345q17642l43246k82479j46904k78168n21125
2543.1E57857056n18914o58416n24445r63859n07660k67945l18260n02701p10449k45781
2552.7E52638626m37736k16141n97992n99403l34282n33448n06858p59240m10652p39746
2562.4E47503128n50995n77926n99823J41563k38571o67229j052246m48418l77922
2571E43131561j96190j27372j055107m50783m33541n56716n10712k51961l47938o85235
2580.7E38516006k94914p60765n60341p37571m40941j70403o71272k46658m52500l99933
2590.3E33780708n92003n44204q53272j054573k88162m14124l42674n83877l50151
2599E28757668n17388o89277m31710p55768m27208r25216n18875k06108n83077l49235
$$ plain form
2608.6 523353806 522649574 521882362 521026955 520411186 519722214 519172401 518751068 518223305 517944183 517116013
2618.3 517116013 516329002 515431671 514820442 514446754 513764648 513269730 512351685 511746597 511399727 511032982
2627.9 511032982 510518227 509565773 508927231 508551445 508107185 507598572 507043228 505935783 505163498
2636.6 505163498 504825478 504103737 503289108 502564659 502157440 501378670 500810776 500441780 499772987 499337540
2646.3 499337540 498811531 498261681 497583275 496994667 496297760 495658913 495008202 494232750 493913498 493300514
2655.9 493300514 492869339 492490311 491805763 491288490 490766830 490022888 489345894 489206123 488689270 488069420
2665.5 488069420 487525826 487086105 486709366 485928383 485443954 485014267 484807320 484479599 484212723 483924408
2675.2 483924408 483302422 483195572 482599144 481925926 481397324 480734138 480242081 479826736 479292030 478428459
$$ packed form
2608.6E23353806p04232p67212q55407o15769o88972n49813m21333n27763k79122q28170
2618.3E17116013p87011q97331o11229l73688o82106m94918r18045o05088l46870l66745
2627.9E11032982n14755r52454o38542l75786m44260n08613n55344j107445p72285
2636.6E05163498l38020p21741q14629p24449m07219p78770n67894l68996o68793m35447
2646.3D99337540n26009n49850o78406n88608o96907o38847o50711p75452l19252o12984
2655.9D93300514m31175l79028o84548n17273n21660p43942o76994j39771n16853o19850
2665.5D88069420n43594m39721l76739p80983m84429m29687k06947l27721k66876k88315
2675.2D83924408o21986j06850n96428o73218n28602o63186m92057m15345n34706q63571
$$ plain form
2684.8 478428459 478226929 478051414 477676544 477172241 476601677 476192360 475479851 475095901 474517479 473894386
2694.5 473894386 473151474 472648125 472563896 472169571 472124901 471664925 471287193 470898018 470383835 469911232
2704.1 469911232 468832245 468435516 468305435 467973785 467467041 467159843 466777573 466127396 465940285
2712.8 465940285 465371513 465088882 464603958 463740463 463307953 462954254 462807770 462500114 462178535 461682777
2722.4 461682777 461508102 461531487 461294327 460911942 460343666 460117073 459427986 458781395 458654633 458647423
2732.1 458647423 458340988 457865448 457796364 457309494 456995583 456611938 456223450 456112633 455864487 455656052
2741.7 455656052 454936447 454862251 454986877 454627876 454461098 454394226 454371071 454044037 453580818 452792130
2751.4 452792130 452335358 452100296 451786385 451714211 451535339 451436882 450959244 450692253 450452156 449844704
$$ packed form
2684.8D78428459k01530j75515l74870n04303n70564m09317p12509l83950n78422o23093
2694.5D73894386p42912n03349q4229l94325m4670m59976l77732l89175n14183m72603
2704.1D69911232j078987l96729j30081l31650n06744l07198l82270o50177j87111
2712.8D65940285n68772k82631m84924q63495m32510l53699j46484l07656l21579m95758
2722.4D61682777j74675K3385k37160l82385n68276k26593o89087o46591j26762p210
2732.1D58647423l06435m75540o9084m86870l13911l83645l88488j10817k48146k08435
2741.7D55656052p19605p4196J24626l59001j66778o6872k3155l27034m63219p88688
2751.4D52792130m56772k35062l13911p2174j78872r8457m77638k66991k40097o07452
$$ plain form
2761 449844704 449356270 448682098 448085861 447755089 447728996 447397804 447053528 446877899 446629410 446246262
2770.7 446246262 445708389 445881577 445801506 445217514 444430237 443571701 442878952 442314072 442305946 441818390
2780.3 441818390 441143799 440561981 440084724 439832039 439235954 438774261 438225021 437753372 437211800 436733055
2789.9 436733055 436326637 435720863 435218010 434343948 433615608 432822304 432036095 431535072 431022758 430339699
2799.6 430339699 429438171 428967667 428260040 427569389 426916847 426053619 425281868 424387398 423626289 422629204
2809.2 422629204 421854439 420886765 419942932 419551277 418869438 418335686 417553291 416469345 415371590
2817.9 415371590 414558258 413991432 413086014 412072906 411153259 410479050 409546051 408721924 407814522
2826.6 407814522 406622314 405778236 404717064 403505173 402534676 401824608 400748367 399391479 397831726
$$ packed form
2761D49844704m88434o74172n96237l30772k6093l31192l44276j75629k48489l83148
2770.7D46246262n37873J73188q0071n83992p87277q58536o92749n64880q126m87556
2780.3D41818390o74591n81818m77257k52685n96085m61693n49240m71649n41572m78745
2789.9D36733055m06418o05774n02853q74062p28340p93304p86209n01023n12314o83059
2799.6D30339699r01528m70504p07627o90651o52542q63228p71751q94470p61109r97085
2809.2D22629204p74765r67674r43833l91655o81839n33752p82395j083946j097755
2817.9D15371590q13332n66826r05418j013108r19647o74209r32999q24127r07402
2826.6D07814522j192208q44078j061172j211891r70497p10068j076241j356888j559753
$$ plain form
2835.3 397831726 396527863 395696259 394027824 392277603 390645752 389236107 387844391 385881310
2843 385881310 383762245 381158791 378979378 376919022 374523468 371863899 369441872 367884979 366047745
2851.7 366047745 364597931 363764839 363258896 362738266 362275391 362483978 362471619 362542648 362576752 362313538
2861.3 362313538 361677551 360856056 360534439 360258560 359517059 358224640 357247124 356436691 355488586
2870 355488586 354617462 354066811 353745270 352882957 352014046 351134224 350684662 350290794 349428101 348990631
2879.6 348990631 348223419 347331581 346517220 345433273 344480515 343864861 343378563 342629471 341510277
2888.3 341510277 340101738 339130630 337913933 336440010 335683136 334955406 333826523 332568588 331680908
2897 331680908 330991898 330380859 329779549 329232788 328510742 327547913 326716537 325417900 324786758 324520912
$$ packed form
2835.3C97831726j303863q31604j668435j750221j631851j409645j391716j963081
2843C85881310k119065k603454k179413k060356k395554k659569k422027j556893j837234
2851.7C66047745j449814q33092n05943n20630m62875K08587j2359P1029L4104k63214
2861.3C62313538o35987q21495l21617k75879p41501j292419r77516q10433r48105
2870C55488586q71124n50651l21541q62313q68911q79822m49562l93868q62693m37470
2879.6C48990631p67212q91838q14361j083947r52758o15654m86298p49092j119194
2888.3C41510277j408539r71108j216697j473923p56874p27730j128883j257935q87680
2897C31680908o89010o11039o01310n46761p22046r62829q31376j298637o31142k65846
$$ plain form
2906.6 324520912 323571053 322696838 321594353 320308342 318864498 317631264 316434841 314890347 313236275
2915.3 313236275 311690273 310709000 309630051 308140526 306620083 306019707 305588875 304412098 303915806
2924 303915806 303990669 303857594 303362923 303095722 303114452 303420410 303670464 303362045 303616505 304040375
2933.6 304040375 304492645 305177727 305834007 306361237 306940460 307917252 308337002 308842907 309759941 310354691
2943.3 310354691 310806847 311666451 312638264 312998848 313700867 314357357 314760170 315098610 315173569 315611916
2952.9 315611916 316246223 316697865 316531887 316885262 317976723 318862915 319102573 319210339 320366631
2961.6 320366631 321224442 321787376 322326126 322807541 323756981 324505272 325040131 325436211 326369171 327389526
2971.2 327389526 328265572 329055214 329318314 329827766 330321846 330974503 331782837 332485542 333052750 333472748
$$ packed form
2906.6C24520912r49859q74215j102485j286011j443844j233234j196423j544494j654072
2915.3C13236275j546002r81273j078949j489525j520443o00376m30832j176777m96292
2924C03915806P4863j33075m94671k67201J8730L05958K50054l08419K54460M23870
2933.6C04040375M52270O85082O56280N27230N79223R76792M19750N05905R17034N94750
2943.3C10354691M52156Q59604R71813L60584P02019O56490M02813L38440P4959M38347
2952.9C15611916O34307M51642j65978L53375J091461Q86192K39658J07766J156292
2961.6C20366631Q57811N62934N38750M81415R49440P48291N34859L96080R32960J020355
2971.2C27389526Q76046P89642K63100N09452M94080O52657Q08334P02705N67208M19998
$$ plain form
2980.9 333472748 333915977 334002342 334089012 334233246 334558983 334780197 334881248 335177422 335449829 335539551
2990.5 335539551 335293083 335635414 335889969 335764732 335468140 334993629 334961090 334635658 334553795 334318657
3000.2 334318657 333810425 333452530 332669678 332137184 331686058 331254158 330567169 329824371 329434509 328851738
3009.8 328851738 328211174 327807159 327510376 326808243 326101036 325555611 325410995 324988022 323832359
3018.5 323832359 323111191 322578430 321945953 320887718 320184326 319747772 318888493 318218155 317602158
3027.2 317602158 317281132 316361446 315552349 315016899 314102058 313622818 312680416 311883373 311081142 310239182
3036.8 310239182 309516697 308415489 307827587 307121048 306249905 305596294 305037956 304183254 303423595
3045.5 303423595 302654953 300993290 299889393 299452133 299098511 298352108 297294044 296652622 296068764
$$ packed form
2980.9C33472748M43229Q6365Q6670J44234L25737K21214J01051K96174K72407Q9722
2990.5C35539551k46468L42331K54555j25237k96592m74511l2539l25432q1863k35138
3000.2C34318657n08232l57895p82852n32494m51126m31900o86989p42798l89862n82771
3009.8C28851738o40564m04015k96783p02133p07207n45425j44616m22973j155663
3018.5C23832359p21168n32761o32477j058235p03392m36554q59279o70338o15997
3027.2C17602158l21026r19686q09097n35450r14841m79240r42402p97043q02231q41960
3036.8C10239182p22485j101208n87902p06539q71143o53611n58338q54702p59659
3045.5C03423595p68642j661663j103897m37260l53622p46403j058064o41422n83858
$$ plain form
3054.2 296068764 295645809 295008526 294377613 293704128 292879753 292108173 291048164 290004654 289286804
3062.9 289286804 288954449 288130474 287409630 287017097 286307030 285904522 285308857 284462795 283659954 283042965
3072.5 283042965 282371769 281712627 281353149 280883999 280235806 279201260 278416252 277649899 276926899
3081.2 276926899 276552582 275927830 275385132 274626846 273906593 273267689 272475147 271875820 271597347 271174240
3090.8 271174240 270196285 269710617 269145947 268056297 267139130 266720257 266563950 265721989 264857006
3099.5 264857006 264510880 264074726 263182850 262869148 262636147 261389313 260518551 259922600 259341526
3108.2 259341526 258626957 257747135 257122631 256538372 256318913 255818081 254939346 254064693 253367577 252818356
3117.8 252818356 252021923 251239681 250737991 250316563 249442444 248892841 248206539 246980000 246558743
$$ packed form
3054.2B96068764m22955o37283o30913o73485q24375p71580j060009j043510p17850
3062.9B89286804l32355q23975p20844l92533p10067m02508n95665q46062q02841o16989
3072.5B83042965o71196o59142l59478m69150o48193j034546p85008p66353p23000
3081.2B76926899l74317o24752n42698p58286p20253o38904p92542n99327k78473m23107
3090.8B71174240r77955m85668n64670j089650r17167m18873j56307q41961q64983
3099.5B64857006l46126m36154q91876l13702k33001j246834q70762n95951n81074
3108.2B59341526p14569q79822o24504n84259k19459n00832q78735q74653o97116n49221
3117.8B52818356p96433p82242n01690m21428q74119n49603o86302j226539m21257
$$ plain form
3126.5 246558743 246425724 245684948 244407730 243514214 243201618 243039303 242524166 241718063 241177540
3135.2 241177540 240400562 239934864 239156551 237854900 237074986 236660175 236474266 235810814 234928856
3143.9 234928856 234062023 233571243 233269348 232341843 231684666 231318073 230788040 229809322 229080830 228791695
3153.5 228791695 227937946 226792202 226064987 225814400 224964943 224084492 223598633 223052158 222611141
3162.2 222611141 221846619 221407623 220776749 219765587 219288502 218557758 217661800 217253227 216802120
3170.9 216802120 216036282 215555897 215207253 214521961 213689232 213345528 213073254 212068806 210973740
3179.5 210973740 210089664 209792004 209485035 208832664 208527546 207976112 207287388 206843872 206526718 205738697
3189.2 205738697 204892540 204499588 203646126 202734413 202288418 202113781 201417179 200390453 200156059
$$ packed form
3126.5B46558743j33019p40776j277218q93516l12596j62315n15137q06103n40523
3135.2B41177540p76978m65698p78313j301651p79914m14811j85909o63452q81958
3143.9B34928856q66833m90780l01895r27505o57177l66593n30033r78718p28492k89135
3153.5B28791695q53749j145744p27215k50587q49457q80451m85859n46475m41017
3162.2B22611141p64522m38996o30874j011162m77085p30744q95958m08573m51107
3170.9B16802120p65838m80385l48644o85292q32729l43704k72274j004448j095066
3179.5B10973740q84076k97660l06969o52371l05118n51434o88724m43516l17154p88021
3189.2B05738697q46157l92952q53462r11713m45995j74637o96602j026726k34394
$$ plain form
3197.9 200156059 200158882 199564304 198712234 198323231 197745571 197190609 197100410 196443062 195479012 194938946
3207.5 194938946 194554291 193886261 193523083 193203850 192724991 192563496 191945229 191255169 190829067 190220280
3217.2 190220280 189648228 189273243 188922520 188336487 187625008 186963978 186454258 186119919 186131935 185889187
3226.8 185889187 185163937 184279556 183576984 183534546 183092117 182564850 182211761 181611614 181398373 181137085
3236.4 181137085 180846710 180531635 180281944 179903717 179276962 178826790 178248825 178009148 177584686 177104301
3246.1 177104301 177087288 176567974 175922527 175645485 175412788 174875488 174235744 173686829 173546448 173639755
3255.7 173639755 173137779 172371845 172005081 172200928 171979218 171283455 170713921 170136909 169936295 169642162
3265.4 169642162 169502125 169655819 169164467 168456974 168149090 167894764 167639866 167634468 167107334 166431446
$$ packed form
3197.9B00156059K823n94578q52070l89003n77660n54962r0199o57348r64050n40066
3207.5A94938946l84655o68030l63178l19233m78859j61495o18267o90060m26102o08787
3217.2A90220280n72052l74985l50723n86033p11479o61030n09720l34339J2016k42748
3226.8A85889187p25250q84381p02572m2438m42429n27267l53089o00147k13241k61288
3236.4A81137085k90375l15075k49691l78227o26755m50172n77965k39677m24462m80385
3246.1A77104301j7013n19314o45447k77042k32697n37300o39744n48915j40381R3307
3255.7A73639755n01976p65934l66764J95847k21710o95763n69534n77012k00614k94133
3265.4A69642162j40037J53694m91352p07493l07884k54326k54898n398n27134o75888
$$ plain form
3275 166431446 166503296 166680565 166363640 165868683 165675602 165372105 165081005 164855156 164606743 164645195
3284.7 164645195 164431324 163885708 163202705 163068867 163344154 163173256 163030949 162787991 162327003 161804066
3294.3 161804066 161527901 161662674 161793480 161829929 161214790 160483093 160238953 160019627 159814625 159314394
3303.9 159314394 159137774 159422054 159264755 159084091 158771191 158203135 157970018 157835293 157594204 157166739
3313.6 157166739 156594782 156397696 156388988 155953712 155570917 155444479 155148602 154900808 154574280 153925934
3323.2 153925934 153340464 153208122 153156977 152774324 152355528 151994505 151649323 151300116 150976124 150404825
3332.9 150404825 149777536 149681225 149600210 149371996 148815145 147992287 147737856 147718992 147401638 147261000
3342.5 147261000 147316837 146814737 146289349 146189985 145989685 145526514 145102606 145110722 144697809 144205341
$$ packed form
3275A66431446P1850J77269l16925m94957j93081l03497k91100k25849k48413L8452
3284.7A64645195k13871n45616o83003j33838K75287j70898j42307k42958m60988n22937
3294.3A61804066k76165J34773J30806L6449o15139p31697k44140k19326k05002n00231
3303.9A59314394j76620K84280j57299j80664l12900n68056k33117j34725k41089m27465
3313.6A57166739n71957j97086q708m35276l82795j26438k95877k47794l26528o48346
3323.2A53925934n85470j32342n1145l82653m18796l61023l45182l49207l23992n71299
3332.9A50404825o27289r6311q1015k28214n56851q22858k54431j8864l17354j40638
3342.5A47261000N5837n02100n25388r9364k00300m63171m23908Q116m12913m92468
$$ plain form
3352.2 144205341 144078074 143649025 143564672 143661957 143570414 143299952 143271999 143719234 143722582 143371429 143041048
3362.8 143041048 142958632 142831478 142710896 142924604 142849092 142596474 142370043 142291527 142111959 141733255
3372.4 141733255 141622210 141721296 141899195 141695089 141335373 141356020 141490183 141424379 141431570 141504230 141117477
3383 141117477 140989199 141228933 141073380 140660143 140549240 140953674 141111126 141058674 140915203 140438070
3392.7 140438070 140598936 141177969 141294212 141145973 140861959 140819569 141057177 141108694 141159277 141140146
3402.3 141140146 140920973 140644655 140710278 140969124 140855837 141212587 141551800 141272564 141602459 142129564
3412 142129564 142078743 141835957 141809254 141962099 142150831 142269611 142447853 142563076 142195330 142155638
3421.6 142155638 142314720 142367382 142913179 143279266 143268690 143515959 143929901 144285593 144580564 144575834
$$ packed form
3352.2A44205341j27267m29049q4353R7285r1543k70462k7953M47235L348l51153l30381
3362.8A43041048q2416j27154j20582K13708p5512k52618k26431p8516j79568l78704
3372.4A41733255j11045R9086J77899k04106l59716K0647J34163o5804P191P2660l86753
3383A41117477j28278K39734j55553m13237j10903M04434J57452n2452j43471m77133
3392.7A40438070J60866N79033J16243j48239k84014m2390K37608N1517N0583j9131
3402.3A41140146k19173k76318O5623K58846j13287L56750L39213k79236L29895N27105
3412A42129564n0821k42786k6703J52845J88732J18780J78242J15223l67746l9692
3421.6A42155638J59082N2662N45797L66087j0576K47269M13942L55692K94971m730
$$ plain form
3431.2 144575834 144816761 145332813 145204668 145088358 145374031 145627174 145775232 146170731 146686373 147064018
3440.9 147064018 147755899 148052568 147917080 147761745 147993069 148744211 148831148 149408789 150189533 150429621
3450.5 150429621 151008406 151466293 151907511 152274084 152310295 152358875 152854691 153571825 153718014 154004135
3460.2 154004135 154585114 154963779 155272026 155996561 157041378 157580910 157847033 158000517 158343410
3468.8 158343410 158985481 159317179 159727421 160444050 161125813 161442394 161757450 162639999 163186588 163035583
3478.5 163035583 163303928 164216423 165140667 165581818 165672798 166221275 166967964 167629490 168243809 168718643
3488.1 168718643 169218655 169573288 170024261 170605278 171445770 172401390 172903042 173517017 174374256 175388660
3497.8 175388660 176262131 176876373 177522392 177799950 177810497 178267879 179525871 180503044 180898590 181704845
$$ packed form
3431.2A44575834K40927N16052j28145j16310K85673K53143J48058L95499N15642L77645
3440.9A47064018O91881K96669j35488j55335K31324P51142Q6937N77641P80744K40088
3450.5A50429621N78785M57887M41218L66573L6211M8580M95816P17134J46189K86121
3460.2A54004135N80979L78665L08247P24535J044817N39532K66123J53484L42893
3468.8A58343410O42071L31698M10242P16629O81763L16581L15056Q82549N46589j51005
3478.5A63035583K68345R12495R24244M41151R0980N48477P46689O61526O14319M74834
3488.1A68718643N00012L54633M50973N81017Q40492R55620N01652O13975Q57239J014404
3497.8A75388660Q73471O14242O46019K77558J0547M57382J257992R77173L95546Q06255
$$ plain form
3507.4 181704845 182873058 183394260 183668976 184962635 185977745 186496544 187514095 188500366 188959064
3516.1 188959064 189357700 190256271 190930157 191868286 193139629 193916473 194593563 195178452 196108494
3524.8 196108494 197029877 197727337 198402004 199210033 200348988 201282101 202256775 203181458 204079857
3533.5 204079857 205103874 206394806 207318077 207751579 209130173 210525932 211432991 212265606 213372288
3542.1 213372288 214532375 215564995 216584435 217193947 218385487 219304104 220463009 222151871 224082775
3550.8 224082775 226012993 226310806 227225685 228533649 230002060 231541233 232525196 234239960 235493755
3559.5 235493755 236677094 237989922 239885159 241637745 243109245 245829678 246421452 247282829 248194275
3568.2 248194275 248577843 251055031 252797928 254300842 255855427 257723236 259299469 261007462
$$ packed form
3507.4A81704845J168213N21202K74716J293659J015110N18799J017551R86271M58698
3516.1A88959064L98636Q98571O73886R38129J271343P76844O77090N84889R30042
3524.8A96108494R21383O97460O74667Q08029J138955R33113R74674R24683Q98399
3533.5B04079857J024017J290932R23271M33502J378594J395759R07059Q32615J106682
3542.1B13372288J160087J032620J019440O09512J191540R18617J158905J688862J930904
3550.8B24082775J930218K97813R14879J307964J468411J539173R83963J714764J253795
3559.5B35493755J183339J312828J895237J752586J471500K720433N91774Q61377R11446
3568.2B48194275L83568K477188J742897J502914J554585J867809J576233J707993
$$ plain form
3575.9 261007462 262772999 263959141 266233730 267827148 269438362 271007633 272679005 274676037
3583.6 274676037 276583748 280575924 282372627 282541027 284536152 285269928 287988777 290465584 292856560
3592.3 292856560 294520149 296240330 299063625 299518833 302059040 305114193 306813717 309982300
3600 309982300 311829205 312989521 315309258 317856636 320770988 324331322 326837616 326883430 330032997
3608.7 330032997 331635895 333237267 339180145 341096115 341572495 344928474 345908051 350022812 353834381
3617.4 353834381 355732536 359191933 361252098 363132858 366071053 369515800 372696877 375930405
3625.1 375930405 378694420 382171898 388185959 388215485 384209709 389992790 395547523 400535202 403129196
3633.8 403129196 404320145 407847366 411594429 414744644 417167015 420147552 423919067 427527924
$$ packed form
3575.9B61007462J765537J186142K274589J593418J611214J569271J671372J997032
3583.6B74676037J907711L992176J796703J68400J995125P33776K718849K476807K390976
3592.3B92856560J663589J720181K823295M55208K540207L055153J699524L168583
3600C09982300J846905J160316K319737K547378K914352L560334K506294M5814L149567
3608.7C30032997J602898J601372N942878J915970M76380L355979R79577M114761L811569
3617.4C53834381J898155L459397K060165J880760K938195L444747L181077L233528
3625.1C75930405K764015L477478O014061K9526m005776N783081N554733M987679K593994
3633.8D03129196J190949L527221L747063L150215K422371K980537L771515L608857
$$ plain form
3641.5 427527924 430221252 432666931 436421814 441084747 446639709 447093964 446837921 453172531 455493965
3650.1 455493965 455931053 457088242 462840652 468123703 472968864 478991432 474876060 478175316
3657.9 478175316 484039497 486804962 490063210 491136322 493721771 496146317 498960838 502037048
3665.6 502037048 504854698 510419388 512745285 513071671 512630501 508841019 513814659 522377625 530979156
3674.3 530979156 529429741 517561798 521600037 529488564 534701653 534039116 535261574 538119087
3682 538119087 540500565 542157364 543599854 544819641 548939171 555824661 548287315 546210976 553571129
3690.6 553571129 549220543 549830475 554880638 556353722 558331375 559047470 558919144 560832367 562393494
3699.3 562393494 565596848 568597755 563539276 562324677 567431870 569315681 569068451 569555511 572507896
$$ packed form
3641.5D27527924K693328K445679L754883M662933N554962M54255k56043O334610K321434
3650.1D55493965M37088J157189N752410N283051M845161O022568m115372L299256
3657.9D78175316N864181K765465L258248J073112K585449K424546K814521L076210
3665.6E02037048K817650N564690K325897L26386m41170l789482M973640Q562966Q601531
3674.3E30979156j549415j1867943M038239P888527N213089o62537J222458K857513
3682E38119087K381478J656799J442490J219787M119530O885490p537346k076339P360153
3690.6E53571129m350586O09932N050163J473084J977653P16095j28326J913223J561127
3699.3E62393494L203354L000907n058479j214599N107193J883811k47230M87060K952385
$$ plain form
3708 572507896 575733070 569871712 574263954 578258438 565779305 570486641 575237312 576021690 577343330
3716.7 577343330 579299545 580209160 577023315 579016647 585130539 582303734 578524284 583016624
3724.4 583016624 584488640 583561974 581490898 582477646 585882607 586857834 591783257 588730469 583354683
3733.1 583354683 593410645 592404938 582475052 584727783 586608696 586652870 589055977 592006226
3740.8 592006226 589120674 593077393 603219070 589593658 578854828 589674149 595346527 599971962
3748.5 599971962 594980583 586945534 597772598 592335968 586534805 592950935 596853256 599106331
3756.2 599106331 594460945 597239304 602062225 594233513 593194084 596813660 598096809 599191322
3763.9 599191322 602662239 600330315 596561012 599545479 603587952 603585777 595247917 597911606 601891785
$$ packed form
3708E72507896L225174n861358M392242L994484j2479133M707336M750671P84378J321640
3716.7E77343330J956215R09615l185845J993332O113892k826805l779450M492340
3724.4E83016624J472016r26666k071076R86748L404961R75227M925423l052788n375786
3733.1E83354683J0055962j005707r929886K252731J880913M4174K403107K950249
3740.8E92006226k885552L956719J0141677j3625412j0738830J0819321N672378M625435
3748.5E99971962m991379q035049J0827064n436630n801163O416130L902321K253075
3756.2E99106331m645386K778359M822921p828712j039429L619576J283149J094513
3763.9E99191322L470917k331924l769303K984467M042473k175q337860K663689L980179
$$ plain form
3772.6 601891785 602136040 602410889 601313286 602198410 602857666 605801353 606015587 599182625 601523399
3781.3 601523399 603331604 604993515 606821747 603621292 603017807 604079285 604660530 604894714 605097275
3790 605097275 605582619 605733032 606365356 605920753 607086067 609669189 605863419 602786827 605067215
3798.7 605067215 609652328 615821457 607472191 596604729 601355896 604974632 610197220 614651070
3806.4 614651070 604400787 601502419 606464500 608588905 609104767 609184113 608841515 610109863 615149117
3815.1 615149117 613398972 600290451 604978828 611255074 615949898 617577934 601190491 602072906
3822.8 602072906 607634277 610223389 612348709 610703621 606349411 607297249 609929161 613058815
3830.5 613058815 613558273 606033707 609357071 616352272 611167679 610973053 617153664 608073921 605570679
$$ packed form
3772.6F01891785K44255K74849j097603Q85124O59256K943687K14234o832962K340774
3781.3F01523399J808205J661911J828232l200455o03485J061478N81245K34184K02561
3790F05097275M85344J50413O32324m44603J165314K583122l805770l076592K280388
3798.7F05067215M585113O169129q349266j0867462M751167L618736N222588M453850
3806.4F14651070j0250283k898368M962081K124405N15862P9346l42598J268348N039254
3815.1F15149117j750145j3108521M688377O276246M694824J628036j6387443Q82415
3822.8F02072906N561371K589112K125320j645088m354210R47838K631912L129654
3830.5F13058815M99458p524566L323364O995201n184593j94626O180611r079743k503242
$$ plain form
3839.2 605570679 612857018 608778076 608396988 613208504 609739342 607173767 610420570 611638412
3846.9 611638412 611439056 612703209 612464676 615016060 620005074 614099464 611411705 597668152
3854.6 597668152 602384758 612198143 609939308 608427734 611209373 613476562 615289497 610148849
3862.3 610148849 610507927 615695496 610226212 606112823 609506989 613918762 617887764 607653503
3870 607653503 601363487 607511978 613762550 616389084 607329521 608226166 612034950 611439095 613108025
3878.7 613108025 616647224 611544533 605507393 610932159 612257233 613860054 618243561 605904312
3886.4 605904312 606951675 610817146 611506195 615524902 614143486 607670326 609628258 612262802
3894.1 612262802 610541611 611212540 612484550 614029999 613344231 605509071 611193085 612185707 607410622
$$ packed form
3839.2F05570679P286339m078942l81088M811516l469162k565575L246803J217842
3846.9F11638412j99356J264153k38533K551384M989014n905610k687759j3743553
3854.6E97668152M716606R813385k258835j511574K781639K267189J812935n140648
3862.3F10148849L59078N187569n469284m113389L394166M411773L969002j0234261
3870F07653503o290016O148491O250572K626534r059563Q96645L808784n95855J668930
3878.7F13108025L539199n102691o037140N424766J325074J602821M383507j2339249
3886.4F05904312J047363L865471O89049M018707j381416o473160J957932K634544
3894.1F12262802j721191O70929J272010J545449o85768p835160N684014R92622m775085
$$ plain form
3902.8 607410622 610870514 607303200 607080078 608358269 609491005 611625252 611377373 611305428 611030655
3911.5 611030655 610650787 610101814 610413971 612014046 613015289 609311485 606664124 610781898 610030022
3920.2 610030022 606537819 609342575 611035652 610742035 609299583 607725182 608857346 610612106
3927.9 610612106 611162796 609074287 608609734 610791435 608964462 607280235 608280220 608474960 609039078
3936.6 609039078 609375916 608797569 608102188 607704582 609027214 609871445 607370682 607053146 608029366
3945.2 608029366 609025154 610081558 608004341 608512726 608487663 606017494 607508087 607645226 607312202
3953.9 607312202 607762833 607990265 608256645 607138062 607622185 608067589 608542595 608656578 606576538
3962.6 606576538 605953751 606613693 607002869 606703072 606814003 606885147 606286888 606072235 606827965 607519150
$$ packed form
3902.8F07410622L459892l567314k23122J278191J132736K134247k47879p1945k74773
3911.5F11030655l79868n48973L12157J600075J001243l703804k647361M117774p51876
3920.2F10030022l492203K804756J693077k93617j442452j574401J132164J754760
3927.9F10612106N50690k088509m64553K181701j826973j684227R99985J94740N64118
3936.6F09039078L36838n78347o95381l97606J322632Q44231k500763l17536R76220
3945.2F08029366R95788J056404k077217N08385k5063k470169J490593J37139l33024
3953.9F07312202M50631K27432K66380j118583M84123M45404M75006J13983k080040
3962.6F06576538o22787O59942L89176k99797J10931P1144n98259k14653P55730O91185
$$ plain form
3972.2 607519150 606936646 607199707 607546921 607040939 606369400 606498260 607048264 606900749 607476006 607395554
3981.9 607395554 607057266 607254181 607568130 607572403 606690445 606829071 606793518 606828651 607106056 606981468
3991.5 606981468 607326164 607426834 607340584 606377335 606226044 606893005 606751976 606802979 607029610
4000.2 607029610
$$ packed form
3972.2F07519150n82504K63061L47214n05982o71539J28860N50004j47515N75257q0452
3981.9F07395554l38288J96915L13949M273q81958J38626l5553L5133K77405j24588
3991.5F06981468L44696J00670q6250r63249j51291O66961j41029N1003K26631
4000.2F07029610
##END=$$ End of the data block
