##TITLE=$$ Begin of the data block
##JCAMP-DX=5.00 $$ ACD/SpecManager v 10.08
##SPECTROMETER/DATA SYSTEM=Varian
##DATE=15 Jan 2013 10:11:44
##DATA TYPE=INFRARED SPECTRUM
##DATA CLASS=XYDATA
##ORIGIN=
##OWNER=
##NPOINTS=3735
##FIRSTX=399.26403809
##LASTX=4000.35498047
##MAXX=4000.35498047
##MINX=399.26403809
##MAXY=67.94191742
##MINY=14.12058640
##XFACTOR=1.0000000000
##YFACTOR=0.000000100000000
##FIRSTY=31.51369476
##DELTAX=0.96440572
##XUNITS=1/CM
##YUNITS=TRANSMITTANCE
##XYDATA=(X++(Y..Y))
399.3C15136948j6728268J1037006J2475586k774868m81224m174671l291492n419445
407C05779572j045647L198337N153046P62577o341324K386341K560006K679252j428489
415.7C13703671n09778N431214m533863p820606o291104R041500Q250561l449440j981125
424.3C11841030l895168J421718j715412m684162J043453N014744K954025j539821
432.1C10440407J183681j030674Q82130j127148q165188m09469N454979L214035k909641
440.7C07533112j036263P71275p01924M626580K490825j769028j454143l007011k793808
449.4C04659615J552391J786785K488270K197818N08385o09379k721691J290627l511658
458.1C07641163m625778O66790J437168R24206m381676j416798K004051J31226Q01163
$$ y = [315136948, 298408680, 309445686, 321921272, 319146404, 318665180, 314490509, 311199017, 305779572, 304733925, 307932262, 313085308, 313847885, 307506561, 309892902, 312452908, 315132160, 313703671, 313193893, 318625107, 314091244, 306270638, 299979534, 309021034, 317271595, 313822155, 311841030, 307945862, 309367580, 307652168, 302968006, 304011459, 309026203, 311980228, 310440407, 311624088, 310593414, 311475544, 310348396, 302183208, 301773739, 307228718, 310442753, 307533112, 306496849, 307268124, 306566200, 311192780, 313683605, 311914577, 310460434, 307453423, 304659615, 306212006, 307998791, 310487061, 312684879, 313193264, 312583885, 309862194, 311152821, 307641163, 303015385, 303682175, 305119343, 306043549, 301661873, 300245075, 302249126, 302380352, 303181515]
466.8C03181515O84089j078243j593647N17273n66826k752113r81312l64494L15933
475.5B97362175R72557j465816j794358O77681k379436m111786O54163N165177j413174
484.1B93667183n823002K709580K181034j439934j061249O82659Q83808m41532J606884
492.8B92965431j865997l910198n95589L588009M129600j615314k170410L88241O77871
501.5B91591644o43577k015496j276226q36563j133442k049312Q05607L765640K771149
510.2B90979424r56345l977089m421787j350880K695885J664963j839371k195015m57096
518.9B80142689N07068Q31013o42357r81521L17802Q52642P5569k324905n07259M57401
528.5B78728142J16234j56975j490002N84831Q01030J4782j43338k066536j742725
$$ y = [303181515, 303865604, 302787361, 301193714, 301710987, 301144161, 298392048, 297410736, 297046242, 297362175, 298334732, 296868916, 295074558, 295752239, 293372803, 289261017, 289915180, 295080357, 293667183, 287844181, 290553761, 292734795, 291294861, 290233612, 290916271, 291800079, 291358547, 292965431, 291099434, 287189236, 286593647, 290181656, 294311256, 292695942, 290525532, 290913773, 291591644, 290948067, 288932571, 287656345, 286819782, 285686340, 283637028, 284442635, 288208275, 290979424, 290023079, 286045990, 281624203, 280273323, 282969208, 284634171, 282794800, 280599785, 280142689, 280649757, 281480770, 280838413, 279856892, 280174694, 281027336, 281102905, 278778000, 278270741, 278728142, 278844376, 278687401, 277197399, 277782230, 278583260, 278598042, 278454704, 276388168, 274645443]
537.2B74645443j70765O80351j80092l64933L35389P68795l62740r12800Q26340j389389
546.8B73875599k592678j270943O4316O13193j486091j295147J12991J503620K51084
555.5B69775944k023125j080742j063461j256447M52213L83644j116581N91393N07145
564.2B65169983o61526O07758N51243J076278J319809n43175o60514Q32824j387405
572.9B66305275l055573k46238J294975J437321K26078k31400p88364j306801o84109
581.5B62951164n39016J368160Q71238j02062M56734J76105Q39310O37608l15647j356411
591.2B64987183p93724O41536J254444L84903r48848J62239r5234k83966K49729M12998
600.8B65971260R5673j115551r16844n0373O96507r35765j792297l67222j39599l86619
$$ y = [274645443, 274474678, 275155029, 274974937, 274610004, 274945393, 275714188, 275351448, 274438648, 275264988, 273875599, 271282921, 270011978, 270076294, 270689487, 269203396, 267908249, 268021240, 269524860, 269775944, 267752819, 266672077, 265608616, 264352169, 264804382, 265188026, 264071445, 264662838, 265169983, 264508457, 265116215, 265667458, 266743736, 268063545, 267520370, 266859856, 267692680, 266305275, 263249702, 263003464, 264298439, 265735760, 265961838, 265730438, 264942074, 263635273, 262951164, 262412148, 263780308, 264651546, 264549484, 265006218, 265182323, 266021633, 266659241, 266343594, 264987183, 264193459, 264834995, 266089439, 266474342, 265525494, 265687733, 265592499, 265308533, 265558262, 265971260, 266066933, 264951382, 264034538, 263984165, 264680672, 263744907, 261952610, 261585388, 261445789, 261059170]
610.5B61059170o18153O90632Q04367k93217j431579j699639l47976p29027n03826
619.2B56930752N67398K423992J678200o00739Q09365J497116R29775N95913J91765
627.8B65023537O2446J375466K922649J053505l4561J733723K206401J751862K099800
636.5B78194828J388569n8289N95532J039657l39546N4703J252060R17492J140213
645.2B84185219J402664J050758J067181N89409N40066J130676J166229M4384r94587
653.9B90181999L42961J681099J223068R8915n01766k12136o08825l88070o37283j308842
663.5B89871120n0754M68368J231118K417488o40831j119099Q75378J647129J123085
672.2B95823002o11725m33826M81834Q69026J087132J101303J413250J822414J430149
$$ y = [261059170, 260441017, 261131649, 261936016, 261642799, 260211220, 258511581, 258163605, 257434578, 256930752, 257498150, 259922142, 261600342, 260999603, 261808968, 263306084, 264235859, 264831772, 265023537, 265085983, 266461449, 269384098, 270437603, 270403042, 272136765, 274343166, 276095028, 278194828, 279583397, 279525108, 280120640, 281160297, 280820751, 280875454, 282127514, 283045006, 284185219, 285587883, 286638641, 287705822, 288295231, 288835297, 289965973, 291132202, 291176586, 290181999, 290524960, 292206059, 293429127, 293528042, 293026276, 292814140, 292205315, 291817245, 291179962, 289871120, 289820366, 290288734, 291519852, 293937340, 293296509, 292177410, 293052788, 294699917, 295823002, 295211277, 294777451, 295259285, 296128311, 297215443, 298316746, 299729996, 301552410, 302982559]
680.9C02982559J103840J601353Q83941k53925R20105J948357J177654P49912N7278
689.6C11171074M88548J226959L74394J152134J064205L18699N31387j907O91757O65379
699.2C17682629Q3313O56948Q98952P35836Q82721J340943J107788J648254J532784
707.9C26570168k35558m52766P3509j56937N01900J772652J422920J058807J151886
716.6C31706581M59213L2273O53305J411628J83297k64550P26471J83335Q7166J874351
726.2C37053070K435227J363182J221313R49974K39372L79982O15692O20766J061821
734.9C45940399P82433j20468M69780R15679J247216Q72955K02904Q44917m3449n64118
744.5C50548248P439O85844R06639L97873J047821R16367J092682K129288J458435
$$ y = [302982559, 304086399, 305687752, 306571693, 306317768, 307237873, 309186230, 310363884, 311113796, 311171074, 311659622, 312886581, 313260975, 314413109, 315477314, 315796013, 316327400, 316325493, 317017250, 317682629, 317765942, 318422890, 319321842, 320057678, 320940399, 322281342, 323389130, 325037384, 326570168, 326334610, 325881844, 325955353, 325798416, 326300316, 328072968, 329495888, 330554695, 331706581, 332165794, 332198067, 332851372, 334263000, 334446297, 334181747, 334908218, 335091553, 335178719, 337053070, 339488297, 340851479, 342072792, 343022766, 343262138, 343642120, 344257812, 344878578, 345940399, 346722832, 346602364, 347072144, 347987823, 349235039, 350107994, 350310898, 351155815, 351112366, 350548248, 350555687, 351241531, 352148170, 352546043, 353593864, 354510231, 355602913, 357732201, 359190636]
753.2C59190636N48439M58831M51813P42569P03545M71840J441726J800499J917458
761.9C67727356J657944Q30383N41878q2169o2446k57111O72569J164513k79579m16832
771.5C71496506Q80661J689644L3798P5493M95033o41861p27539q67844l66325m23775
781.2C71643791M02794R00421O90422J688347J685524J681595K23999p29065l14979
789.9C77872849r0371J26915o09817j00899K89078L3607K80342J99128j64872l81431
799.5C77454529j167565k106514j944389j530647r62906j752777j220589J7815r93958
808.2C65792999j157913j237488j780700k131043j506767j429672k127037j410790
815.9C53011589q84323m16374K594N43747O22787M38500J767387K114944J006089R77287
$$ y = [359190636, 359739075, 360197906, 360649719, 361392288, 362095833, 362567673, 364009399, 365809898, 367727356, 369385300, 370215683, 370757561, 370675392, 370612946, 370355835, 371028404, 372192917, 371913338, 371496506, 372377167, 374066811, 374100609, 374176102, 374671135, 374029274, 373301735, 372433891, 372067566, 371643791, 372046585, 372947006, 373637428, 375325775, 377011299, 378692894, 378916893, 378187828, 377872849, 377782478, 377909393, 377299576, 377198677, 377487755, 377521362, 377801704, 378000832, 377835960, 377454529, 376286964, 374180450, 372236061, 370705414, 369742508, 367989731, 366769142, 366786957, 365792999, 364635086, 363397598, 361616898, 359485855, 357979088, 356549416, 354422379, 353011589, 352127266, 351710892, 351713486, 352257233, 352880020, 353318520, 355085907, 357200851, 358206940, 359184227]
825.5C59184227K392082L351898L928414L591919L074836L902665L804321L755989
833.3C86986351K541084J739540J950150J821327K315140J155014J781616K511482
841D02801704K482415J759529O39724K327080K188149Q31299N01327J435280N59692
849.6D15526199M39606J983795J337280K122803J990853K663765J641464N94978K355309
858.3D30656052M88891M22783J439858K116851J717072O12640M94576k91329J94970
867D37852364k47460k78053j061669k295036k484016j986809j429138j824227o59179
875.7D25586777m43650P7858m06456j000289n17960j762886j353836j385918j320267
884.4D17473373r82894m48571o35452r60541L03078n56183n75867j067123q75473J62506
$$ y = [359184227, 361576309, 364928207, 368856621, 372448540, 375523376, 379426041, 383230362, 386986351, 389527435, 391266975, 393217125, 395038452, 397353592, 398508606, 400290222, 402801704, 405284119, 407043648, 407683372, 410010452, 412198601, 413029900, 413531227, 414966507, 415526199, 415965805, 417949600, 419286880, 421409683, 423400536, 426064301, 427705765, 428300743, 430656052, 431144943, 431567726, 433007584, 435124435, 436841507, 437454147, 437948723, 437657394, 437852364, 437604904, 437326851, 436265182, 433970146, 431486130, 429499321, 428070183, 426245956, 425586777, 425143127, 425220985, 424814529, 423814240, 423296280, 421533394, 420179558, 418793640, 417473373, 416490479, 416041908, 415406456, 414445915, 414748993, 414192810, 413616943, 412549820, 411674347, 411836853]
894D11836853m49181p54737r93996N55458L76358p3395l72085j095429o18057k51999
903.7D08159790J561089J391601K210579L127022J894455J783562J443862K007905
911.4D23579865J057662J5297o81114j121330j296387k088241k116166k702255k328453
920D12318878k583427k031746k445145l668518k567673l152084l324738l202972l209877
928.7C86132698l699417l818970k584305k370567j706543j364174j160850j688958
936.4C67738914j857223j028519j419983j617088k168846j864853j288567j081581
944.2C55412254q40416r96780o40335j068688o62803K27699j3924n80940q26645p13043
953.8C49296379j061134j056938j533394j860161j870804k250519k377281k471847
$$ y = [411836853, 411387672, 410632935, 409638939, 410194397, 410570755, 410497360, 410125275, 409029846, 408411789, 408159790, 409720879, 411112480, 413323059, 416450081, 418344536, 420128098, 421571960, 423579865, 424637527, 424652824, 423971710, 422850380, 421553993, 419465752, 417349586, 414647331, 412318878, 409735451, 407703705, 405258560, 401590042, 399022369, 395870285, 392545547, 389342575, 386132698, 382433281, 378614311, 376030006, 373659439, 371952896, 370588722, 369427872, 367738914, 365881691, 364853172, 363433189, 361816101, 359647255, 357782402, 356493835, 355412254, 354571838, 353575058, 352934723, 351866035, 351203232, 351430931, 351417007, 350836067, 350009422, 349296379, 348235245, 347178307, 345644913, 343784752, 341913948, 339663429, 337286148, 334814301]
961.5C34814301k183838k000199j992569j850815j359672j563339k072525j483498
969.2C20307846j338177k069091k758675k771549l255921l697376l309975l716430
976.9B97390652l847847l415394l447800l789120m612121m960957m621849m650707
984.7B64044857m753113m718227l904915m037304m270077l167648k963982k323761
992.4B33905830k386055k795620k614708k158908k090664k574940k028999k698632
1000.1B14557304k388649k077198k356128j584206j733036j521511k130013k474289
1007.8A98292274k196407j356773j392784k356797j457080j363335j272526j235103
1015.5A85661469j170903j987247k356587j786499k505760j714477j645279j065998
$$ y = [334814301, 332630463, 330630264, 328637695, 326786880, 325427208, 323863869, 321791344, 320307846, 318969669, 316900578, 314141903, 311370354, 308114433, 304417057, 301107082, 297390652, 293542805, 290127411, 286679611, 282890491, 278278370, 273317413, 268695564, 264044857, 259291744, 254573517, 250668602, 246631298, 242361221, 239193573, 236229591, 233905830, 231519775, 228724155, 226109447, 223950539, 221859875, 219284935, 217255936, 214557304, 212168655, 210091457, 207735329, 206151123, 204418087, 202896576, 200766563, 198292274, 196095867, 194739094, 193346310, 190989513, 189532433, 188169098, 186896572, 185661469, 184490566, 182503319, 180146732, 178360233, 175854473, 174139996, 172494717, 171428719]
1023.2A71428719q76370j392784j965008k272472l05309r07555o95362o57311o35242
1031.9A61721306l78971r40056O20098j47362N85804J376190J843663K053756N57595
1040.6A67292023O67400J93234J165924Q49971J79825k18868p51915j40171j057663
1049.3A68179760m21295q50392j111793j028996j153831n17826j156616o81553r25904
1058A60331554m07476J40009J202907J853562J404858J504287P46823J721725J047859
1066.6A69546108J351738J257858k99682Q75625J177331J465969J004963L47023l74222
1075.3A76352711P7476J90811n51872N44052O63967J364041M35047L87459R18083O44932
1085A81026707Q24585P8430J658211R26990R07707J084442N03922J810188R81407J357174
$$ y = [171428719, 170552349, 169159565, 167194557, 164922085, 164616776, 163709221, 163013859, 162356548, 161721306, 161342335, 160402279, 161022377, 160875015, 161460819, 162837009, 164680672, 166734428, 167292023, 167959423, 168152657, 169318581, 170168552, 170348377, 170129509, 169377594, 169237423, 168179760, 167758465, 166908073, 165796280, 164767284, 163613453, 163095627, 161939011, 161257458, 160331554, 159924078, 160064087, 161266994, 163120556, 164525414, 166029701, 166776524, 168498249, 169546108, 170897846, 172155704, 171856022, 172731647, 173908978, 175374947, 176379910, 176726933, 176352711, 176430187, 176620998, 176069126, 176613178, 177277145, 178641186, 179076233, 179463692, 180381775, 181026707, 181851292, 181929722, 183587933, 184514923, 185422630, 186507072, 187010994, 188821182, 189802589, 191159763]
1094.6A91159763Q98056R51519R52759L21064J179581Q39462J282921J255913J361484
1103.3B00202522N27382L55053J506844J110134J117554R44480J127911L61195L8604
1112B07291679L93372Q01086J658307J172218P04689j57890M55799O53896l60737k81849
1121.6B12330570L31707O63166l36933J69487K66686N13382J440200J834946K172108
1130.3B19385319J320343J668281J267968J523151K260513J900997J780510J584568
1138B32691650J999512J341286J771164J842041J326732J614857O49414N16377K24743
1146.7B43977776R9296O47469N78861K70081K73666M08363q6002k29511j55220p1125
1156.3B45713654j107560j180153m04167j145305n66407M2477M90131P74250J102257
$$ y = [191159763, 192057819, 193009338, 193962097, 194283161, 195462742, 196302204, 197585125, 198841038, 200202522, 200729904, 201084957, 202591801, 203701935, 204819489, 205763969, 206891880, 207253075, 207291679, 207685051, 208486137, 210144444, 211316662, 212021351, 211863461, 212319260, 212973156, 212612419, 212330570, 212662277, 213325443, 212988510, 213157997, 213424683, 213938065, 215378265, 217213211, 219385319, 220705662, 222373943, 223641911, 225165062, 227425575, 229326572, 231107082, 232691650, 234691162, 236032448, 237803612, 239645653, 240972385, 242587242, 243236656, 243753033, 243977776, 244077072, 244724541, 245303402, 245573483, 245847149, 246255512, 246169510, 245939999, 245784779, 245713654, 244606094, 243425941, 243021774, 241876469, 241310062, 241352539, 241842670, 242616920, 243719177]
1165B43719177J527481J495171K090053J838265K595081K789650K812233L431225K846031
1173.7B65144367L059731L115711K892113L063488L013820K581234K849312K961617
1181.4B88681393K380104J990337J761818K105312K314587J944942J170064J220989
1189.1C03569546J075020P03792M64897m94251n36995l65734m66347o80313o60095
1197.8C02609520l30067n78842p63454j135044j438923j803246k074356j223755q10451
1206.5B92451382r85489n31769Q335o9618l36228k77633m37031n87502r86118j440868
1216.1B86807461j105023o73065l49903j69773m50382q16555p65095n44567p08008
1224.8B81225090j073170j048870j122951j489735j178150n17902j98956m59442j92051
$$ y = [243719177, 245246658, 246741829, 248831882, 250670147, 253265228, 256054878, 258867111, 262298336, 265144367, 268204098, 271319809, 274211922, 277275410, 280289230, 282870464, 285719776, 288681393, 291061497, 293051834, 294813652, 296918964, 299233551, 301178493, 302348557, 303569546, 304644566, 305348358, 305813255, 305319004, 304782009, 304416275, 303949928, 303269615, 302609520, 302279453, 301700611, 300937157, 299802113, 298363190, 296559944, 294485588, 293261833, 292451382, 291465893, 290934124, 290942459, 290872841, 290536613, 290258980, 289821949, 289234447, 288248329, 286807461, 285702438, 285029373, 284679470, 284509697, 284059315, 283242760, 282477665, 281933098, 281225090, 280151920, 279103050, 277980099, 276490364, 275312214, 274794312, 274595356, 274135914, 273943863]
1233.5B73943863N29919j63269p28055q06865o92368m75902k92130J86424m5318j1578
1243.1B71444721j26438k08568m5376l19233k92301m18034m26140p33070n11132j0204
1252.8B68354225P1659L92094Q6498K79732L20187O2332j87569n05199r8114K50511
1262.4B69026356M55265K93026O01063R15355R53293R58633J034642J141777N68142
1271.1B75947552O90250O30741P32575R77153J000672J373310J383610J589699J196136
1279.8B85521698J142426J375808J356507J347866J217174J417046J243286J438064
1287.5B96059875J429387J317978J367340J152267J098595R79748P95841M43535N80768
1296.2C05225334P98454Q08011P21244O06404L46718K27031M07276J98059J97888n6133
$$ y = [273943863, 274473782, 274310513, 273582458, 272775593, 272083225, 271607323, 271315193, 271501617, 271456299, 271444721, 271318283, 271109715, 271064339, 270745106, 270452805, 270034771, 269608631, 268875561, 268364429, 268354225, 268425884, 268817978, 268904476, 269184208, 269504395, 269566727, 269379158, 268873959, 268775845, 269026356, 269481621, 269774647, 270375710, 271291065, 272244358, 273202991, 274237633, 275379410, 275947552, 276637802, 277268543, 278001118, 278978271, 279978943, 281352253, 282735863, 284325562, 285521698, 286664124, 288039932, 289396439, 290744305, 291961479, 293378525, 294621811, 296059875, 297489262, 298807240, 300174580, 301326847, 302425442, 303405190, 304201031, 304644566, 305225334, 306023788, 306831799, 307553043, 308159447, 308506165, 308733196, 309140472, 309338531, 309536419, 309480286]
1305.8C09480286o0921n35679j050587n52177n64537l09830m79488p37515m15058l28712
1315.4C04445782l80135r4261O51150L84769N89523P74804M94670Q36201Q25730P21035
1325.1C09249268K66590K87265L51105K93808j48735o84814o44055r33857k51064m68025
1334.7C07317486r08642r1858L07655M86470k16542L89023J032601N14106N02510O38752
1344.4C09971561P39174L29247O71635R79137O65455j6251j86977j85166l73573j29356
1354C12464886p19872p42588n24387q450K50206n40581n66902j54953j50451r60827
1363.7C08346081N8384N626o83097m02699r04350m84963j89151k4090n6782n8346K85854
1374.3C05892467J28747N69934m25453k49691Q8387l01171k58102o25706o25191j449527
$$ y = [309480286, 309419365, 308883686, 307833099, 307280922, 306716385, 306406555, 305927067, 305189552, 304774494, 304445782, 304065647, 303971386, 304622536, 305007305, 305596828, 306371632, 306866302, 307702503, 308528233, 309249268, 309515858, 309803123, 310154228, 310448036, 310299301, 309614487, 308970432, 308036575, 307785511, 307317486, 306408844, 306316986, 306624641, 307111111, 306894569, 307283592, 308316193, 308830299, 309332809, 309971561, 310710735, 311039982, 311711617, 312690754, 313356209, 313339958, 313152981, 312967815, 312594242, 312464886, 311745014, 311002426, 310478039, 310469589, 310719795, 310179214, 309612312, 309457359, 309306908, 308346081, 308404465, 308410091, 307726994, 307324295, 306419945, 305934982, 305745831, 305721741, 305664959, 305606613, 305892467, 306021214, 306591148, 306165695, 305916004, 306004391, 305703220, 305445118, 304819412, 304194221, 302744694]
1383.9C02744694j125145l88451m47025j965313k044869r55944j873607j792450j405831
1392.6B90746059j205196k413616l458100j343536j597423j591301k808838k598534
1400.3B73729515j421413k200795k036266j857872k700214k434979j379261j490345
1408B58208370j790905j573925j725921j080456j298619j330776j010818j151219m19826
1416.7B46825905p00474l06263j769504n7183J038666k87132L88260j90277L76701
1425.4B45318699N39150M85935J112652J49479Q93726Q28934K087059J849709J208572
1434.1B54473915J825485J101876K397327Q84419K225475J855125J411438J731530
1441.8B67906590J435623K531738J591816K450390J954593J154957J005955J253910
$$ y = [302744694, 301619549, 301231098, 300784073, 298818760, 296773891, 295817947, 293944340, 292151890, 290746059, 289540863, 287127247, 283669147, 282325611, 280728188, 279136887, 276328049, 273729515, 272308102, 270107307, 268071041, 266213169, 263512955, 261077976, 259698715, 258208370, 256417465, 254843540, 253117619, 252037163, 250738544, 249407768, 248396950, 247245731, 246825905, 246125431, 245819168, 244049664, 243992481, 245031147, 244744015, 245132275, 244941998, 245318699, 245857849, 246343784, 247456436, 247605915, 248499641, 249328575, 251415634, 253265343, 254473915, 256299400, 257401276, 259798603, 260683022, 262908497, 264763622, 266175060, 267906590, 269342213, 271873951, 273465767, 275916157, 277870750, 279025707, 280031662, 281285572]
1449.5B81285572K101231R92965J985226J226063J875610K003594Q47358K444325K86884
1458.2B95048828M353008K088299K577629K213421J884022K900066L85552K800007
1465.9C14250832K590408K954388K978077K910347L415374J999207L711929L080368
1473.6C37890930M087639L755455K701111K606277K833214L094750K266731K465324
1481.3C61701431K065926J548157J500091J164627J436959O46171J80664J238098K19002
1490C71701126l22647K81639L97034p49436j179084n78576m389686o84013j149331
1498.7C63327026k579231n44701j244316p60040o10771L00064k61154l182335k852669
1507.3C51591873p11670L79677q71048M26025j404075j470490p6942j181107m57115
$$ y = [281285572, 283386803, 284379768, 286364994, 287591057, 289466667, 291470261, 292317619, 294761944, 295048828, 299401836, 301490135, 304067764, 306281185, 308165207, 311065273, 311450825, 314250832, 316841240, 319795628, 322773705, 325684052, 329099426, 331098633, 334810562, 337890930, 341978569, 345734024, 348435135, 351041412, 353874626, 356969376, 359236107, 361701431, 363767357, 365315514, 366815605, 367980232, 369417191, 370063362, 370244026, 371482124, 371701126, 371378479, 371660118, 372057152, 371307716, 370128632, 369550056, 365160370, 364476357, 363327026, 360747795, 360203094, 358958778, 358198738, 357587967, 357888031, 357626877, 354444542, 351591873, 350880203, 351259880, 350388832, 350814857, 349410782, 347940292, 347863350, 346682243, 346225128]
1516C46225128j830559j506157P07016Q95348j121521j732254K69547O67495J827355
1524.7C44401398o50711O0119O91109J38397O70891J31149L6469k9106l3150j838417
1534.3C43578148Q49647R14307O82907J918068m76227k520446j30387M23584r97124
1543C44242477Q95043P95822j033096J578331L87535M07829j82686m1542J027031j39046
1552.7C47937698N30739j897735K41432R58137K01607k697105n459862M164925p13501
1561.4C43266335L46488j233329j119614k683220l111496j424103k370758j224899
1569.1C30445404p138557j919823k139454l222942k639141l503743k212543j2172089
1576.8B95497112j522808l287716m175625l783302n278339l354473n481434l111115
$$ y = [346225128, 344394569, 342888412, 343595428, 344490776, 343369255, 341637001, 341906548, 342574043, 344401398, 343750687, 343810806, 344501915, 344640312, 345311203, 345442352, 345478821, 345449715, 345416565, 343578148, 344427795, 345342102, 346025009, 347943077, 347466850, 344946404, 344816017, 345239601, 344242477, 345137520, 345933342, 344900246, 346478577, 346866112, 347273941, 347091255, 347049713, 348076744, 347937698, 348468437, 346570702, 346812134, 347770271, 347971878, 345274773, 339814911, 343979836, 343266335, 343612823, 342379494, 341259880, 338576660, 335465164, 334041061, 331670303, 330445404, 323306847, 321387024, 319247570, 316024628, 313385487, 309881744, 307669201, 295497112, 293974304, 290686588, 286510963, 282727661, 277449322, 274094849, 268613415, 265502300]
1584.5B65502300m849548m200878m395142n397453l109512n477810l035584n202942
1592.2B29833431k781353l242454m329605k025376m110355j657810m192715k177448
1599.9B05316315l452721l175545j435985l126259l95241k712211n25094k478027j311207
1608.6A86704025j289921k257251O71081k657509p0915j448803N12066N09148l493347
1617.3A77178574J301422j408501J149120j316852Q43296j14422j605701J547279m36707
1626A77137508J592617j659145J499367Q19206J048603J078186k78473J902619p52468
1634.6A82388020K723693j243171J927585J162796N16129K018852j43032K342968L16010
1643.3A92009850J989479J570949l51848K816753j323528K987194O75201K667256J319389
$$ y = [265502300, 260652752, 256451874, 252056732, 246659279, 243549767, 238071957, 235036373, 229833431, 227052078, 223809624, 219480019, 217454643, 213344288, 211686478, 207493763, 205316315, 201863594, 198688049, 197252064, 194125805, 193730564, 191018353, 190493259, 188015232, 186704025, 185414104, 183156853, 183827934, 181170425, 181099510, 179650707, 180162773, 180671921, 177178574, 178479996, 177071495, 178220615, 176903763, 177747059, 177632637, 176026936, 177574215, 177137508, 178730125, 177070980, 178570347, 179389553, 180438156, 181516342, 181237869, 183140488, 182388020, 185111713, 183868542, 185796127, 186958923, 187475052, 189493904, 189350872, 191693840, 192009850, 193999329, 195570278, 195218430, 198035183, 196711655, 199698849, 200374050, 203041306, 204360695]
1652B04360695j187763L623924q94451L677749R31302K255058J046009J848507J885032
1660.7B17546062J630917L385735J95255L391056J803417K857037K643394J733990
1668.4B35186863K666111J420307M759064J740150L908463K970867K250328L943291
1676.1B58845444K928886M507084K651005M262676K713165M150906N440578K318592
1683.8B87818336N420647K476196O272202M270267M523583M626388L914261N142765
1691.5C24464645L963585N226212M808807M721184L809967O143646O358834N369567
1699.3C64866447O479531J077690O578102N166473M330407L936462L803673L525314
1707C99764099L205757M309998K948875K974510L279534L221283L320617Q45032J113129
$$ y = [204360695, 203172932, 206796856, 205902405, 209580154, 210511456, 212766514, 213812523, 215661030, 217546062, 219176979, 222562714, 222757969, 226149025, 227952442, 230809479, 233452873, 235186863, 237852974, 239273281, 244032345, 245772495, 249680958, 252651825, 254902153, 258845444, 261774330, 266281414, 268932419, 273195095, 275908260, 280059166, 285499744, 287818336, 293238983, 295715179, 301987381, 306257648, 310781231, 315407619, 319321880, 324464645, 328428230, 333654442, 338463249, 343184433, 346994400, 353138046, 359496880, 364866447, 371345978, 372423668, 379001770, 384168243, 388498650, 392435112, 396238785, 399764099, 402969856, 407279854, 410228729, 413203239, 416482773, 419704056, 423024673, 423869705, 424982834]
1715.6D24982834L419456K960930k997360L064079L740006K271766K427788J292420
1723.4D41161919R77401J826134J805649J354561J503715J975975L99704J361161L535003
1732D55901222L874130n11970l118172M951515M005585K541771L072243J432113K66686
1740.7D72415123M553413M158783K352410L076057M354973M526138L439179L613929
1748.4E02490005L746949N874290L512345K374229O273422M593811M598046M534568
1756.2E37997665K128258L647995M025688L981438M425774O55555J555939M491577
1763.9E62909889K678910K543373L296699K732048n00068K895507M893113J451263
1771.6E82900734o17485j178551M639359L190155j4496K717018J352463K329407J494598
$$ y = [424982834, 428402290, 431363220, 428365860, 431429939, 435169945, 437441711, 439869499, 441161919, 442139320, 443965454, 445771103, 447125664, 448629379, 450605354, 451005058, 452366219, 455901222, 459775352, 459263382, 456145210, 461096725, 465102310, 467644081, 470716324, 472148437, 472415123, 476968536, 481127319, 483479729, 486555786, 490910759, 495436897, 498876076, 502490005, 506236954, 512111244, 515623589, 517997818, 524271240, 528865051, 533463097, 537997665, 540125923, 543773918, 547799606, 551781044, 556206818, 556862373, 558418312, 562909889, 565588799, 568132172, 571428871, 574160919, 573660851, 576556358, 581449471, 582900734, 582283249, 581104698, 585744057, 588934212, 588919716, 591636734, 592989197, 595318604, 596813202]
1780.3E96813202q2779K005692K040023J926728L12347Q30612J809426J447944J509209
1788.9F08612404K648010J815910J014138r50737m58451M012642J416092J4229J593819
1797.6F19718056J732559P12280l03116L010407P75833J095314K284203J026268J229515
1806.3F31281319M52041Q49152J064491J148644p72362J109619K115822L88527J463852
1815F39101105P13691J295357L31040M05731J140823R1629J204300R5368J711502J674118
1824.6F47764664k108231O49414K378159K232284J37482l138046P01675K589722M25491
1833.3F51632614L79791R85032J019210Q90503k50320J201172L68499N05906O02951
1842F57335358J504059N45883n653611K630845K674102O84662L48816P60803J528015
$$ y = [596813202, 596730423, 598736115, 600776138, 602702866, 603015213, 603845825, 605655251, 607103195, 608612404, 611260414, 613076324, 614090462, 613139725, 612681274, 616693916, 618110008, 618124237, 619718056, 621450615, 622162895, 621859779, 624870186, 625646019, 626741333, 629025536, 630051804, 631281319, 631733360, 632582512, 633647003, 634795647, 634023285, 635132904, 637248726, 637637253, 639101105, 639814796, 641110153, 641441193, 641846924, 642987747, 643079376, 644283676, 644379044, 646090546, 647764664, 645656433, 646305847, 648684006, 650916290, 651053772, 647915726, 648617401, 651207123, 651632614, 652012405, 652997437, 654016647, 654907150, 654656830, 655858002, 656226501, 656732407, 657335358, 658839417, 659385300, 653731689, 656362534, 659036636, 659721298, 660070114, 660830917, 662358932]
1850.7F62358932K6551Q00781O5537O6070J4038p3242P78275o8360Q78754O77490Q74252
1861.3F66399078N69458L21122Q3465p9040N93185n01938J050720r15908j288147J642074
1870.9F67874069J262436P12128P5073R01871j28784J03912L20511R4757J72806n49546
1880.6F70839233P11899K24228R31778M13895l34778L84674k88696Q52203m16946j150360
1890.2F72167130Q36029R31243P1106L49579N68009l04871P72629J3885J76087J82571
1899.8F75763397K1973L60260m90418J94550j69525O23855O18668J95847L25164j87683
1909.5F77256088j13601n40696N57328l45536j831K71073N37414J732941k075272n11551
1919.1F76766357J358643Q45795L22265j399383n37262K08130O18591j41602J18027
$$ y = [662358932, 662385483, 663186264, 663251801, 663317871, 663331909, 663258667, 664036942, 663968582, 664847336, 665524826, 666399078, 666968536, 667289658, 667373123, 667294083, 667887268, 667385330, 668436050, 667520142, 666231995, 667874069, 669136505, 669848633, 669923706, 670825577, 670696793, 670800705, 671121216, 671215973, 671388779, 670839233, 671551132, 671775360, 672707138, 673121033, 672786255, 673170929, 672882233, 673734436, 673317490, 672167130, 673003159, 673934402, 674005508, 674355087, 674923096, 674618225, 675390854, 675404739, 675580826, 675763397, 675785370, 676145630, 675655212, 675849762, 675680237, 676304092, 676922760, 677118607, 677443771, 677256088, 677142487, 676601791, 677159119, 676813583, 676811752, 677082825, 677620239, 679353180, 677277908, 676766357, 678125000, 678970795, 679293060, 677893677, 677356415, 677564545, 678183136, 678041534, 678159561]
1927.8F78159561Q9188R5062N12009M2953N12543o45599k58484j47095N2185K63519
1937.5F78675842l84674K74353k50015J103668l76663j917267J169357R23539k29721
1946.1F78988419q00629j05438o19583l81928L15247L60183L07999k22015M58526j98440
1955.8F78102341J51977j13449q30917k43912k10037J65481l94516L54996L45001j82037
1965.4F77144928k9602j92337M35943K15302M8447p23038m74625j27105R2239J78680
1975.1F76568832j52893P46765r5672n9052M1733m12140l17688j65481K89535n69687
1984.7F75874252r5977J5716J76544J07804l60413M42505j92871p76444o48498M13742
1994.3F74956360k8687m13055N9357n17121K71683l7613r4376k75955k29416N6839
$$ y = [678159561, 678248749, 678343811, 678855820, 678898773, 679411316, 678765717, 678507233, 678360138, 678412323, 678675842, 678291168, 678565521, 678315506, 679419174, 679042511, 677125244, 678294601, 679218140, 678988419, 678187790, 678082352, 677462769, 677080841, 677396088, 677756271, 678064270, 677842255, 678300781, 678102341, 678254318, 678140869, 677309952, 677066040, 676856003, 677021484, 676626968, 676981964, 677326965, 677144928, 677115326, 676922989, 677358932, 677574234, 677622681, 676899643, 676425018, 676297913, 676390152, 676568832, 676415939, 677162704, 677067032, 677007980, 677049713, 676637573, 676319885, 676154404, 676443939, 675874252, 675778275, 675793991, 675970535, 676078339, 675717926, 676160431, 675967560, 675191116, 674542618, 674956360, 674927673, 674514618, 674573975, 674056854, 674328537, 674290924, 674196548, 673920593, 673691177, 673748016]
2004F73748016k80304J5946p45011k1743j07041l24630P3089j09482R3460l61480K34222
2014.6F72215042j77154m17252p53479l52478J78070p07931N2185m88968J04599L13873
2024.2F69966507j30692J65177o43463k19040p03507k09884o8665k19269k38037p64160
2033.9F66934967K39029j55258n3177k60925l00599j92260l60947J05515m88434q6899
2043.5F65381012n90820k33384J15433j02463Q5450n45502K58255j77460l37448o09131
2053.2F63243942n11627K81067k41928J53122k90909k76947k44522J70364K96479j67008
2062.8F62412033J90964n85327j99204k70691p5760m1122l39584K77786j81503p8202
2072.5F61109390l60107L5858j24435j60752P935n67703J49612m94385j8310K51922
$$ y = [673748016, 673467712, 673483658, 672738647, 672716904, 672609863, 672285233, 672358322, 672248840, 672342300, 671980820, 672215042, 672037888, 671620636, 670867157, 670514679, 670692749, 669984818, 670037003, 669548035, 669652634, 669966507, 669835815, 670000992, 669357529, 669138489, 668434982, 668225098, 668156433, 667937164, 667699127, 666934967, 667173996, 667018738, 666965561, 666704636, 666404037, 666211777, 665850830, 665956345, 665467911, 665381012, 664790192, 664556808, 664672241, 664569778, 664655228, 664109726, 664367981, 664190521, 663853073, 663243942, 662732315, 663013382, 662771454, 662924576, 662633667, 662356720, 662112198, 662282562, 662579041, 662412033, 662602997, 662017670, 661818466, 661547775, 661472015, 661430893, 661091309, 661369095, 661187592, 661109390, 660749283, 660785141, 660660706, 660499954, 660507889, 659940186, 660089798, 659595413, 659577103, 659829025]
2082.1F59829025q7509k77405n41839M88510R3765r6741q14972m07180q545p38297
2091.7F57438812j90201l64608J65710j71966p9575J46713j74560j78681o66961o6758
2101.4F55857925m71496j56632j74331j74637L66058k29645k7618n16434j28860q3695
2111F54260635k91977l35769m22516q7204p38525L662o6681K441L3493j97067L14636
2121.6F52475128l52936j44577m39911j60903m2496j44882K9678l67355J18332l12195
2131.3F50657883L14789R8724j61209O73904P0496l33481o84433l89099m58069M58984
2140.9F50248489P35703J29471K21023l37372O0349l60642M8066j57776l55072M39834
2150.6F50672073l83453k0523r2468K67563M39224M06036K44675n67398l5706k80990
$$ y = [659829025, 659741516, 659464111, 658922272, 659410782, 659504547, 659407806, 658592834, 658185654, 658177109, 657438812, 657248611, 656884003, 657049713, 656877747, 656798172, 656944885, 656770325, 656591644, 655924683, 655857925, 655386429, 655229797, 655055466, 654880829, 655246887, 655017242, 654989624, 654473190, 654344330, 654260635, 653968658, 653632889, 653210373, 653123169, 652384644, 652388306, 652321625, 652324066, 652357559, 652160492, 652475128, 652122192, 651977615, 651537704, 651376801, 651334305, 651189423, 651219101, 650851746, 650970078, 650657883, 650972672, 651071396, 650910187, 651584091, 651654587, 651321106, 650636673, 650247574, 649789505, 650248489, 650984192, 651113663, 651334686, 650997314, 651057663, 650697021, 650745087, 650587311, 650232239, 650672073, 650288620, 650268097, 650175629, 650443192, 650882416, 651288452, 651533127, 650965729, 650930023, 650649033]
2160.2F50649033K45514o0273j40381L70179j74332j60065k97165N77546o1188p2632
2169.9F50876236L95508j46561M3182l93295J93711l8758P0648M87976L35389L10135
2179.5F52134171j10550J24130l02429J40228q0261k52915K18201O6299M61197L45078
2189.1F52743149L48358n05371n0125K43835r0484J41601m34418K09809j72730J04904
2198.8F52538528K1363J10321Q05893p3471M39682k2278K89917j94702r81522M425
2208.4F52938156J4649L99398q0490L71857L20587K27509M48303l18833j0681m84924
2218.1F53825531n5618J2741J5106J33820p8736L71247O4773L94364j07880j12915
2227.7F54462433l60260k19422N20096k50625R231m44183j29395l9825P0267O43997
$$ y = [650649033, 650894547, 650834274, 650693893, 651064072, 650889740, 650729675, 650432510, 651010056, 650948868, 650876236, 651271744, 651125183, 651168365, 650775070, 650968781, 650930023, 651000671, 651488647, 651824036, 652134171, 652023621, 652147751, 651845322, 651985550, 651905289, 651652374, 651870575, 651936874, 652398071, 652743149, 653091507, 652586136, 652536011, 652779846, 652689362, 652830963, 652396545, 652606354, 652433624, 652538528, 652559891, 652670212, 653476105, 653402634, 653842316, 653820038, 654109955, 653915253, 652933731, 652938156, 652952805, 653352203, 653271713, 653643570, 653964157, 654191666, 654639969, 654321136, 654310455, 653825531, 653769913, 653782654, 653797760, 653931580, 653852844, 654224091, 654288864, 654683228, 654575348, 654462433, 654102173, 653882751, 654402847, 654152222, 654161453, 653717270, 653587875, 653548050, 653618317, 654262314]
2237.4F54262314n9433J57013k7771J85928l46680k39868l509m13132L98941p8735
2247F53835068J19705j10703k5329J71585R613M21600n11169k75955j48774J74408
2256.7F53660049J7014k62299K40326r3841L21197j9836K1286j55106n5542K64130
2266.3F53937378j35880q1024o82525K65197L44010J08795J99280k30561k5253n67474
2275.9F53131943k09503k12174K35596P2479n11551j54342k43454K83813k6855N63735
2285.6F52929687J78681m59290l1967m71725o0349l46679r537m03061l53928L31345
2295.2F51303177J64261N85861j90888O7826j49689k61078m29077p88269J09634J07041
2304.9F50518799P77511Q1253M05350K21939o46515K84043j28784K64511j179886j026230
$$ y = [654262314, 654202881, 654359894, 654332123, 654518051, 654171371, 653931503, 653927994, 653514862, 653913803, 653835068, 653954773, 653844070, 653818741, 653990326, 653999939, 654421539, 653910370, 653634415, 653485641, 653660049, 653677063, 653414764, 653655090, 653561249, 653882446, 653862610, 653883896, 653728790, 653673248, 653937378, 653801498, 653720474, 653037949, 653303146, 653647156, 653755951, 653955231, 653724670, 653699417, 653131943, 652922440, 652710266, 652945862, 653018341, 652506790, 652352448, 652108994, 652392807, 652365952, 652929687, 653108368, 652649078, 652617111, 652145386, 652085037, 651738358, 651728821, 651325760, 650971832, 651303177, 651467438, 652053299, 651862411, 651930237, 651780548, 651519470, 651090393, 650302124, 650411758, 650518799, 651296310, 651377563, 651782913, 652004852, 651358337, 651642380, 651513596, 651778107, 650598221, 649571991]
2314.5F49571991K39105L56217Q71124m95606r7808k900K55356N3253l32336k70004
2324.2F50148392o14853P71942m3640N6381J1597k55585k27737K43225J125106p79724
2333.8F50435104o01349j187210q30001l9063J09329K84882n49011R12246j41983N20783
2343.4F48913727O27899o64368p49893j463623r12399n799J383591J51520o23856K03400
2353.1F46860199J50452J324005K46963j45950k305450j083451M65470J96914Q52280
2361.8F46561432k28653L8223j988373n40008p67212m3335J736679l54385l63465j222458
2371.4F42828445j220016j407547n70374j78337k95868L38402l81851P1602o44837
2380.1F38539619n70373m31938r03015l92495q92028n96047l32870O0691Q8387k3460
$$ y = [649571991, 649811096, 650167313, 651038437, 650542831, 650445023, 650442123, 650697479, 650750732, 650418396, 650148392, 649533539, 650305481, 650261841, 650318222, 650329819, 650074234, 649846497, 650089722, 651214828, 650435104, 649833755, 648646545, 647816544, 647777481, 647886810, 648171692, 647622681, 648534927, 648392944, 648913727, 649541626, 648877258, 648127365, 646663742, 645751343, 645745544, 647129135, 647280655, 646656799, 646860199, 647010651, 648334656, 648581619, 648435669, 646130219, 645046768, 645512238, 645709152, 646561432, 646332779, 646371002, 644382629, 643842621, 643075409, 643032074, 644768753, 644414368, 644050903, 642828445, 641608429, 640200882, 639630508, 639452171, 639156303, 639494705, 639112854, 639184456, 638539619, 637969246, 637537308, 636634293, 636241798, 635349770, 634753723, 634420853, 634481544, 634569931, 634546471]
2389.7F34546471P286o37741j70060k41470m15268p84836o11267j26037l56751j74064
2399.4F31036263l01438J64299k55966k73743j77040o30569L8185k84729q84171j181984
2409F27249107k74620J29013j08451M3983n91011n39932m97284P7858k57416o94580
2418.7F24536667l21694q32290m78668k43836o7062j06583k41127m26636n84983o20766
2428.3F20613022j012268l71857m05121n41038p49855m71154K49978j06888k5749m51890
2438F16727180j97906l35922o25954n01213r52225m53415o19774m22019l69492k03514
2447.6F12045746L5400m90646k90794o40984m49600l60260n89867j001854q29811j17378
2457.2F07309952n73502o1226j7624k13584m76456q00858n23300q77075p89642p60804
$$ y = [634546471, 634553757, 633916016, 633745956, 633504486, 633089218, 632304382, 631693115, 631567078, 631210327, 631036263, 630734825, 630899124, 630643158, 630369415, 630192375, 629561806, 629599991, 629315262, 628431091, 627249107, 626974487, 627103500, 626995049, 627039032, 626448021, 625908089, 625410805, 625488663, 625231247, 624536667, 624214973, 623382683, 622904015, 622660179, 622593117, 622486534, 622245407, 621818771, 621233788, 620613022, 619600754, 619228897, 618823776, 618282738, 617532883, 617061729, 617311707, 617204819, 617179070, 616727180, 616529274, 616193352, 615567398, 615066185, 614113960, 613660545, 613040771, 612618752, 612249260, 612045746, 612081146, 611590500, 611299706, 610658722, 610209122, 609848862, 609258995, 608257141, 607427330, 607309952, 606736450, 606675224, 606657600, 606444016, 605967560, 605166702, 604643402, 603766327, 602976685, 602215881]
2466.9F02215881k86178l18718m02298k34184m03023j22147p74956o98547o32133o88515
2476.5E97655182o40488o72836k24533o57005m43955n24483o72187n35813m58488j92528
2486.2E92632866n93109p28455q42361l92113n17616o61240m20113n35392l90053n78880
2495.8E86973534j93520q19511j034432o70280n38826j99890j001816n28183j68381
2504.5E81818695k90947o87942p99904l20740p74879n82314j108971o46743k55967
2513.2E76350288o75087j91001n57557m62417n78003k67983k73819o32248l24516m48036
2522.8E71939621p35779j428795m94384j60790m70390l74069o96450k6474l34129n09110
2532.5E66709251m56886p19452r36546p74193N7335m76799q86803m13398L0098n05791
$$ y = [602215881, 601929703, 601610985, 601208687, 600974503, 600571480, 600449333, 599674377, 598975830, 598343697, 597655182, 597014694, 596341858, 596117325, 595460320, 595016365, 594491882, 593819695, 593283882, 592825394, 592632866, 592039757, 591311302, 590468941, 590076828, 589559212, 588897972, 588477859, 587942467, 587552414, 586973534, 586780014, 585960503, 584926071, 584255791, 583716965, 583517075, 582515259, 581987076, 581818695, 581527748, 580839806, 580039902, 579719162, 578944283, 578361969, 577252998, 576606255, 576350288, 575675201, 575484200, 574926643, 574464226, 573886223, 573618240, 573344421, 572712173, 572387657, 571939621, 571203842, 569775047, 569280663, 569119873, 568649483, 568275414, 567578964, 567552490, 567218361, 566709251, 566252365, 565532913, 564596367, 563822174, 563879509, 563402710, 562515907, 562102509, 562132607, 561626816]
2542.1E61626816o52580j79139m31518m60472q88634q80661o68602j91803l26118j012841
2551.7E55934448n00755k65884r6207n05257n72052n90629p05986l27263n28298l66058
2561.4E51476059p88765m72145l20015n67589j23405m68064o40182j096306o10466
2570.1E46389122j48964j71585l76587j011047m11492n02586m37317j05667k73018
2578.7E42950859n87311n03998l90472j043358n76095p42417n42679j75476m79889
2587.4E37909164j53884o01426n05333m45365k45858m14962q94471m84047m32624n89791
2597.1E33141403j087303n58624m39873o33049l34434l77465m28810j018371l13912
2605.7E27949562n08308q26874l07732q01811n30739m94919m41703q49762q72231m08401
$$ y = [561626816, 560974236, 560795097, 560363579, 559903107, 559014473, 558133812, 557465210, 557273407, 556947289, 555934448, 555433693, 555167809, 555071602, 554566345, 553994293, 553403664, 552697678, 552370415, 551842117, 551476059, 550687294, 550215149, 549895134, 549327545, 549204140, 548736076, 548095894, 546999588, 546389122, 546240158, 546068573, 545691986, 544680939, 544269447, 543766861, 543329544, 543223877, 542950859, 542363548, 541859550, 541469078, 540425720, 539849625, 539107208, 538564529, 538389053, 537909164, 537755280, 537153854, 536648521, 536203156, 535957298, 535542336, 534647865, 534163818, 533731194, 533141403, 532054100, 531495476, 531055603, 530422554, 530088120, 529710655, 529281845, 528263474, 527949562, 527441254, 526614380, 526306648, 525504837, 524974098, 524479179, 524037476, 523187714, 522315483, 521907082]
2615.4E21907082p79725n60417o17675o18821o27174o43158o51779o39229p44591q48770
2625E15175743p4844m40521p83768o58188p27806m94270o89087q15506n29137j80473
2634.7E09782143p19376p94144m90684n38712p23724r49173n00641n74646l30620o13517
2644.3E03546906q12302j82419p52716q96339o62499o65054r17969l59802O6528o85272
2654D97679062p39174p56569n25551m08287l48472n31044o93245m25682n48668l12081
2663.6D92390289p88536n86815l51829o62651j90621m89769o74057o68296k5826K1095
2673.3D87972984q58459o70624k74582k11639o17028m87899m62456q97331j120453
2681.9D82372513l44582M02603n51262p42530m16603k55928o39420p65190k71149o26144
$$ y = [521907082, 521127357, 520566940, 519949265, 519330444, 518703270, 518060112, 517408333, 516769104, 516024513, 515175743, 515100899, 514660378, 513876610, 513218422, 512490616, 511996346, 511307259, 510491753, 509962616, 509782143, 509062767, 508268623, 507777939, 507239227, 506515503, 505566330, 505065689, 504491043, 504160423, 503546906, 502734604, 502552185, 501799469, 500903130, 500240631, 499575577, 498657608, 498297806, 498364334, 497679062, 496939888, 496183319, 495657768, 495249481, 494901009, 494369965, 493676720, 493251038, 492702370, 492390289, 491601753, 491014938, 490663109, 490000458, 489809837, 489320068, 488646011, 487977715, 487951889, 487972984, 487114525, 486443901, 486169319, 485957680, 485340652, 484852753, 484390297, 483492966, 482372513, 482027931, 482430534, 481879272, 481136742, 480720139, 480464211, 479824791, 479059601, 478788452, 478162308]
2691.6D78162308m07715n13764p05795n97572q4953J71203n96924m11567m49601n82428
2701.2D73983192o97631m47426l66135r38415k70310n9776l26996n69534k53601l34168
2710.9D69719200q07152j44424m36058n00641k66304m42429n80825n59349m01574n12046
2720.5D65068398O904r7618k75955k28577l98750o41976q60099k94342k23961j83525
2730.2D61870499j80054k84882n21316m53949o4087l32489O8664l00445p11136o06499
2739.8D58484306m78973j16425k64091K25181Q3580J36109j145m83818m11491q41293
2749.4D56331940m00276m35601m15649m91219m63562L03078j74866j21269j47743l81851
2759.1D53602982m16031m87061l77998o71120n70679n04036j09634k403k53144k52876
$$ y = [478162308, 477754593, 477240829, 476535034, 475937462, 475852509, 476023712, 475426788, 475015221, 474565620, 473983192, 473285561, 472838135, 472472000, 471533585, 471263275, 471203499, 470876503, 470306969, 470053368, 469719200, 468912048, 468767624, 468331566, 467830925, 467564621, 467122192, 466541367, 465982018, 465580444, 465068398, 465075302, 464977684, 464701729, 464473152, 464074402, 463432426, 462572327, 462277985, 462054024, 461870499, 461690445, 461405563, 460884247, 460430298, 460366211, 460033722, 460102386, 459801941, 459090805, 458484306, 458005333, 457888908, 457624817, 457849998, 457933578, 458069687, 458068542, 457584724, 457173233, 456331940, 455931664, 455496063, 455080414, 454589195, 454125633, 454428711, 454253845, 454132576, 453984833, 453602982, 453186951, 452699890, 452321892, 451650772, 451080093, 450576057, 450466423, 450464020, 450210876, 449958000]
2768.7D49958000l60832n65910o72684j65062m20799l70789j49956p56073q47969n55687
2778.4D45092239k90298l69454k38990n58281n65338m34418r00688n53322l60260l36533
2788D40484657n94101m57496l96729q97560o49300o57615o99768o89659n42870p45201
2797.7D34154358o20842k85225q31871o33163o92406o91033o52732o76728o19163j109047
2807.3D27342148o84204p95670r65004p69462r70574q43048q96072q56934o76689n44548
2816.9D19339943j018257j259880r71451r44595r79844q43467n18494r17206j091499
2825.6D10795250p62749o68335j117363j453438j230583p55577l03230j668129j535187
2834.3D01300659n03197j398887j404190j541329j511955j408882j734123j894646
$$ y = [449958000, 449597168, 449031258, 448358574, 448193512, 447772713, 447401924, 447251968, 446495895, 445647926, 445092239, 444801941, 444432487, 444193497, 443635216, 443069878, 442635460, 441734772, 441181450, 440821190, 440484657, 439890556, 439433060, 439036331, 438138771, 437489471, 436831856, 436132088, 435442429, 434899559, 434154358, 433533516, 433248291, 432416420, 431783257, 431090851, 430399818, 429747086, 429070358, 428451195, 427342148, 426657944, 425862274, 424897270, 424127808, 423157234, 422314186, 421418114, 420561180, 419884491, 419339943, 418321686, 417061806, 416090355, 415145760, 414165916, 413322449, 412803955, 411886749, 410795250, 410032501, 409364166, 408246803, 406793365, 405562782, 404807205, 404503975, 402835846, 401300659, 400797462, 399398575, 397994385, 396453056, 394941101, 393532219, 391798096, 389903450]
2842C89903450k214127j997337k083168k195091k264481k226295k438813k410812j852989
2850.7C70220337k158432j441231n63583q57697p33909O7482J78794j62582K87514
2859.4C64836693J02463o16036q55675k85072k53487p53173p50466j085968q92410
2868.1C59446869r49783q28476l54424o49223q33473q58727p28645o48308l27988q21037
2877.7C52446785j139450n13268o01005o52390r55543j168785j140747q40302p36656
2886.4C44698639p87392m84390j183014j156158j038094j140518q20198j207695j213494
2895.1C35667686j009788o31523p08466q31718p16095j050224p99523k42081l59535
2903.7C29318733j260795r77784n56793r10911r69887j256790j129532j427117j633529
$$ y = [389903450, 387689323, 385691986, 383608818, 381413727, 379149246, 376922951, 374484138, 372073326, 370220337, 368061905, 366620674, 366057091, 365199394, 364465485, 364532967, 364711761, 364549179, 364836693, 364939156, 364323120, 363467445, 363182373, 362928886, 362175713, 361425247, 360339279, 359446869, 358497086, 357668610, 357314186, 356664963, 355831490, 354972763, 354244118, 353595810, 353267822, 352446785, 351307335, 350794067, 350193062, 349540672, 348585129, 347416344, 346275597, 345435295, 344698639, 343911247, 343426857, 342243843, 341087685, 340049591, 338909073, 338088875, 336881180, 335667686, 334657898, 334026375, 333317909, 332486191, 331770096, 330719872, 329920349, 329678268, 329318733, 328057938, 327080154, 326523361, 325612450, 324642563, 323385773, 322256241, 320829124, 319195595]
2912.4C19195595j380425j194381r00994j056213j356621k049103k087612j304436
2920.1C07865810o30035m91714l66078J66226m26636j136456n84583M59442L92819
2928.8C05248795J42669K55413K2183L62987L36743O17714R20944L83224K91405M19750
2938.5C09001827M16737O18038J134796Q50468M40197M80804P41997Q13160K64473
2947.1C14762497N13039R15947O59923J60027O72550N85441l93371K27470N07717P87831
2956.8C19399071O76536M95873O41403J64146R39179R19876M53606M97360P45315J217003
2966.4C26149368N66483K15607O34536J190644J001167P97539N92918K71187Q01849
2975.1C32221298P02439M99878P32345R86786M51050L9825M74816L12347J26724j10321
$$ y = [319195595, 317815170, 316620789, 315719795, 314663582, 313306961, 311257858, 309170246, 307865810, 307235775, 306744061, 306377983, 306544209, 306117573, 304981117, 304396534, 304855976, 305248795, 305391464, 305646877, 305669060, 306032047, 306368790, 306986504, 307907448, 308290672, 308582077, 309001827, 309418564, 310036602, 311171398, 312021866, 312462063, 312942867, 313684864, 314498024, 314762497, 315275536, 316191483, 316851406, 317011433, 317683983, 318269424, 317876053, 318103523, 318611240, 319399071, 320075607, 320571480, 321212883, 321377029, 322316208, 323236084, 323689690, 324187050, 324932365, 326149368, 326715851, 326931458, 327565994, 328756638, 329757805, 330555344, 331148262, 331419449, 332221298, 332923737, 333423615, 334155960, 335142746, 335593796, 335633621, 336108437, 336420784, 336547508, 336437187]
2984.7C36437187J89896L97186K14539K6817o4468O25877L91655L4218o6490O3209
2994.4C38249626K20795m96864o49643m90227k96402m81720n85938k81372j91154n65605
3004C34431496j072121l34282J65176k84385q07305n99250m09203p02133n59616n41077
3013.7C29287300k68936n63393p00416o58112q61244n50385o18972m54369r02672p24830
3023.3C22983971n63088j173553p48558o72055k26154n30662j091061r10607o66027
3032C16402206j48830p33757j161175j222267o86760n90191r73987m05445p62482q75340
3041.6C08841972o31961q50964q81977q05721j089554j098252m24614n51796p09095
3050.3C01798038r02748r60636o07185m53129p72438j067257p08141j160126o22597
$$ y = [336437187, 336627083, 337024269, 337238808, 337265625, 337201157, 337827034, 338218689, 338252907, 338186417, 338249626, 338470421, 337973557, 337323914, 336833687, 336537285, 336055565, 335469627, 335188255, 334997101, 334431496, 333359375, 333025093, 333190269, 332905884, 332098579, 331499329, 331090126, 330387993, 329828377, 329287300, 329018364, 328454971, 327754555, 327096443, 326235199, 325684814, 325065842, 324611473, 323708801, 322983971, 322420883, 321247330, 320498772, 319826717, 319600563, 319069901, 317978840, 317068233, 316402206, 316253376, 315519619, 314358444, 313136177, 312449417, 311859226, 310885239, 310479794, 309717312, 308841972, 308210011, 307359047, 306477070, 305671349, 304581795, 303483543, 303058929, 302507133, 301798038, 300895290, 299934654, 299327469, 298874340, 298101902, 297034645, 296326504, 295166378, 294543781]
3059B94543781k40993o63529l21960q53596j126346j160031n04379m89979r07383k09503
3068.6B88066082n31826o47659r34048q34866m51183o65703l92570n74894o27690q94985
3078.3B81510658q46405p05032j017799p12052l58982j94988n84088p74555o22635
3087B75694122k73075m49791r30710p41005q49208p05815r09385q00362l24097m24862
3096.6B69285812l61938o24886o41040o50750o23912q62809r02824k47135m99077o15006
3106.2B63256435m92134q42037j064224p16114n51682n56755m48227p66868r63898
3114.9B56854496j194801m60911k59152p04345m41933r12991p19127p09305p91283
3123.6B50660648l26862l39298m76303r99947p48806o98318r53522q06160n70927k57568
$$ y = [294543781, 294302788, 293639259, 293317299, 292463703, 291337357, 290177326, 289672947, 289182968, 288275585, 288066082, 287534256, 286886597, 285952549, 285117683, 284666500, 284000797, 283608227, 283033333, 282405643, 281510658, 280664253, 279959221, 278941422, 278229370, 277870388, 277675400, 277091312, 276316757, 275694122, 275421047, 274971256, 274040546, 273299541, 272450333, 271744518, 270835133, 270034771, 269710674, 269285812, 268923874, 268298988, 267657948, 267007198, 266383286, 265520477, 264617653, 264370518, 263871441, 263256435, 262764301, 261922264, 260858040, 260141926, 259590244, 259033489, 258585262, 257818394, 256854496, 255659695, 255198784, 254939632, 254235287, 253793354, 252880363, 252161236, 251451931, 250660648, 250333786, 249994488, 249518185, 248518238, 247769432, 247071114, 246117592, 245311432, 244740505, 244482937]
3133.3B44482937o61202o91394n89867q27713r92050m92306k20871j036186j033745
3141.9B37937603o79474o65684o50100k59590l82252j057644n20611k06547n98850
3150.6B32916851p39155o36921p88879q29964n79490p51286p68967q71772p17297n66101
3160.3B25667019o52866m48838o59370r15604r77020o27194l44963o29577q09059m34323
3169.9B19168205j65119n04475o75296r67961q03394n32799p97729q55084q39538n42679
3179.5B12484131m57192j37806q8672o27976o21814q79593r30290l87497l72372o85005
3189.2B07295914m24996m60300o90365o20232p85503j78337j68343j035404j102352
3197.9B01830082o78654k64683n43994q56247n60151l08361k51407K8934k84672r32254
$$ y = [244482937, 243821735, 243130341, 242540474, 241712761, 240720711, 240228405, 240007534, 238971348, 237937603, 237258129, 236592445, 235942345, 235682755, 235300503, 234242859, 233722248, 233515701, 232916851, 232177696, 231540775, 230751896, 229921932, 229342442, 228591156, 227822189, 226950417, 226233120, 225667019, 225014153, 224565315, 223905945, 222990341, 222013321, 221386127, 221041164, 220411587, 219602528, 219168205, 219003086, 218498611, 217823315, 216855354, 216051960, 215519161, 214721432, 213866348, 213026810, 212484131, 212026939, 211889133, 211800461, 211172485, 210550671, 209671078, 208740788, 208353291, 207980919, 207295914, 206870918, 206410618, 205720253, 205100021, 204314518, 204136181, 203967838, 202932434, 201830082, 201151428, 200886745, 200342751, 199486504, 198926353, 198617992, 198366585, 198395519, 198110847, 197178593]
3207.5A97178593r05419p41749k48909k09045m91066p80201p92141l40919n29862k47135
3217.2A91892147k10609n83249p82547r23461l14293k07730m07810k76794k51561p94105
3226.8A87139988q27980Q4820j4725r92966j336403m87175J0929J45970k71282j016274
3236.4A82434902n56469m50477l20931k58198l02887l17325m70429k79884p04288k66190
3246.1A78507824m85268o79607J64165l41415l66211k75497j92585m17195r30595n75047
3255.7A74408569m74510o1989n9471l56426o85597l99589J62773o98261p66926l62530
3265.4A70706043q6040L53794R0332k77901n32856o00738m83609j10321k03361k78149
3275A68577194P7057m61025p73869k61516J51272J64909l88546p57160k99168P2003
$$ y = [197178593, 196273174, 195531425, 195282516, 195073471, 194582405, 193802204, 193010063, 192669144, 192139282, 191892147, 191681538, 191098289, 190315742, 189392281, 189077988, 188870258, 188462448, 188185654, 187934093, 187139988, 186312008, 186396828, 186382103, 185389137, 184052734, 183565559, 183576488, 183722458, 183451176, 182434902, 181878433, 181427956, 181107025, 180848827, 180545940, 180228615, 179758186, 179478302, 178774014, 178507824, 178022556, 177342949, 177507114, 177165699, 176799488, 176523991, 176331406, 175914211, 174983616, 174408569, 173934059, 173872070, 173812599, 173456173, 172770576, 172370987, 172533760, 171835499, 171068573, 170706043, 170620003, 170973797, 171064129, 170786228, 170253372, 169652634, 169169025, 169058704, 168855343, 168577194, 168654251, 168193226, 167419357, 167157841, 167309113, 167474022, 167085476, 166328316, 166029148, 166101151]
3284.7A66101151j53504p20253o54144L815p1602J72977r231p09515k40536m1218j07708
3295.3A63570232k70996o69746o66065k23790o1416k95963q6346l62244k23655K0236
3304.9A60730247o24599q9931K96897j53465k50282l82614l85161l77645n92604l34825
3314.6A57836018L16228r3793p35732l57589l47662n14460k01292q2712j51987n20105
3324.2A55146914m66948j40238p29046o17799j37959n47934o45809o53591l26004J49365
3333.8A51030951k41604m84467j08452O2847o8311r0723n22995q49600k41184l1424
3343.5A48455038o20718p88078m19426o7949J92317j90706q15611k99349J55736j85166
3353.1A45416088p3404J14622p1926o78339p43809M10051M03099k09627n5494m93555
$$ y = [166101151, 165947647, 165227394, 164573250, 164577065, 164505463, 164678440, 164669209, 163959694, 163719158, 163677940, 163570232, 163299236, 162629490, 161963425, 161739635, 161678219, 161382256, 161295910, 160933666, 160710011, 160730247, 160105648, 160015717, 160312614, 160159149, 159908867, 159526253, 159141092, 158763447, 158170843, 157836018, 158152246, 158058453, 157322721, 156965132, 156617470, 156103010, 155901718, 155819006, 155667019, 155146914, 154679966, 154539728, 153810682, 153192883, 153054924, 152506990, 151861181, 151207590, 150881586, 151030951, 150789347, 150304880, 150196428, 150259275, 150190964, 150100241, 149577246, 148727646, 148486462, 148455038, 147834320, 147046242, 146626816, 146558867, 146751184, 146560478, 145744867, 145445518, 145601254, 145416088, 145342684, 145457306, 145385380, 144707041, 143963232, 144373283, 144776382, 144566755, 144511261, 144017706]
3362.8A44017706n26972K03171M45871q3952m53672j14985n312l43694k81287J92357
3372.4A43049231j62096l82824m969k08149k92425l32537k54364Q8625M04282M55675
3382.1A42360449j15910j71957P6752k47879l39756J03884M1895k47384O9371J97525
3391.7A41726990Q1520M0111N7793j61228p4806L43389j9111k44999j35212j30234
3401.3A41484213k51026k7323K41575n4273Q1415M4183J07823L82557N817K3041J62668
3412A42200670p7028K00243M14391m75321j81608P02295L07293K82469r8706J68820
3421.6A43443518P54947o7768r3193L48826M65450J89066l40443l1280N73482N58319
3431.2A45800924M44956K64292k85225j38121Q9779K20413M32682K86179M01592M49343
$$ y = [144017706, 143490734, 143693905, 144139776, 144055824, 143602152, 143487167, 143481855, 143138161, 142856874, 143049231, 142887135, 142504311, 142499342, 142291193, 141998768, 141666231, 141411867, 141500492, 141904774, 142360449, 142244539, 142072582, 142149334, 141901455, 141561699, 141665583, 141707478, 141460094, 141529465, 141726990, 141808510, 141848621, 141906414, 141745186, 141670380, 142013769, 141994658, 141749659, 141614447, 141484213, 141233187, 141205864, 141447439, 141393166, 141474581, 141518764, 141626587, 142009144, 142014961, 142038002, 142200670, 142123642, 142323885, 142738276, 142262955, 142081347, 142783642, 143090935, 143373404, 143274698, 143443518, 144198465, 144130697, 144037504, 144386330, 144851780, 145040846, 144700403, 144669123, 145242605, 145800924, 146245880, 146510172, 146224947, 146086826, 146176605, 146397018, 146829700, 147115879, 147517471, 147966814]
3440.9A47966814N08699K15350R6483N28564P10364P29685j77451j89542L20215K59914
3450.5A50969095O89974N83315K61650N2662P6L60966M94766N93090O91700N94425
3460.2A55291719M47770M68359K50759L44915P07569O36006O45084L27692K39811M61149
3469.8A59820833L16954L59974O12068O24618M53854P83005O59675M72737R04236O63833
3479.5A65671787L42160J38587L35789O49567M24785R00689R89456M38385M04053N55458
3489.1A70850716P69806P69538O27995M98238M74948O01540P43713J042462P61661
3497.8A77140617M75579P01923M55799L43437N84641P16781P14264P23324P85160P24831
3507.4A83366356J048851Q52566L83091O97899P95173Q51631P35874P87411N92652
$$ y = [147966814, 148475513, 148690863, 148787346, 149315910, 150026274, 150755959, 150578508, 150388966, 150709181, 150969095, 151659069, 152242384, 152504034, 152556696, 152556772, 152917738, 153412504, 154005594, 154697294, 155291719, 155739489, 156207848, 156458607, 156803522, 157511091, 158147097, 158792181, 159119873, 159359684, 159820833, 160137787, 160497761, 161109829, 161734447, 162188301, 162971306, 163630981, 164103718, 165007954, 165671787, 166013947, 166152534, 166488323, 167137890, 167562675, 168463364, 169452820, 169891205, 170295258, 170850716, 171620522, 172390060, 173018055, 173516293, 173991241, 174592781, 175336494, 176378956, 177140617, 177616196, 178318119, 178773918, 179117355, 179701996, 180418777, 181133041, 181856365, 182641525, 183366356, 184415207, 185267773, 185650864, 186348763, 187143936, 187995567, 188731441, 189518852, 190111504]
3516.1A90111504M86354Q52528O23798J189919J659279R30538K28634L43590Q92906
3524.8A97319050J389026J439057N68600R34925Q05740N24235J188869Q75130J101723
3533.5B06146355J350422J573124P68833j96724J047840J433620J122608Q64583J216964
3542.1B15327625R13868J132164J902504R24092Q81500K92244J404705K063617J526394
3550.8B26368713J761246R97582J593360R44844J244564J724796M39549J293220J664009
3559.5B38031883J554928J234112K241134J417275K64988K748890J351948R69486P22046
3568.2B50536690P00683K911530J808929J722737K030353J632538Q55084J758117K430268
3576.9B66386929J038684J537781J604042K483406K631932J672382J362781J952534
$$ y = [190111504, 190597858, 191450386, 192074184, 193264103, 194923382, 195853920, 196082554, 196426144, 197319050, 198708076, 200147133, 200715733, 201650658, 202456398, 202980633, 204169502, 205044632, 206146355, 207496777, 209069901, 209838734, 209642010, 210689850, 212123470, 213246078, 214110661, 215327625, 216241493, 217373657, 219276161, 220200253, 221081753, 221373997, 222778702, 224842319, 226368713, 228129959, 229127541, 230720901, 231665745, 232910309, 234635105, 235074654, 236367874, 238031883, 239586811, 240820923, 243062057, 244479332, 244744320, 247493210, 248845158, 249814644, 250536690, 251237373, 254148903, 255957832, 257680569, 259710922, 261343460, 262198544, 263956661, 266386929, 267425613, 268963394, 270567436, 273050842, 275682774, 277355156, 278717937, 280670471]
3584.6B80670471L770065J480752M520J873913J118259K849198K461872K318954K098293
3593.2B98646297J452904J659470O71043L214913L439502K116890L072014J444664
3601C15717697J564713K408828J852646L022881L630218K757187R38606L429909J872864
3609.6C37195549J037750N424958J537780O20537L879662J288604M262276L720436
3617.4C58967552K346535L171997N91545J951904L680764L895263L085366L251228
3625.1C80942154K828522K977714N620308J607628l091812M554176N450401N106392
3632.8D05995483K647019J042251L386879M785118L802224J618461K626038L845482
3640.5D29748955L610763K796288K345009L748131M839859N856513Q77381m02832P622452
$$ y = [280670471, 284440536, 285921288, 285925808, 287799721, 288917980, 291767178, 294229050, 296548004, 298646297, 300099201, 301758671, 302429714, 305644627, 309084129, 311201019, 314273033, 315717697, 317282410, 319691238, 321543884, 324566765, 328196983, 330954170, 331892776, 335322685, 337195549, 338233299, 343658257, 345196037, 345816574, 349696236, 350984840, 355247116, 358967552, 361314087, 364486084, 365077629, 367029533, 370710297, 374605560, 377690926, 380942154, 383770676, 386748390, 392368698, 393976326, 390884514, 395438690, 400889091, 405995483, 408642502, 409684753, 413071632, 417856750, 421658974, 423277435, 425903473, 429748955, 433359718, 436156006, 438501015, 442249146, 447089005, 452945518, 453822899, 453420067, 461042519]
3649.2D61042519K829628j761361N29557O120529O088219M979896N819512m069329
3656.9D81579170L112335O059685K123566K976036J832352K753830K297058L062973
3664.6E05797005L492698K093087M658546K165909J254158J689033m552307L546791
3672.3E20144920P508774P481995j260224j1134529M781418Q156128N345345l82119
3680E40641708J091729K674217K516250K170716J238556R56916L939972N483437p920189
3688.7E52793312l69644P908821m480286N56603N415191J587830J627388M83284L39775
3697.4E65862274J874619R15146L506393L444901n049744r05304M827347J554985P6027
3706.1E76106644P42530K731934K429657o347580M916153N221329j1674462L712197
$$ y = [461042519, 463872147, 462110786, 462640343, 468760872, 474849091, 479828987, 485648499, 481579170, 484691505, 490751190, 492874756, 495850792, 497683144, 500436974, 502734032, 505797005, 509289703, 511382790, 516041336, 518207245, 519461403, 521150436, 516598129, 520144920, 527653694, 535135689, 533875465, 522740936, 527522354, 535678482, 541023827, 540641708, 541733437, 544407654, 546923904, 549094620, 550333176, 551290092, 555230064, 560713501, 552793312, 552423668, 560332489, 555852203, 556408806, 561823997, 563411827, 565039215, 565522499, 565862274, 567736893, 568652039, 572158432, 575603333, 570553589, 569648285, 574475632, 576030617, 576106644, 576849174, 579581108, 582010765, 575663185, 580579338, 585800667, 574126205, 577838402]
3713.8E77838402M325447P04613J320381K281265J343155k626991J443252M888153
3721.5E91517677l284874l277321M585000J437072n03921k447319P21054M089165J031913
3730.2E93868446M596329k326736n557099Q737297r33761q189240J664124J583862
3737.9E93443222K57607K161827K874946k866287L803558J0435562j3594970j0985451
3745.6E85530014J1191444N468560M354400m562950o796570J0966950p169724o586761
3753.3E92395363O782951M695015K624512n335922K585716M794235q176765m39797
3761E99925308M628029J343689M25911L259125k839051m375381L668404M854354o7405
3769.7F10822983p994118K442093L248367j90P57102j07803N27916j60255L023452
$$ y = [577838402, 582163849, 582868462, 584188843, 586470108, 587813263, 585186272, 586629524, 591517677, 588232803, 584955482, 589540482, 590977554, 590473633, 588026314, 588747368, 592836533, 593868446, 598464775, 596138039, 590580940, 599318237, 598384476, 590195236, 591859360, 593443222, 593700829, 595862656, 598737602, 595871315, 599674873, 610110435, 596515465, 585530014, 596721458, 602190018, 606544418, 601981468, 595184898, 606151848, 598982124, 592395363, 599178314, 603873329, 606497841, 601161919, 603747635, 608541870, 600365105, 599925308, 604553337, 605897026, 606322937, 609582062, 606743011, 602367630, 606036034, 610890388, 610822983, 602828865, 605270958, 608519325, 608519135, 609276237, 609168434, 609696350, 609536095, 612559547]
3778.4F12559547O7788p105332K510796K423134K008781J695404l652038n81170J443444
3787.1F11370354L32718L77960K44980K95982J63002L85857k70233J330184K802582
3795.8F17033386l795166l115005K674141M110794N268631q604470r472770N313110
3803.5F09412651L781319N175438M172706r587021l274002M102211J138306o0921O47888
3812.2F15508575R7580J535912M815636k655335j1900215M698219N163498M182663
3819.9F21446533J762161j5580596K026214N327797J969376K103691j671982l800278
3827.6F13582916J023979J783333K805939J241646o339417L336602O183395n935745
3835.3F17682648N64117P195358r292221m080162O254387m393005K49367N849952j946640
$$ y = [612559547, 612627335, 605522003, 608032799, 610455933, 612464714, 614160118, 610508080, 609926910, 611370354, 611703072, 612081032, 612326012, 612621994, 612784996, 613170853, 612900620, 614230804, 617033386, 613238220, 610123215, 612797356, 616908150, 622176781, 613572311, 604099541, 609412651, 613193970, 618369408, 622542114, 612955093, 609681091, 613783302, 614921608, 614860687, 615508575, 615606155, 617142067, 621957703, 619302368, 607402153, 612100372, 617263870, 621446533, 623208694, 607628098, 609654312, 614982109, 616951485, 619055176, 617383194, 613582916, 614606895, 616390228, 619196167, 620437813, 614098396, 617434998, 623618393, 617682648, 618246765, 625442123, 616149902, 612069740, 618324127, 613931122, 614180489, 620030441, 618083801]
3844F18083801k490310K257690N62706Q7471J692658o31485J793289L927154o482963
3852.7F18800011q22068j2470893M432144R310302k299842j138916J689148J736221
3860.4F19236107K621040n063629P42607O063004o330796n258674M178390N302010
3868.1F21490059M947472q493844q423118M422302N787277K458496q411293J488037
3875.8F15265388L883591l42979K420463K991486o597672n402069N168190J138764
3883.5F18525162J491585K978782j1668548K446746M291764J250152M058152k607117
3891.2F20766678p278748K615013L249512j512489O00548J165847J713257n01861q004914
3899.9F12812843N792656O69174n342330M120368k754249o11191J125984J236573J354751
$$ y = [618083801, 615593491, 617851181, 618413887, 618501358, 620194016, 619562531, 621355820, 625282974, 618800011, 617977943, 605507050, 609939194, 619249496, 616949654, 615810738, 617499886, 619236107, 621857147, 616793518, 617536125, 623599129, 617268333, 612009659, 616188049, 621490059, 626437531, 617943687, 609520569, 613942871, 619730148, 622188644, 613777351, 615265388, 619148979, 618806000, 621226463, 624217949, 617620277, 612218208, 617386398, 618525162, 620016747, 622995529, 611326981, 613773727, 618065491, 619315643, 623373795, 620766678, 613487930, 616102943, 619352455, 617839966, 618440514, 619606361, 621319618, 620817757, 612812843, 618605499, 619274673, 613932343, 618052711, 615298462, 614687271, 615813255, 617049828, 618404579]
3908.6F18404579j275406m3564K15149L8147j72424L92036J214982J96380l758850
3917.3F15211029j858787M101257k55661k641220K187843J240540K79197j695594k076226
3926F14492378J617279J616440K69890j907501j243363J757698j367035r66491J782303
3934.6F16051598Q4304J60256J01776o50787o57692j38703J862297O27556k949333
3943.3F14491272l20778R70306O86417O09207j651115O30798j78871k091980J616669
3952F14761925j3733q14934K48261L60374M90074p65571L79562J72310L44734M19006
3961.6F15582008j199798m29421R8496L31688R2010J90392m4594j125145q39348N37415
3971.3F13193703O14509k27241P57522L70713n36271l93333J74446O24046J56708k85034
$$ y = [618404579, 617129173, 617085609, 617300758, 617338905, 617166481, 617558517, 618773499, 618969879, 615211029, 613352242, 617453499, 617197838, 614556618, 616744461, 617985001, 618264198, 616568604, 614492378, 616109657, 617726097, 617995987, 616088486, 614845123, 616602821, 615235786, 614269295, 616051598, 616135902, 616296158, 616397934, 615747147, 615089455, 614950752, 616813049, 617440605, 614491272, 614170494, 615140800, 615827217, 616436424, 614785309, 615416107, 615237236, 613145256, 614761925, 614748192, 613933258, 614181519, 614541893, 615031967, 614266396, 614645958, 614818268, 615163002, 615582008, 614382210, 613952789, 614051285, 614382973, 614474983, 614665375, 614620781, 613495636, 612656288, 613193703, 613808212, 613580971, 614338493, 614709206, 614172935, 613779602, 613954048, 614578094, 614734802, 614449768]
3980.9F14449768q71200M49447N41496j21612P5264n42603k1057O905N44204j3351
3990.6F14497261o43196K15416r6588O4697r3651M30527j6708p57637J28822J53923
4000.2F13882866
$$ y = [614449768, 613578568, 614028015, 614569511, 614447899, 614523163, 613980560, 613959503, 613966408, 614510612, 614497261, 613854065, 614069481, 613972893, 614037590, 613943939, 614374466, 614357758, 613600121, 613728943, 613882866]
##END=$$ End of the data block
