##TITLE=$$ Begin of the data block
##JCAMP-DX=5.00 $$ ACD/SpecManager v 10.08
##SPECTROMETER/DATA SYSTEM=Varian
##DATE=15 Jan 2013 10:11:38
##DATA TYPE=INFRARED SPECTRUM
##DATA CLASS=XYDATA
##ORIGIN=
##OWNER=
##NPOINTS=3735
##FIRSTX=399.26403809
##LASTX=4000.35498047
##MAXX=4000.35498047
##MINX=399.26403809
##MAXY=68.14288330
##MINY=14.16770554
##XFACTOR=1.0000000000
##YFACTOR=0.000000100000000
##FIRSTY=31.17949295
##DELTAX=0.96440572
##XUNITS=1/CM
##YUNITS=TRANSMITTANCE
##XYDATA=(X++(Y..Y))
399.3C11794930J2590713J65672j1749973k308273J2180004j030960m22783j140213
$$ 311794930 324385643 324551315 312801342 310493069 322673073 321642113 321219330 320079117
407C20079117j496296J827984l288307o588402n287915M172745L444977J735268l403626
$$ 320079117 318582821 320410805 317122498 310534096 305246181 309418926 312863903 314599171 311195545
415.7C11195545k865581J2643814J7807541q708649j5710468k264138K893181J232071
$$ 311195545 308329964 320973778 338781319 330072670 314362202 312098064 314991245 316223316
423.4C16223316k590370k328777K095165k238751k701606K171764L447895l594475
$$ 316223316 313632946 311304169 313399334 311160583 308458977 310630741 314078636 310484161
431.1C10484161p630634n38940K720394O241932K940273k778912k494258l094502k205448
$$ 310484161 302853527 302314587 305034981 311276913 314217186 311438274 308944016 305849514 303644066
439.8C03644066o68144K927971J743316k33993j611576j968289K526798P93190j087
$$ 303644066 302975922 305903893 307647209 307413216 305801640 303833351 306360149 307153339 307152252
448.4C07152252J904659j104393m080524P6504J965046l232861K013359P396431K058659
$$ 307152252 309056911 307952518 303871994 303948498 305913544 302680683 304694042 312090473 314149132
457.1C14149132q285542j480331J775875l818054n23377K219277m517765k226239M857693
$$ 314149132 305863590 304383259 306159134 302341080 301817703 304036980 299519215 297292976 302150669
465.8C02150669j202297l100662K811985j922303j160068K577534l627873k410221
$$ 302150669 300948372 297847710 300659695 298737392 297577324 300154858 296526985 294116764
473.5B94116764K077503O13594J589413J143150j739177q21190r19056k953892k407379
$$ 294116764 296194267 296807861 298397274 299540424 297801247 296980057 296061001 293107109 290699730
482.2B90699730j551247j918049J505661L773938J949997J173648n28163l034039j156178
$$ 290699730 289148483 287230434 288736095 292510033 294460030 295633678 295105515 292071476 290915298
490.9B90915298M92440j56079q82549k153911L49063J980343j22032J237774p60174
$$ 290915298 291407738 291251659 290369110 288215199 288564262 290544605 290422573 291660347 290900173
499.6B90900173j291237J449871P5264l90644j570434j255570k078914j818009K400341
$$ 290900173 289608936 291058807 291134071 290743427 289172993 287917423 285838509 284020500 286420841
508.2B86420841O41461J97639L6144q55713q28971j294022q50906q29564q48732m68063
$$ 286420841 287062302 287259941 287296085 286440372 285611401 284317379 283466473 282636909 281788177 281320114
517.9B81320114J224213K15492l79620P66488J03187o42071k272682l651180l533402
$$ 281320114 282544327 282759819 282380199 283146687 283249874 282607803 280335121 276683941 273150539
526.6B73150539P76902K014122N28602R16634M76799J511345J004543K24857q4381
$$ 273150539 273927441 275941563 276470165 277386799 277863598 279374943 280379486 280604343 280519962
535.2B80519962j824455p57980j090851j753349j431904L34167J456471q92048j3733
$$ 280519962 278695507 277937527 276846676 275093327 273661423 273995590 275452061 274560013 274546280
543.9B74546280M85077j998043j571694q66203j080284J68915j92318o22673j76525
$$ 274546280 275031357 273033314 271461620 270595417 269515133 269684048 269491730 268869057 268692532
552.6B68692532J54590J677952k14291j518726l46127j337127j647511o69880n76629
$$ 268692532 268847122 270525074 270310783 268792057 268445930 267108803 265461292 264791412 264214783
561.3B64214783q73547J110745J439266M31938J71223p26567M2038L34130m9801j1406
$$ 264214783 263341236 264451981 265891247 266323185 266494408 265767841 265809879 266144009 266094208 266082802
570.9B66082802n08690m58336O07243J32560p97824M61387j98784r91687k71607P23515
$$ 266082802 265574112 265115776 265723019 265855579 265057755 265519142 265320358 264328671 264057064 264780579
580.6B64780579p1144j307240l1643k68688l71094j79710L24897J690579J479626J370449
$$ 264780579 264709435 263402195 263370552 263101864 262730770 262551060 262875957 264566536 266046162 267416611
590.2B67416611N64708j70421j242180j576214K77557J507683P01180l07694J95618
$$ 267416611 267981319 267810898 266568718 264992504 265270061 266777744 267478924 267171230 267366848
598.9B67366848q16479o26278O06556p61089o22368N51663n39856k266083j278210
$$ 267366848 266550369 265924091 266530647 265769558 265147190 265698853 265158997 262892914 261614704
607.6B61614704k23331K04258J03721o27537L70503k96021k74562J29699p35645o04649
$$ 261614704 261391373 261595631 261699352 261071815 261442318 261146297 260871735 261001434 260265789 259661140
617.2B59661140j132774l56941R60083J287289R26628R73472J195412Q69942L57208
$$ 259661140 258528366 258171425 259131508 260418797 261345425 262318897 263514309 264384251 264741459
625.9B64741459M55551J187000K56653J28708O39191J016826K751561K971935J615677
$$ 264741459 265197010 266384010 266640663 266769371 267408562 268425388 271176949 274148884 275764561
634.6B75764561J070099J322593P45964M44470M80766P01180R02996N05256J233177
$$ 275764561 276834660 278157253 278903217 279347687 279828453 280529633 281432629 281937885 283171062
643.3B83171062J423932J207141O43139Q12760J716957P21016R46464J304798O53763
$$ 283171062 284594994 285802135 286445274 287258034 288974991 289696007 290642471 291947269 292601032
651.9B92601032q487k61555Q94050P15180Q8978J58481k02198l45077n35965m20571
$$ 292601032 292592545 292330990 293225040 293940220 294029198 294187679 293985481 293640404 293104439 292683868
661.6B92683868l55587n25608n10292k25582Q37956K012291N82408q04500O23875L74908
$$ 292683868 292328281 291802673 291292381 291066799 291904755 293917046 294499454 293694954 294318829 294693737
671.2B94693737L22514L60946N53894R28498P20405M42181Q05549J175118J043587
$$ 294693737 295016251 295377197 295931091 296859589 297579994 298022175 298827724 300002842 301046429
679.9C01046429J514911J931095J848526J655808J104813M82921j35155k4032Q59604
$$ 301046429 302561340 304492435 306340961 307996769 309101582 309584503 309449348 309425316 310284920
688.6C10284920R06543M03214R41582J897621K262401J656628J89667r36012n66426
$$ 310284920 311191463 311594677 312536259 314433880 316696281 318352909 318542576 317606564 317040138
697.3C17040138Q19187P72171L27397P54223N99727R40323J739884J428375J29928
$$ 317040138 317859325 318631496 318958893 319713116 320312843 321253166 322993050 324421425 324551353
705.9C24551353j0719R40170M18930J70365P72591O99996R54628J273537J615982J276550
$$ 324551353 324540634 325480804 325899734 326070099 326842690 327542686 328497314 329770851 331386833 332663383
715.6C32663383L23830M87251P28188R69810K46315q58612m75730L27568K004966J737824
$$ 332663383 332987213 333474464 334202652 335172462 335418777 334560165 334084435 334412003 336416969 338154793
725.2C38154793Q70933J590386J192016J344948J351052N91659K64206M1542L00102
$$ 338154793 339025726 340616112 341808128 343153076 344504128 345095787 345359993 345401535 345701637
733.9C45701637O70777O25572R54704J400528l18565k32468J176567J28899L78952
$$ 345701637 346372414 346997986 347952690 349353218 349034653 348802185 349978752 350107651 350486603
742.6C50486603R69543N97382L85284N88074N21049L65220J195449J129494J150513
$$ 350486603 351456146 352053528 352438812 353026886 353547935 353913155 355108604 356238098 357388611
751.3C57388611J283493J007347J154175O27250k00462L12920J288948J255035K237091
$$ 357388611 358672104 359679451 360833626 361460876 361260414 361573334 362862282 364117317 366354408
760C66354408K068405Q81424J354561J056061P17278L98712j83487l06359N3750N64613
$$ 366354408 368422813 369304237 370658798 371714859 372432137 372830849 372647362 372341003 372394753 372959366
769.6C72959366L28979l42178K00691J235275N80712O42471M95796n50499o66236n53246
$$ 372959366 373288345 372946167 373146858 374382133 374962845 375605316 376101112 375550613 374884377 374331131
779.2C74331131k1324J35727K25830l03230j46027J339798J541176N40619L95355J257553
$$ 374331131 374309807 374445534 374671364 374368134 374222107 375561905 377103081 377643700 378039055 379296608
788.9C79296608l03688j295776m75350j76697K91596R85565J950836J103020k53487
$$ 379296608 378992920 377697144 377221794 377045097 377336693 378322258 380273094 381376114 381122627
797.6C81122627j625099j576424q58116j637916j173630j977806k035446j118393j350327
$$ 381122627 379497528 377921104 377062988 375425072 374251442 372273636 370238190 369119797 367769470
806.2C67769470p23266j87111l94020j070938j144143k088394l215179k680893j377831
$$ 367769470 367046204 366859093 366465073 365394135 364249992 362161598 358946419 356265526 354887695
814.9C54887695j246185j305084M24919M69322j90887L60183J229020J214370O38504
$$ 354887695 353641510 352336426 352761345 353230667 353039780 353399963 354628983 355843353 356481857
823.6C56481857J338158J727486L135871L328667K636681L522949L345947M200669
$$ 356481857 357820015 359547501 362683372 366012039 368648720 372171669 375517616 379718285
831.3C79718285M094009K988129K478676K690582L011055J659622J384277J819382
$$ 379718285 383812294 386800423 389279099 391969681 394980736 396640358 398024635 399844017
839C99844017K339783J490974J597634K508354K288093K080040J177254J272354L6430
$$ 399844017 402183800 403674774 405272408 407780762 410068855 412148895 413326149 414598503 414634933
847.7D14634933O14243J208496O43540J927795J098061J422042K436715L300781K213516
$$ 414634933 415249176 416457672 417101212 419029007 420127068 421549110 423985825 427286606 429500122
856.4D29500122J059456J607094L38363R74236J115112J270180J058769O10962P08656
$$ 429500122 430559578 432166672 432505035 433479271 434594383 435864563 436923332 437534294 438242950
865.1D38242950L17040P38487p86781o31638j015777k356148k741318j949768m90684
$$ 438242950 438559990 439298477 438511696 437880058 436864281 434508133 431766815 429817047 429326363
873.8D29326363j637803q01315p72476r58786j34659p70798q21113j185761j016082
$$ 429326363 427688560 426887245 426114769 425155983 425021324 424250526 423429413 422243652 421227570
882.4D21227570j341057j078148j482964j857338j43928N41344j95809j149826o15082
$$ 421227570 419886513 418808365 417325401 415468063 415324135 415865479 415669670 414519844 413904762
891.1D13904762p02018m76189m30565q17261l76549l32565L99857j24512K59399q9187
$$ 413904762 413202744 412726555 412295990 411478729 411102180 410769615 411169472 411044960 411304359 411215172
900.8D11215172j536980j572304q70056J699219K306442K099953K061081K516060K459144
$$ 411215172 409678192 408105888 407235832 408935051 411241493 413341446 415402527 417918587 420377731
909.4D20377731J650811K286911O01577L73268Q2436j448669k111550k525825k076836
$$ 420377731 422028542 424315453 424917030 425290298 425372734 423924065 421812515 419286690 417209854
918.1D17209854k483635j885872j979522k023926l163605l847389k585373l479385
$$ 417209854 414726219 412840347 410860825 408836899 405673294 401825905 399240532 395761147
925.8C95761147k957001k957039l756180l759079l418503k910423k601471j462669
$$ 395761147 392804146 389847107 386090927 382331848 378913345 376002922 373401451 371938782
933.6C71938782j453324j405906j402283p93419p53288j967926j919747k242088j712608
$$ 371938782 370485458 369079552 367677269 366883850 366130562 364162636 362242889 360000801 358288193
942.2C58288193j869507j619454o77719o53915J89781m21295j055946q72803k90909
$$ 358288193 356418686 354799232 354121513 353467598 353657379 353236084 352180138 351307335 351016426
950.9C51016426l13187q56437n57518p25479r19228k230186k342186j514092j465759
$$ 351016426 350703239 349846802 349289284 348563805 347644577 345414391 343072205 341558113 340092354
959.6C40092354j837654k824288k306022k543297k689514j882935j588211j362877
$$ 340092354 338254700 335430412 333124390 330581093 327891579 326008644 324420433 323057556
967.3C23057556j653557j467609j842308j954250j895981k888451l156986l409977
$$ 323057556 321403999 319936390 318094082 316139832 314243851 311355400 308198414 304788437
975C04788437l474236l189792l692913m205571m072322l903752m263859m620628m721298
$$ 304788437 301314201 298124409 294431496 290225925 286153603 282249851 277985992 273365364 268644066
983.7B68644066m574661m189225m654312m956150m727135l768386k722588l012199
$$ 268644066 264069405 259880180 255225868 250269718 245542583 241774197 239051609 236039410
991.4B36039410k663632k256965k036343k498112k595558k361088k779827k219772
$$ 236039410 233375778 231118813 229082470 226584358 223988800 221627712 218847885 216628113
999.1B16628113k589970k122516j711731k140637j744003j883469k006244k146473
$$ 216628113 214038143 211915627 210203896 208063259 206319256 204435787 202429543 200283070
1006.8B00283070j500988j679440j985493j825351j678181j417656j563263j191215
$$ 200283070 198782082 197102642 195117149 193291798 191613617 190195961 188632698 187441483
1014.6A87441483j935463j307984j569233k335987j897449k407990j536484j611328
$$ 187441483 185506020 184198036 182628803 180292816 178395367 175987377 174450893 172839565
1022.3A72839565q49991j252574j998654j340675j597271q47416j473217n94769o63242
$$ 172839565 171989574 170737000 168738346 167397671 165800400 164952984 163479767 162884998 162221756
1031A62221756q15430k51903q54435N37090K25391N90115R80377J681767J741638J026363
$$ 162221756 161406326 161154423 160299988 160837078 161062469 161652584 162632961 164314728 166056366 167082729
1040.6A67082729J679135R01184Q40187m76532K01969P78904o33602m27361j229267
$$ 167082729 168761864 169663048 170503235 170026703 170228672 171007576 170373974 169946613 168717346
1049.3A68717346j080227j131897m86507p96223r64145m92382j852551j470051q42113
$$ 168717346 167637119 166505222 166018715 165222492 164258347 163765965 161913414 160443363 159601250
1058A59601250M46014N75676J363926J214142O50196K052917J513672K119427J145973
$$ 159601250 160047264 160622940 161986866 163201008 163851204 165904121 167417793 169537220 170683193
1066.6A70683193Q92334Q79040L14579R72881O66409J065826j87607L02487M08611
$$ 170683193 171575527 172454567 172769146 173742027 174408436 175474262 175286655 175589142 175997753
1075.3A75997753J59435O21987L6182Q51841M4766N39627N04207N93834R31893R89437
$$ 175997753 176157188 176779175 176815357 177667198 177711964 178251591 178755798 179349632 180281525 181270962
1085A81270962J806602J01967O95171R65233J009178N43023O1664J632023J248035
$$ 181270962 183077564 183179531 183874702 184839935 185849113 186392136 186453800 188085823 189333858
1093.6A89333858J574574J451473J494789P38087M33579P97843N83458K019482Q72154
$$ 189333858 190908432 192359905 193854694 194592781 195026360 195824203 196407661 198427143 199299297
1102.3A99299297M15001Q44269J461926J723117Q69961J136360N73025Q97713M41608
$$ 199299297 199714298 200558567 202020493 203743610 204613571 205749931 206322956 207220669 207662277
1111B07662277O99234Q02002j12285O06327R16957J486092N41058K13241J95046j22166
$$ 207662277 208361511 209163513 209051228 209657555 210574512 212060604 212601662 212814903 213009949 212887783
1120.6B12887783J13831k66610K8935m11511M97075P13882P28264J332435J210442
$$ 212887783 213001614 212735004 212763939 212352428 212849503 213563385 214291649 215624084 216834526
1129.3B16834526K108460J627674K018585K013607J173649J397228K061119K212315
$$ 216834526 218942986 220570660 222589245 224602852 225776501 227173729 229234848 231447163
1137B31447163J677932K043095J648178K082882J878147J050110J218853N55038K48776
$$ 231447163 233125095 235168190 236816368 238899250 240777397 241827507 243046360 243601398 243850174
1145.7B43850174J01852N91355M28829J25198M10672O809K92072M73003n9738p22580
$$ 243850174 243952026 244543381 244972210 245097408 245508080 245514889 245806961 246279964 246220226 245497646
1155.4B45497646k2449l7575j130295j241226j128960k76889J42002O26182J029892
$$ 245497646 245475197 245437622 244307327 243066101 241937141 241660252 241802254 242428436 243458328
1164B43458328J582985J690808J176261J569996J697693K521000K252007K484874L049012
$$ 243458328 245041313 246732121 247908382 249478378 251176071 253697071 255949078 258433952 261482964
1172.7B61482964K856960L495331L251609L754311L410759K351742K312469K566223
$$ 261482964 264339924 267835255 271086864 274841175 278251934 280603676 282916145 285482368
1180.4B85482368K718239K423363K201862J912327K221031K334328J821919J518421
$$ 285482368 288200607 290623970 292825832 294738159 296959190 299293518 301115437 302633858
1188.1C02633858J514301J046600M21772j2912o18554l14693K49386j32065q38203
$$ 302633858 304148159 305194759 305616531 305603619 304985065 304670372 304919758 304787693 303949490
1196.8C03949490p10907l51983o53400p92160j098747j850147j663781j083183j407623
$$ 303949490 303238583 302886600 302233200 301441040 300342293 298492146 296828365 295745182 294337559
1205.5B94337559j338139p96661p28874l70751J06678j00136n56812o66218p41100
$$ 294337559 292999420 292202759 291473885 291103134 291209812 291109676 290552864 289886646 289145546
1214.2B89145546j035099j061058j092835p65037k92645n48496m20170j58348n17235
$$ 289145546 288110447 287049389 285956554 285191517 284898872 284350376 283930206 283771858 283254623
1222.9B83254623q99543q75950o92330r00840j239396j280632j127758r61189n27992
$$ 283254623 282355080 281479130 280786800 279885960 278646564 277365932 276238174 275276985 274748993
1231.5B74748993k87399k19136j50718m63410k97222n43899p11861k00329j02749k38571
$$ 274748993 274461594 274242458 274091740 273628330 273331108 272787209 272075348 271875019 271772270 271533699
1241.2B71533699j57452L48874K632j04637p8640l47901l9959k93922n28088q42552
$$ 271533699 271376247 271725121 271727753 271623116 271544476 271196575 271156616 270862694 270334606 269492054
1250.8B69492054n31597r5596J39217M40044k47173J02329L3322m06094O8970K16274
$$ 269492054 268960457 268864861 269004078 269444122 269196949 269299278 269332600 268926506 268995476 269211750
1260.5B69211750J62468l4657J96763M46815R26018R16214P52754P02705O14739J285305
$$ 269211750 269374218 269339561 269536324 269983139 270909157 271825371 272578125 273280830 273895569 275180874
1270.1B75180874J285629J027165N44681O40946R98096J114140J275138R21936J410733
$$ 275180874 276466503 277493668 278038349 278679295 279677391 280791531 282066669 282988605 284399338
1278.8B84399338J602821J374226J125507J041336J387043J485386J332970R47437
$$ 284399338 286002159 287376385 288501892 289543228 290930271 292415657 293748627 294696064
1286.5B94696064J386776J441669J217003J492958J403561R91879P97462R53159R14212
$$ 294696064 296082840 297524509 298741512 300234470 301638031 302629910 303427372 304380531 305294743
1295.2C05294743Q37154L45364M69741P20597L97300L69664N58872O72512J54037L7041
$$ 305294743 306131897 306477261 306947002 307667599 308064899 308434563 308993435 309665947 309819984 309857025
1304.8C09857025q7318k51122l00846n44758n76534p06196o51150o76593m63448l99284
$$ 309857025 309769707 309518585 309217739 308672981 308096447 307390251 306739101 306062508 305599060 305199776
1314.5C05199776k05117R7523P5073K54898j2817N99423Q91971O43234Q58517M72412
$$ 305199776 304994659 305092182 305167255 305422153 305409336 306008759 306900730 307543964 308402481 308874893
1324.1C08874893M24137O67801O31886M7989R7484j99566n99308m89330j067867p14798
$$ 308874893 309299030 309966831 310598717 310646706 310744190 310544624 309945316 309455986 308388119 307673321
1333.8C07673321n73673m8848P6695m44184O13118L53870K11010L89366P21932R31759
$$ 307673321 307099648 307050800 307127495 306683311 307296429 307650299 307861309 308250675 308972607 309904366
1343.4C09904366J77516L53241O48709J059704O81343M57878K89573j69582l2883j44596
$$ 309904366 310081882 310435123 311083832 312143536 312824879 313282757 313572330 313402748 313369865 313225269
1353.1C13225269m4174n30319o11229m78725m13361m59862l47614k04659q54263n3825
$$ 313225269 313181095 312650776 312039547 311560822 311147461 310687599 310339985 310135326 309281063 309227238
1362.7C09227238m39J5125q3236q48637o09283j103192o61659k07958j53084M2763
$$ 309227238 309226799 309241924 309158688 308310051 307700768 306597576 305935917 305727959 305574875 305617638
1372.3C05617638K40268L07026l10306N17006P1239j26038o8187k92454l54290q25539
$$ 305617638 305857906 306164932 305854626 306371632 306442871 306316833 306248646 305956192 305601902 304776363
1382C04776363o81152r57584o23837n19638p48100j898728j880722j109562k048225
$$ 304776363 304095211 303137627 302513790 301994152 301246052 299347324 297466602 296357040 294308815
1390.7B94308815j721916j547413j555424k534256l165817r34525j247024j862259
$$ 294308815 292586899 291039486 289484062 286949806 283783989 282849464 281602440 279740181
1398.4B79740181l436298k610054j529255k114754j842079j915112k392215k370797
$$ 279740181 276303883 273693829 272164574 270049820 268207741 266292629 263900414 261529617
1406.1B61529617j635761j512871j431293j158352j819954j420727j620502j319313
$$ 261529617 259893856 258380985 256949692 255791340 253971386 252550659 250930157 249610844
1413.8B49610844q19970j057376m23489q69560L48205j075706j313839N43270q7738
$$ 249610844 248790874 247733498 247310009 246440449 246788654 245712948 244399109 244942379 244854641
1422.5B44854641M25796o15406Q01049J031170N50823R80453m6997J399956R41944
$$ 244854641 245280437 244665031 245466080 246497250 247048073 248028526 247981529 249381485 250323429
1431.2B50323429J419888J540203J344547K168713J230926J526184J212692K599774
$$ 250323429 251743317 253283520 254628067 256796780 258027706 259553890 260766582 263366356
1438.9B63366356J786976J474056J916943J528434K436962J357594K139893J681385
$$ 263366356 265153332 266627388 268544331 270072765 272509727 273867321 276007214 277688599
1446.6B77688599J268196J238422J567993K503128Q56114J833477J377315J892548
$$ 277688599 278956795 280195217 281763210 284266338 285122452 286955929 288333244 290225792
1454.3B90225792K395935J332493J714554k29454M469127K401066K548027J931667
$$ 290225792 292621727 293954220 295668774 295439320 299908447 302309513 304857540 306789207
1462C06789207J721287K724285P79553L038006K244510K982540L079873K967529L672371
$$ 306789207 308510494 311234779 312014332 315052338 317296848 320279388 323359261 326326790 329999161
1470.7C29999161K224388L432388L231545L794441K863121K559853L589820L026925
$$ 329999161 332223549 335655937 338887482 342681923 345545044 348104897 351694717 354721642
1478.4C54721642K728652K238770K564240J780166J792603J772003R17892R67293M60053
$$ 354721642 357450294 359689064 362253304 364033470 365826073 367598076 368515968 369483261 369943314
1487.1C69943314Q14437J334267k05688r6627N83458K81449o56052p68776q27598m895668
$$ 369943314 370757751 372092018 371886330 371789703 372373161 372654610 371998558 371229782 370402184 365506516
1496.7C65506516o37360j454315k540589k23007r64393o55823o24733L77731J42632
$$ 365506516 364869156 363414841 360874252 360651245 359686852 359031029 358406296 358784027 358926659
1505.4C58926659m435044m651870Q66394J027717j136131k0180j177025j178054m0551
$$ 358926659 354491615 349839745 350706139 351733856 350597725 350577545 349400520 348222466 348181915
1514.1C48181915p57484l15437j488953j933937M59976J342506j409225k547112Q79021
$$ 348181915 347424431 347108994 345620041 343686104 344146080 345488586 344079361 341532249 342411270
1522.8C42411270J124916J886597p50275J41220P47834J91650N40695J26801j32981
$$ 342411270 343536186 345422783 344672508 344813728 345561562 345753212 346293907 346420708 346287727
1531.5C46287727l91578J43852j540566O58417N32150M21448J813393n68733k074128
$$ 346287727 345896149 346040001 344499435 345157852 345690002 346111450 347924843 347356110 345281982
1540.1C45281982K213P86056q97445R50508J044350j147538J272354K36435N41153
$$ 345281982 345284195 346070251 345172806 346123314 347167664 346020126 347292480 347528915 348070068
1548.8C48070068o8893k44370J014786L07388Q91266k508087L14636J290169L37334
$$ 348070068 348001175 347756805 348771591 349078979 349970245 347462158 347776794 349066963 349404297
1557.5C49404297l04184l841133k19879p45354O83708j665726j651992k667237k802314
$$ 349404297 349100113 345258980 345039101 344293747 344977455 343311729 341659737 338992500 336190186
1566.2C36190186j235543k368736j056480p553864k172737j845417l262062k792244
$$ 336190186 334954643 332585907 331529427 323975563 321802826 319957409 316695347 313903103
1573.9C13903103l227825j367646j1712627k312698l800450m414119l710881n225753
$$ 313903103 310675278 309307632 297595005 295282307 291481857 287067738 283356857 278131104
1581.6B78131104l319874n407772l357640n121517m228592m165611n142021l305474
$$ 278131104 274811230 269403458 266045818 260924301 256695709 252530098 247388077 244082603
1589.3B44082603n510501k632943n082149l218727l536797m155292k175179m161625
$$ 244082603 238572102 235939159 230857010 227638283 224101486 219946194 217771015 213609390
1597B13609390j570434m430218k210522l045997k630062j514130l631973o07853k562638
$$ 213609390 212038956 207608738 205398216 202352219 199722157 198208027 194576054 193968201 191405563
1605.7A91405563l64437k632370r68666p50961k577019N0678k794246J48773j476765
$$ 191405563 191041126 188408756 187440090 186689129 184112110 184162788 181368542 181517315 180040550
1614.4A80040550N70030J05515m299812J883239j001472J335049j508046P39079J31721
$$ 180040550 180610580 180716095 176416283 178299522 177298050 178633099 177125053 177864132 177995853
1623.1A77995853j069583J396846o44588J781177j603527J457386O06346Q63171J230907
$$ 177995853 176926270 178323116 177678528 179459705 177856178 179313564 179919910 180783081 182013988
1631.7A82013988j11351K368279l96900J427536k071514K044124J786728P98531J954250
$$ 182013988 181902637 184270916 183874016 185301552 183230038 185274162 187060890 187859421 189813671
1640.4A89813671k20337K531071N51758J709366R14592j90372L507461j359596L241749
$$ 189813671 189593334 192124405 192676163 194385529 195300121 195109749 198617210 197257614 200499363
1649.1B00499363N17292K551708J205025l821697N815658N21145L319473L74585K404956
$$ 200499363 201016655 203568363 204773388 200951691 206767349 207288494 210607967 210982552 213387508
1657.8B13387508J057396J748486K322063J530705L240146J36815L276214J863518
$$ 213387508 214444904 216193390 218515453 220046158 223286304 223423119 226699333 228562851
1665.5B28562851K622147K489814J894417L533783R69563M475937K123794L567562
$$ 228562851 231184998 233674812 235569229 239103012 240072575 244548512 246672306 250239868
1673.2B50239868L024941K387600L832855L268146M436970K640133M303379K737389
$$ 250239868 253264809 255652409 259485264 262753410 267190380 269830513 274133892 276871281
1680.9B76871281M155292M857845J729413O979579J723671N918732M295559M543991
$$ 276871281 281026573 285884418 287613831 294593410 296317081 302235813 306531372 311075363
1688.6C11075363M696255M210434N440998M260788N436630M832535M390030K576904
$$ 311075363 315771618 319982052 325423050 329683838 335120468 339953003 344343033 346919937
1696.4C46919937O143837O686363N438843N191307J446114P516784N719796M800605
$$ 346919937 353063774 359750137 365188980 370380287 371826401 379343185 385062981 389863586
1704.1C89863586L820763L499756L333168K979317M568138L553314L218002L072243
$$ 389863586 393684349 397184105 400517273 403496590 408064728 411618042 414836044 417908287
1711.8D17908287K825851L193818J311874J291351K893296K947998j936341K450638
$$ 417908287 420734138 423927956 425239830 426531181 429424477 432372475 430436134 432886772
1719.5D32886772L306847K105560K320213J465760J145172J697159J971740J377297
$$ 432886772 436193619 438299179 440619392 442085152 443230324 444927483 446899223 448276520
1727.2D48276520J153488K243385N71480J276817L648339L351211o18057k875175M837379
$$ 448276520 449430008 451673393 452244873 453521690 457170029 460521240 459903183 457028008 461865387
1735.9D61865387M257889K752418L067551J128578K75040M613685M015732J978874
$$ 461865387 466123276 468875694 471943245 473071823 473346863 477960548 481976280 483955154
1743.6D83955154L105317M630775M781570M158173L946457L239403N440063L535195
$$ 483955154 487060471 491691246 496472816 500630989 504577446 507816849 513256912 516792107
1751.3E16792107K746505O104622M568138M721718M541931J860695L670655M290390
$$ 516792107 519538612 525643234 530211372 534933090 539475021 541335716 545006371 549296761
1759E49296761L852272M368095O09055J432189M497986K597924K461853L284950L199501
$$ 549296761 553149033 557517128 558126183 559558372 564056358 566654282 569116135 572401085 575600586
1767.7E75600586k74773K540016M835396J157227p73354n98564M576759K735787o3973
$$ 575600586 575325813 577865829 582701225 583858452 583085098 582486534 587063293 589799080 589735107
1776.4E89735107L076249J666412K520027J548538p9384K090226K083320J632462k43073
$$ 589735107 592811356 594477768 596997795 598546333 598466949 600557175 602640495 604272957 604029884
1785.1F04029884P61948K240601J794242J305657K147980J499710J250457o75773o52313
$$ 604029884 604791832 607032433 608826675 610132332 612280312 613780022 615030479 614354706 613702393
1793.8F13702393M173278K023125J53J373291K037162Q23365k21939L087272M53377
$$ 613702393 617875671 619898796 619898949 621272240 623309402 624132767 623910828 626998100 627451477
1802.4F27451477Q42094K106247J048813J577950Q03184P93953P24755Q86306q29277
$$ 627451477 628293571 630399818 631448631 633026581 633829765 634623718 635348473 636234779 635405502
1811.1F35405502J214295K242164N67932J423378O63147J353608K97241M92401J314011
$$ 635405502 636619797 638861961 639429893 640853271 641516418 642870026 643167267 643659668 644973679
1819.8F44973679J46942J073303K16522J786499J295777k482987O71463K543945K255707
$$ 644973679 645120621 646193924 646410446 648196945 649492722 647009735 647681198 650225143 652480850
1828.5F52480850J38855l099212Q10012K711182K99454N28564R82666P47147J063919
$$ 652480850 652619705 649520493 650330505 653041687 653341141 653869705 654852371 655599518 656663437
1837.2F56663437p630J048813J30005N96543P10830J767655J248398n844422K058029
$$ 656663437 656655807 657704620 657834625 658431168 659141998 660909653 662158051 656313629 658371658
1845.8F58371658K531128O23627J86386O58722J673355K02484M25492o5155N20401
$$ 658371658 660902786 661526413 661712799 662371521 664044876 664247360 664672852 664607697 665128098
1854.5F65128098N7373k61765N32303J01395J064224M45328R85717M43268K93503M59137
$$ 665128098 665185471 664923706 665456009 665557404 666621628 667066956 668052673 668495941 668789444 669248581
1864.2F69248581K06375N44968r31778Q98361j039734j134491J814728J389007J045914
$$ 669248581 669454956 669999924 669068146 669966507 668926773 667792282 669607010 670996017 672041931
1872.8F72041931o561N26810l33329K17820L82156n4093J35727m75387Q02688L43476
$$ 672041931 672035370 672562180 672228851 672446671 672828827 672774734 672910461 672435074 673237762 673581238
1882.5F73581238R59930L62549p5378M25567k89840J133956l06015j288757K16065
$$ 673581238 674541168 674903717 674828339 675253906 674964066 676098022 675792007 674503250 674719315
1891.2F74719315O31561L49121P38144O93436p01294P83615J05819K70462K65427j11542
$$ 674719315 675350876 675699997 676438141 677131577 676430283 677213898 677319717 677590179 677855606 677744064
1900.8F77744064K86103n96772L70255l80325M23431R86404K68708K99835j51901O1569
$$ 677744064 678030167 677433395 677803650 677423325 677846756 678833160 679101868 679401703 679249802 679311371
1910.4F79311371m97666M61045m87900k11945K42310K56729J711273j558304l43780
$$ 679311371 678813705 679274750 678786850 678574905 678817215 679073944 680785217 679226913 678883133
1919.1F78883133J206436N43366M23889j093979m79813J75400L76816m46472R8266
$$ 678883133 680089569 680632935 681056824 679962845 679483032 679658432 680035248 679588776 679687042
1927.8F79687042M92630K58179K08130k70538N01098l16543Q7738J29242j78376j02691
$$ 679687042 680179672 680437851 680645981 680375443 680876541 680559998 680647736 680776978 680598602 680495911
1937.5F80495911k32544L54385k23617J034698l17459j621475N78994L40882o8131
$$ 680495911 680263367 680617752 680394135 681428833 681111374 679489899 680068893 680409775 680341644
1946.1F80341644l80554J69373m67377q4381M6921l10593M02756J21002K88849l35007
$$ 680341644 679961090 680130463 679663086 679578705 679625626 679315033 679717789 679838791 680127640 679792633
1955.8F79792633K36588j12381m40064K72370k45820j08871n38025J49841N722N0354
$$ 679792633 680029221 679916840 679476776 679749146 679503326 679394455 678856430 679006271 679011993 679062347
1965.4F79062347M77829l97033j55793j0299L92074k61001k61765j48773N3482K93732
$$ 679062347 679540176 679143143 678987350 678977051 679369125 679108124 678846359 678697586 678751068 679044800
1975.1F79044800m26941J34811q5144N39093J16120n86472n7983k20719n5771n57251
$$ 679044800 678617859 678752670 678667526 679206619 679322739 678736267 678678284 678457565 678401794 677844543
1984.7F77844543l1051j20850O5842o0120l74603Q19473P2785p61643o48117L44849
$$ 677844543 677813492 677692642 677758484 677698364 677323761 678143234 678216019 677454376 676806259 677151108
1994.3F77151108k74124n76630L08304j71051K74277k63825j41907j20163k1743K8915
$$ 677151108 676876984 676300354 676608658 676437607 676711884 676448059 676306152 676185989 676164246 676193161
2004F76193161n44052j81351p87506K49405r9030n49926J50985k1667K71606m51431
$$ 676193161 675649109 675467758 674680252 674929657 674830627 674280701 674431686 674410019 674681625 674230194
2013.6F74230194j8158j89438n00946o35147l99551N9051l76892J71738n91583J7089
$$ 674230194 674212036 674022598 673521652 672886505 672486954 672546005 672169113 672340851 671749268 671766357
2023.3F71766357K49634j02844o10n42374M11911k86636n53971q57315m87823p3853
$$ 671766357 672015991 671913147 671912537 671370163 671782074 671495438 670941467 670084152 669596329 669522476
2032.9F69522476o68793M19541M6005M58l95889m46778m00009o02035K594m72107K53982
$$ 669522476 668853683 669273224 669319229 669319687 668923798 668477020 668077011 667474976 667477570 667005463 667259445
2043.5F67259445l09219k16370K02255j7242J21307p23495J07651n4932j97067m31061
$$ 667259445 666950226 666733856 666936111 666918869 667040176 666316681 666424332 666369400 666172333 665741272
2053.2F65741272n77621K6092j46484J91726l10821r0637k25068J96534K25296l72773
$$ 665741272 665163651 665189743 665043259 665234985 664924164 664833527 664608459 664804993 665030289 664657516
2062.8F64657516J60370n36956k73285l70331J82724p3929m69742L26767n95550J05056
$$ 664657516 664817886 664280930 664007645 663637314 663820038 663746109 663276367 663603134 663007584 663112640
2072.5F63112640Q7738m8294k76794n37949J374k24686K77862n06057k96479M8447
$$ 663112640 663200378 663152084 662875290 662337341 662338715 662114029 662391891 661885834 661589355 661637802
2082.1F61637802K46735K73742l39508K10038l57132j52665o06155m83475j17950m58298
$$ 661637802 661884537 662158279 661818771 662028809 661671677 661519012 660912857 660429382 660311432 659853134
2091.7F59853134P0725l39508K87170k70996k38495O6681l70483j88752o80084J96152
$$ 659853134 659923859 659584351 659871521 659600525 659362030 659428711 659058228 658869476 658189392 658385544
2101.4F58385544k93579n85022l46070j20849L20282k13242R461n18189j9073J83258
$$ 658385544 658091965 657506943 657160873 657040024 657360306 657147064 657156525 656638336 656619263 656802521
2111F56802521j92032o68182q18100K64740k00272l7232k60772j77918k12097k76565
$$ 656802521 656610489 655942307 655124207 655388947 655188675 655151443 654890671 654712753 654500656 654224091
2120.7F54224091O39801p8049j32446o02112l41950R2545j97754j18561j95923N65033
$$ 654224091 654863892 654785843 654653397 654051285 653709335 653801880 653604126 653485565 653289642 653854675
2130.3F53854675N4474K8382n8899j54953J58996k21481k42691o88935k53906j96533
$$ 653854675 653909149 653937531 653878632 653723679 653882675 653661194 653418503 652729568 652475662 652279129
2140F52279129L10898L16925j45187K97546J04751K57035n17349l9673k8534k61994
$$ 652279129 652590027 652906952 652761765 653059311 653164062 653421097 652903748 652864075 652835541 652573547
2149.6F52573547L68805r8877J39695m65088K11181N03540K60620K55890n02700M5166
$$ 652573547 652942352 652843475 652983170 652518082 652729263 653232803 653493423 653749313 653246613 653291779
2159.3F53291779m07029j65176j93024j72805L92532K64053J81580j16959P33643J5030
$$ 653291779 652884750 652719574 652526550 652353745 652746277 653010330 653191910 653074951 653808594 653823624
2168.9F53823624L4866J86844m65241k19955n01556N05600J62200m3335J43052L62091
$$ 653823624 653858490 654045334 653580093 653360138 652858582 653364182 653526382 653483047 653626099 653988190
2178.5F53988190O99997k18277J64337l8376q3847l25546j32447J52970n1041O10504
$$ 653988190 654688187 654469910 654634247 654595871 654512024 654186478 654054031 654207001 654155960 654766464
2188.2F54766464R3003K97470j70594J20545L70865l07618K00043m19769k12021k24228
$$ 654766464 654859467 655156937 654986343 655106888 655477753 655170135 655370178 654950409 654738388 654514160
2197.8F54514160L01438M61120N7678M46244J00784M69818j33743k19040l04337J51215
$$ 654514160 654815598 655276718 655334396 655780640 655881424 656351242 656217499 655998459 655694122 655845337
2207.5F55845337M67987k47269K92282m92477J16730K20871O0272M02756j21155O17676
$$ 655845337 656313324 656066055 656358337 655865860 655982590 656203461 656263733 656666489 656545334 657163010
2217.1F57163010l18375l77197l02353l63159L56140J56174K17437m7073K62756o332
$$ 657163010 656844635 656467438 656165085 655801926 656158066 656314240 656531677 656484604 656747360 656741028
2226.8F56741028m2801k42233l04413K31247L1814J32447m63715J04828R5444j0529
$$ 656741028 656698227 656455994 656151581 656382828 656414642 656547089 656083374 656188202 656283646 656273117
2236.4F56273117L85361J66549K74506n34210K27203m3106n28183k365O180J58920
$$ 656273117 656658478 656825027 657099533 656565323 656792526 656749420 656221237 656218872 656225052 656383972
2246F56383972l05176L94822k40174j11847M86069j56784P0953k05307Q3313k46124
$$ 656383972 656078796 656473618 656233444 656121597 656607666 656450882 656521835 656316528 656399841 656153717
2255.7F56153717o4850n5160j23978L09372L891L58581m5471P4845l16086j61362J02768
$$ 656153717 656088867 656033707 655909729 656219101 656222992 656581573 656536102 656610947 656294861 656133499 656236267
2266.3F56236267m57611J04218l26996l7690J0148K97546Q3389l76434M16641J25504
$$ 656236267 655778656 655882874 655555878 655518188 655528336 655825882 655909271 655532837 655949478 656074982
2275.9F56074982R9258q40073m38232J43967n0431M7760k16445N72204k81067q9798
$$ 656074982 656174240 655334167 654895935 655039902 654989471 655037231 654820786 655392990 655111923 655022125
2285.6F55022125L1586j69144K36893n86472j94778m04129j34735k89231J84556O43157
$$ 655022125 655053711 654884567 655121460 654534988 654340210 653936081 653801346 653512115 653696671 654339828
2295.2F54339828q8272M54026k06147J25275k39563l65219j54877q49457J12458J46560
$$ 654339828 654251556 654705582 654499435 654624710 654385147 654019928 653865051 653015594 653128052 653274612
2304.9F53274612N44815j63421q2092L66897l06167R2926l20588L36075m91562q08868
$$ 653274612 653819427 653656006 653573914 653940811 653634644 653727570 653406982 653743057 653251495 652442627
2314.5F52442627j74713J62735O12869m22668L56598o2562K7390P73392j30158j345367
$$ 652442627 652267914 652430649 653043518 652620850 652977448 652914886 652942276 653715668 653585510 652240143
2324.2F52240143j035538O94351K01340N23148m78440q9340P44705L128L11280q72879
$$ 652240143 651204605 651898956 652100296 652623444 652145004 652055664 652800369 652803497 653114777 652241898
2333.8F52241898l58429q03528n79300p27310o09513N23682k1591R34143k4109O38123
$$ 652241898 651883469 651079941 650500641 649773331 649163818 649687500 649665909 650600052 650575943 651214066
2343.4F51214066K7542j132889q58307q84247J85394L26539Q66012m08783j49460N05371
$$ 651214066 651241608 650108719 649250412 648366165 648551559 648878098 649744110 649335327 649185867 649691238
2353.1F49691238m16870J315155j99966k44599j225128j454467L1509J478195J323853
$$ 649691238 649274368 650589523 650389557 650144958 648919830 647465363 647496872 648975067 650298920
2361.8F50298920j324692j026917k172393N41458J95617l19595J005783j107788k66418
$$ 650298920 648974228 647947311 645774918 646316376 646511993 646192398 647198181 646090393 645823975
2370.4F45823975n22309j159210j585007m55093j40533q15049l9444r0332J64261p74994
$$ 645823975 645301666 644142456 642557449 642102356 641961823 641146774 641107330 641016998 641181259 640406265
2380.1F40406265n31578j92566m63485k39220r42841o84585o72074j18484J39427o3171
$$ 640406265 639874687 639682121 639218636 638979416 638036575 637351990 636679916 636561432 636700859 636637688
2389.7F36637688K8114l64532l2692m22936m67033p35169n55839j84632m25377J01853
$$ 636637688 636665802 636301270 636268578 635845642 635378609 634643440 634087601 633902969 633477592 633579445
2399.4F33579445j60446J92642k71835o36177m87252q04443j99242m55093m54292n48516
$$ 633579445 633418999 633611641 633339806 632703629 632216377 631411934 631212692 630757599 630303307 629754791
2409F29754791m38537j34430P0648J11961l90548L4027n82695o79398l70331n85022
$$ 629754791 629316254 629181824 629252472 629364433 628973885 629007912 628425217 627745819 627375488 626790466
2418.7F26790466m31976o85730n66864m68292K3918J6289j69144m98886o48575m32358
$$ 626790466 626358490 625672760 625105896 624637604 624661522 624677811 624508667 624009781 623361206 622928848
2428.3F22928848r90905l72887j8845j35154p08504r03206k39334k59819N3711n62477
$$ 622928848 621937943 621565056 621546211 621411057 620702553 619799347 619560013 619300194 619353905 618791428
2438F18791428p14302m45137k30561k29378q17146l54118m45976l25776l86772l70903
$$ 618791428 618077126 617631989 617401428 617172050 616354904 616000786 615554810 615229034 614842262 614471359
2447.6F14471359k9182l54424n53398p72972n48515r03282m92707m41589p92046j34163
$$ 614471359 614442177 614087753 613534355 612761383 612212868 611309586 610816879 610375290 609583244 609449081
2457.2F09449081l10134j93177l73382k85302m50134n79147n43785j133042m40254
$$ 609449081 609138947 608945770 608572388 608287086 607836952 607257805 606714020 605580978 605140724
2465.9F05140724n75332o89126k31323N1079L4065n08918p70722j070938m59518m70200
$$ 605140724 604565392 603876266 603644943 603696022 603730087 603221169 602450447 601379509 600919991 600449791
2475.6F00449791m85611n38750q62465m39148n15174l47062o36940l25584k02980p04460
$$ 600449791 599964180 599425430 598562965 598123817 597608643 597261581 596624641 596299057 596096077 595391617
2485.2E95391617n76706n65338n83229j112252o81686n47066l58581k22931q02078
$$ 595391617 594814911 594249573 593666344 592554092 591872406 591325340 590966759 590743828 589941750
2493.9E89941750l14026l91999n79376j039390p97043m71344n62935m10080q27980
$$ 589941750 589627724 589235725 588656349 587616959 586819916 586348572 585785637 585375557 584547577
2502.6E84547577k50206m68216l27530o13556j156044k01607l11279m06914j055565
$$ 584547577 584297371 583829155 583501625 582888069 581732025 581530418 581219139 580812225 579756660
2511.2E79756660q27789n26695o58341k59017o32630j00288l24097n78499n63965m50287
$$ 579756660 578928871 578402176 577743835 577484818 576852188 576751900 576427803 575849304 575285339 574835052
2520.9E74835052l34625q77304o69288r68667m84161k15225k80075k71569o54220l54805
$$ 574835052 574500427 573623123 572953835 571985168 571501007 571285782 571005707 570734138 570079918 569725113
2530.5E69725113p71065n07202m39224o97708p13807p09610l37219o29997l75175k50283
$$ 569725113 568954048 568446846 568007622 567309914 566596107 565886497 565549278 564919281 564544106 564293823
2540.2E64293823k90527n74417o13671m65469n98793k23236o75430n79529l62053k99912
$$ 564293823 564003296 563428879 562815208 562349739 561750946 561527710 560852280 560272751 559910698 559610786
2549.8E59610786o54144r12056o0997k20108k31018p62482r53254n20783o63986o82526
$$ 559610786 558956642 558044586 557983589 557763481 557532463 556769981 555816727 555295944 554631958 553949432
2559.5E53949432p09686r3689k48680l97797n06096m57305o59790j051674j49002m03862
$$ 553949432 553239746 553146057 552897377 552499580 551993484 551536179 550876389 549824715 549675713 549271851
2569.1E49271851l61367m37088n79681n32074p15256R7542l68042n73807q26111n48172
$$ 549271851 548910484 548473396 547893715 547361641 546646385 546743927 546375885 545802078 544975967 544427795
2578.7E44427795j77955p79457m03672p75413n68924n52254l67241j0872m86183j73034
$$ 544427795 544249840 543470383 543066711 542291298 541722374 541170120 540802879 540792007 540305824 540132790
2588.4E40132790m59824n70564q02079o62956o54106o96373k23770p89871n72930o08444
$$ 540132790 539672966 539102402 538300323 537637367 536983261 536286888 536063118 535273247 534700317 534091873
2598E34091873m17023k45742o54335o34919o88209l45574r55810q40988n04990o17676
$$ 534091873 533674850 533429108 532774773 532139854 531451645 531106071 530150261 529309273 528804283 528186607
2607.7E28186607j77307m34150n21584o63490o90880p45697n29518m77219o89278l31535
$$ 528186607 528009300 527575150 527053566 526390076 525699196 524953499 524423981 523946762 523257484 522925949
2617.3E22925949p26929r23194q56438o71425m47769n02587o09741m41856j56670r96475
$$ 522925949 522199020 521275826 520419388 519747963 519300194 518797607 518187866 517746010 517589340 516592865
2627E16592865j102753o37169n37719m52347m01955n74264j068650o95686p32613n41648
$$ 516592865 515490112 514852943 514315224 513862877 513460922 512886658 511818008 511122322 510389709 509848061
2636.6E09848061k44522o50559n83115o92672p55158p62253n63736o40907m05998j89743
$$ 509848061 509603539 508952980 508369865 507677193 506922035 506159782 505596046 504955139 504549141 504359398
2646.3E04359398q24165p26586l49159l24211r98650o56814q9493o84242p90673q19244
$$ 504359398 503535233 502808647 502459488 502135277 501136627 500479813 500390320 499706078 498915405 498096161
2655.9D98096161p25899p33795l54500n21278p35169k67753l52631j19476o77452n90363
$$ 498096161 497370262 496636467 496281967 495760689 495025520 494757767 494405136 494285660 493608208 493017845
2665.5D93017845k60048p44858n55725o97479o84280l13301R4261l05252p28989n05028
$$ 493017845 492757797 492012939 491457214 490759735 490075455 489762154 489856415 489551163 488822174 488317146
2675.2D88317146j95388j42327p75299o06995n15213p19566r44557o00433m502l12118
$$ 488317146 488121758 487979431 487204132 486597137 486081924 485362358 484417801 483817368 483812866 483500748
2684.8D83500748l62664o49528l23601l19099n01213n51911q97102l96500o87027m53796
$$ 483500748 483138084 482488556 482164955 481845856 481344643 480792732 479895630 479499130 478812103 478358307
2694.5D78358307n48935m28810K84080m25911o38008q32100l09295r3232n09910o16493
$$ 478358307 477809372 477380562 477664642 477238731 476600723 475768623 475459328 475366096 474856186 474239693
2704.1D74239693p43485l14789l44238k53982n41268k76146k37808p67479l80096l25737
$$ 474239693 473496208 473181419 472837181 472583199 472041931 471765785 471527977 470760498 470380402 470054665
2713.8D70054665j68076p13119l98980j76468q16612n66025m89769J07728r385j77765
$$ 470054665 469886589 469173470 468774490 468598022 467781410 467215385 466725616 466833344 466823959 466646194
2723.4D66646194j54228j81999m63676j274682n91239k87552k34452p2593j90850m38232
$$ 466646194 466491966 466309967 465846291 464571609 463980370 463692818 463458366 463385773 463194923 462756691
2733D62756691l28140L1128m57764k14195o85349o60553l3531k34718m7875j28402
$$ 462756691 462428551 462459679 462001915 461787720 461102371 460441818 460408287 460173569 460125694 459997292
2742.7D59997292P286n75753k86636K68784L6926n4016o68831m01230n74989m37355
$$ 459997292 460004578 459428825 459142189 459410973 459447899 459393883 458725052 458323822 457748833 457311478
2752.3D57311478o10924q55408J57929K39639J60599m60778m41970l72353p03735l91846
$$ 457311478 456700554 455845146 456003075 456242714 456403313 455942535 455500565 455128212 454424477 454032631
2762D54032631p23000p02018n38750k15111q6632j3466j92680n59502k02636j50566
$$ 454032631 453309631 452607613 452068863 451853752 451767120 451753654 451560974 451001472 450798836 450648270
2771.6D50648270k02866j053467r61876j61819l44925l00865n06249m17976r9869l10249
$$ 450648270 450445404 449391937 448430061 448268242 447923317 447622452 447116203 446698227 446598358 446288109
2781.3D46288109r69849n41992l07770q41331n02053p44323n20401n82123p17583k13394
$$ 446288109 445318260 444776268 444468498 443627167 443125114 442380791 441860390 441278267 440560684 440347290
2790.9D40347290l95012n50918r87587o60744l02620n56145q30765p38525m81415r33418
$$ 440347290 439952278 439401360 438413773 437753029 437450409 436894264 436063499 435324974 434843559 433910141
2800.5D33910141o55899o72150j002388p16209n61791p44590o23474m80309r40208
$$ 433910141 433254242 432582092 431579704 430863495 430301704 429557114 428933640 428453331 427513123
2809.2D27513123p93267j270332j116829m33273p58133m06952n05142j021538j444664
$$ 427513123 426719856 425449524 424332695 423899422 423141289 422734337 422229195 421207657 419762993
2817.9D19762993j094093p21970r81407j049462j290626p92427l61595m59671j151314
$$ 419762993 418668900 417946930 416965523 415916061 414625435 413833008 413471413 413011742 411860428
2826.6D11860428j028557o65436j275482j045647j195678q65517r10034j313095j245194
$$ 411860428 410831871 410166435 408890953 407845306 406649628 405784111 404874077 403560982 402315788
2835.3D02315788j894912j521607j280517j092911j327935j899528k018127k273941
$$ 402315788 400420876 398899269 397618752 396525841 395197906 393298378 391280251 389006310
2843C89006310j863022k312088k410660k071991k253342k398948k517357j920052j596908
$$ 389006310 387143288 384831200 382420540 380348549 378095207 375696259 373178902 371258850 369661942
2851.7C69661942j180039p95593o11153p44705o38275O4354J63803L71551q2969l70255
$$ 369661942 368481903 367686310 367075157 366330452 365692177 365756531 365920334 366291885 366208916 365838661
2861.3C65838661m69093o36292n07850r02634o96335j052475j103325n23872p25975
$$ 365838661 365369568 364733276 364225426 363322792 362626457 361573982 360470657 359946785 359220810
2870C59220810r54933q81272m38842o86150o53191n16090o97517o77300q75931n34706
$$ 359220810 358265877 357384605 356945763 356259613 355606422 355090332 354392815 353715515 352839584 352304878
2879.6C52304878q70247j191177m99382p52869j455650q60786l62931j134071j296692
$$ 352304878 351434631 350243454 349744072 348991203 347535553 346674767 346311836 345177765 343881073
2888.3C43881073p14073n49164j153564j623803j361732q24814l11127o04324j032066
$$ 343881073 343167000 342617836 341464272 339840469 338478737 337653923 337342796 336738472 335706406
2897C35706406j120148j149483q75854o02608n61981n58243p79190r09462q33206j289635
$$ 335706406 334586258 333436775 332560921 331958313 331396332 330838089 330058899 329149437 328316231 327026596
2906.6C27026596r44061m99230q99200r72138j294479j420250j481056j602840j396180
$$ 327026596 326082535 325583305 324684105 323711967 322417488 320997238 319516182 317913342 316517162
2915.3C16517162j318264j541347j590328j152993r71679p60975n86586n34802j040153
$$ 316517162 315198898 313657551 312067223 310914230 309942551 309181576 308594990 308060188 307020035
2924C07020035q75187l5401j46579M11873L0880N8155O82487k13795m367L02028L85552
$$ 307020035 306144848 306109447 305962868 306374741 306405621 306463776 307146263 306932468 306928101 307230129 307615681
2934.6C07615681L14960O75755J131839L91312M09470L86257P44953J170273O54659
$$ 307615681 307930641 308606396 309738235 310129547 310539017 310925274 311670227 312840500 313495159
2943.3C13495159M91486N43442Q34026J157589P74669J66245N35049N74971L50895
$$ 313495159 313986645 314530087 315364113 316521702 317296371 317462616 317997665 318572636 318923531
2952C18923531K40459J66187O17848L34110N31425O86417O59866N82161K65618Q02421
$$ 318923531 319163990 319330177 319948025 320282135 320813560 321499977 322159843 322742004 323007622 323810043
2961.6C23810043O54297N03769K36817N44242J303215R75838N53284K74277J059188
$$ 323810043 324464340 324968109 325204926 325749168 327052383 328028221 328581505 328855782 329914970
2970.3C29914970R77211M14467P20024Q47969R25522N35965N83306N06324Q26302J209564
$$ 329914970 330892181 331306648 332026672 332874641 333800163 334336128 334919434 335425758 336252060 337461624
2979.9C37461624L95813p9117P1755L30238J80359K34680K69547J47133n4551K37008
$$ 337461624 337857437 337778320 337850075 338180313 338360672 338595352 338864899 339012032 338957481 339194489
2989.6C39194489M30259k95295K30026K02865k66838j83258k55394j7814p1068k06108
$$ 339194489 339624748 339329453 339559479 339762344 339495506 339312248 339056854 339039040 338967972 338761864
2999.2C38761864j016541m97131J73302l27950m56505j007652m52118k31857q29888
$$ 338761864 337745323 337248192 337421494 337093544 336637039 335629387 335177269 334945412 334115524
3007.9C34115524j144485p59354o10j14861N722o94542j155738q14820k60887k80342
$$ 334115524 332971039 332211685 332211075 332096214 332101936 331407394 330251656 329436836 329175949 328895607
3017.5C28895607j144028r29718q40568l67546l23334p39098m21943q29468j085968
$$ 328895607 327751579 326821861 325981293 325613747 325290413 324551315 324129372 323299904 322213936
3026.2C22213936q48656m54407n44471n51911q37040j087494p05185q86859o25000
$$ 322213936 321365280 320910873 320366402 319814491 318977451 317889957 317184772 316297913 315672913
3034.9C15672913j048966p95326j19343p12185p27577p94926p90519q56648q84895
$$ 315672913 314623947 313828621 313709278 312997093 312269516 311474590 310684071 309827423 308942528
3043.6C08942528r03054j067409j077423q83522l37963n52349p03583q55255p65305
$$ 308942528 308039474 306972065 305894642 305011120 304673157 304120808 303417225 302561970 301796665
3052.2C01796665r08966j008663j77059p35398j192627j183624o53572j50947q33550
$$ 301796665 300887699 299879036 299701977 298966579 297773952 296590328 295936756 295785809 294952259
3060.9B94952259p86362p72800n04818o21796r82608p59049p55787m90570o03371n32150
$$ 294952259 294165897 293393097 292888279 292266483 291283875 290524826 289769039 289278469 288675098 288142948
3070.6B88142948o60190r42116p42741m99077n42297p94087l54652o24466j027107
$$ 288142948 287482758 286540642 285797901 285298824 284756527 283962440 283607788 282983322 281956215
3079.2B81956215p45964o11363m31327n10197p06005p67441m93641o78997q01716n63926
$$ 281956215 281210251 280598888 280167561 279657364 278951359 278183918 277690277 277011280 276209564 275645638
3088.9B75645638o18954o52313r43585o88305l32794m67682o68754p49703m92229l05176
$$ 275645638 275026684 274374371 273430786 272742481 272409687 271942005 271273251 270523548 270031319 269726143
3098.5B69726143m96502q16441n16338o86245q88538m96674o51665r31720j110764
$$ 269726143 269229641 268413200 267896862 267210617 266322079 265825405 265173740 264242020 263131256
3107.2B63131256p92904l96919k79694m13322q80947j131687q07610j91154n92461
$$ 263131256 262338352 261941433 261661739 261248417 260367470 259235783 258428173 258237019 257644558
3115.9B57644558r78718n35850l28503m48780n31197o82659r88998r66435r29947n79300
$$ 257644558 256665840 256129990 255801487 255352707 254821510 254138851 253149853 252183418 251253471 250674171
3125.5B50674171n73177p90996o75240n13496k72160r91669o63051j64662p73868p40147
$$ 250674171 250100994 249309998 248634758 248121262 247849102 246857433 246194382 246029720 245255852 244515705
3135.2B44515705p22484n00889r29432j017342m62169m72088q38261j133347l71589
$$ 244515705 243793221 243292332 242362900 241345558 240883389 240411301 239573040 238439693 238068104
3143.9B38068104l95012o30303n20877o84071p82986j139488p68394n04284o34136
$$ 238068104 237673092 237042789 236521912 235837841 235054855 233915367 233146973 232642689 232008553
3152.5B32008553r36051o41727l10574o78730l46527n53474q40207j150856j213378
$$ 232008553 231072502 230430775 230120201 229441471 229094944 228541470 227701263 226550407 225337029
3161.2B25337029m44623j48220j52034n73407q00514r09138o23054m40121o47449o31428
$$ 225337029 224892406 224744186 224592152 224018745 223218231 222309093 221686039 221245918 220598469 219967041
3170.9B19967041r65652o48251o98185o27918l58200q41027o15692n69305o61717l63750
$$ 219967041 219001389 218353138 217654953 217027035 216668835 215827808 215212116 214642811 213981094 213617344
3180.5B13617344k33879p14760o47278l16048o80580m26883p78695r52835o17199n55610
$$ 213617344 213383465 212668705 212021427 211705379 211024799 210597916 209819221 208866386 208249187 207693577
3190.1B07693577j80950n11666q01468o78787m63943m92459o81591o02741o26621m46091
$$ 207693577 207512627 207000961 206199493 205520706 205056763 204564304 203882713 203279972 202653351 202207260
3199.8B02207260l89805o11591r71317r38893l63922r5672m20571n45311n46474p06597
$$ 202207260 201817455 201205864 200234547 199295654 198931732 198836060 198415489 197870178 197323704 196617107
3209.4A96617107j65252l64933o58703k86064n52521p32937o65550k32563l76473p72915
$$ 196617107 196451855 196086922 195428219 195142155 194589634 193856697 193191147 192958584 192582111 191809196
3219.1A91809196m18128m72050o74687n83858o29521n33046K41050j64642j011906
$$ 191809196 191391068 190919018 190244331 189660473 189030952 188497906 188738956 188574314 187562408
3227.8A87562408o14395m34951k43054k77176n89542p53651m55208k13947l81107m02108
$$ 187562408 186948013 186513062 186270008 185992832 185403290 184649639 184194431 183980484 183599377 183197269
3237.4A83197269m85096j45988p01580m74434K28672q77609q40969n67913l68119n1746
$$ 183197269 182712173 182566185 181864605 181390171 181618843 180741234 179900265 179332352 178964233 178912487
3247A78912487j61533j95923o84891l52993l03135k68974j41144o82754l76149m34436
$$ 178912487 178750954 178555031 177870140 177517147 177214012 176945038 176803894 176121140 175744991 175310555
3256.7A75310555l56827J18389j03245m42982p20997p39536o18706k59037j83219o20060
$$ 175310555 174953728 175072117 174968872 174525890 173804893 173065357 172446651 172187614 172004395 171384335
3266.3A71384335l34073J95656J11714q3657n91182q42591k21576J53389j97087n89657
$$ 171384335 171050262 171245918 171357632 171273975 170682793 169840202 169618626 169772015 169574928 168985271
3276A68985271m32605k76528j97391L8l6812k03113l66002o0100j77326p45564q10757
$$ 168985271 168552666 168276138 168078747 168078785 168041973 167838860 167472858 167412758 167235432 166489868 165679111
3286.6A65679111l64513L30143Q1635l63770j74904k44083n77908m12330L0250N0602
$$ 165679111 165314598 165644741 165726376 165362606 165187702 164943619 164365711 163953381 163983631 164034233
3296.2A64034233j11656l42980k94322o67515j014424j19896L01190j38550k18945
$$ 164034233 163922577 163579597 163285275 162617760 161603336 161483440 161784630 161646080 161427135
3304.9A61427135q8348l05500k29912k96554m93317m5414k79522l06301L3693l02162
$$ 161427135 161338787 161033287 160803375 160506821 160013504 159968090 159688568 159382267 159415960 159113798
3314.6A59113798m93374m39014j72119N6400k86589p42006r5196K07987n10502o66246
$$ 159113798 158620424 158181410 158009291 158065691 157779102 157037096 156941900 157149887 156639385 155973139
3324.2A55973139o95734o36597m28896j1282j23405o17924l45974n82628o54326k69327
$$ 155973139 155277405 154640808 154211912 154200630 154077225 153459301 153113327 152530699 151876373 151607046
3333.8A51607046j83954k28090n00746o6538N0411o27775o97813l93982n9175l3484
$$ 151607046 151423092 151195002 150694256 150627718 150678129 150050354 149352541 148958559 148899384 148865900
3343.5A48865900k79360l18088o55699m68750L11708J96610j39456l92637n91755m03729
$$ 148865900 148586540 148268452 147612753 147144003 147455711 147652321 147512865 147120228 146528473 146124744
3353.1A46124744k47573l23868m96874l04976K10019O68926L3607o12068p2412j96715
$$ 146124744 145877171 145553303 145056429 144751453 144961472 145630398 145664005 145051937 144979525 144782810
3362.8A44782810l48711L4580k13451l82776K15063k5845o38122J16815L99657j90621
$$ 144782810 144434099 144468679 144255228 143872452 144087515 144061670 143423548 143540363 143940020 143749399
3372.4A43749399m58689q3751q2350l11375J18676j67056M9611K24456n7754K25983
$$ 143749399 143290710 143206959 143124609 142813234 142931910 142764854 142814465 143038921 142981167 143207150
3382.1A43207150l32509k49834J43767j39141r6970j9264k14148m24766J24588M71153
$$ 143207150 142874641 142624807 142768574 142629433 142532463 142513199 142299051 141874285 141998873 142470026
3391.7A42470026M387n06716k90642J02682K21959M84676J96562k20700m34818m1199
$$ 142470026 142474413 141967697 141677055 141779737 142001696 142486372 142682934 142462234 142027416 141986217
3401.3A41986217O12393K18582m94442m39901L25937K74305k20003k19087K7380K96821
$$ 141986217 142598610 142817192 142322750 141882849 142208786 142483091 142263088 142044001 142071381 142368202
3411A42368202P2127L19795N12123k63023l71208M81386N51910J93434K060j70631
$$ 142368202 142440329 142760124 143272247 143009224 142638016 143119402 143671312 143864746 143866806 143696175
3420.6A43696175O24494M67129j98755P4281J87407K30055J44739L33300K35023K41718
$$ 143696175 144320669 144787798 144589043 144663324 144850731 145080786 145225525 145558825 145793848 146035566
3430.3A46035566M35257J78309K67076O4297K63338J19419k48766L47204K34490j8788
$$ 146035566 146470823 146649132 146916208 146980505 147243843 147363262 147114496 147461700 147696190 147677402
3439.9A47677402L07103K80809J07231O31838L69339J69373R25598M85563L69711L39470
$$ 147677402 147984505 148265314 148372545 149004383 149373722 149543095 150468693 150954256 151323967 151663437
3449.6A51663437J06754L32756M35782P56483K26650O2780K84300K13747N47610Q11929
$$ 151663437 151770191 152102947 152538729 153295212 153521862 153584642 153868942 154082689 154630299 155442228
3459.2A55442228Q21314M44689O41403J91698k93531M61597R01394J149483N60942
$$ 155442228 156263542 156708231 157349634 157541332 157247801 157709398 158610792 159760275 160321217
3467.9A60321217J97486J85624k48986J32771Q37078J039925N23128N42164R55734
$$ 160321217 160518703 160704327 160455341 160588112 161425190 162465115 162988243 163530407 164486141
3476.6A64486141O01177K92359N74875P30323L06569L04470N50728R07135R16557K96612
$$ 164486141 165087318 165379677 165954552 166684875 166991444 167295914 167846642 168753777 169670334 169966946
3486.2A69966946K84996M08439M78859Q77152J084766M66557L68976R71031P60422
$$ 169966946 170251942 170660381 171139240 172016392 173101158 173567715 173936691 174907722 175668144
3494.9A75668144O76632P20139P54394O93951N69038Q36811P23172N58033N38616P23896
$$ 175668144 176344776 177064915 177819309 178513260 179082298 179919109 180642281 181200314 181738930 182462826
3504.5A82462826Q68015Q03642Q35781J130410P94086k13680P01637J087456N18303
$$ 182462826 183330841 184134483 184970264 186100674 186894760 186681080 187382717 188470173 188988476
3513.2A88988476O82506Q79097J370983R33552M61235P02248P23438J094837Q33588
$$ 188988476 189670982 190550079 191921062 192854614 193315849 194018097 194741535 195836372 196669960
3521.9A96669960N14851P60860N76191J080151J586761O80618N79224J145229R47876
$$ 196669960 197184811 197945671 198521862 199602013 201188774 201869392 202448616 203593845 204541721
3530.6B04541721Q49820J028556J165123J004620J322803Q20179K76242J191864J427402
$$ 204541721 205391541 206420097 207585220 208589840 209912643 210732822 211009064 212200928 213628330
3539.2B13628330J344967R29775J246224J373863J111813J021289K17324Q60500J012764
$$ 213628330 214973297 215903072 217149296 218523159 219634972 220656261 220873585 221734085 222746849
3547.9B22746849J877842J828098J242867J821003M92019J005002J409091J697216
$$ 222746849 224624691 226452789 227695656 229516659 230008678 231013680 232422771 234119987
3555.6B34119987J728287N29995J433964J548996J652832J529446J958046J645622
$$ 234119987 235848274 236378269 237812233 239361229 241014061 242543507 244501553 246147175
3563.4B46147175P22580K418613Q96855J057491J348820J176490L076497J479454J060600
$$ 246147175 246869755 249288368 250185223 251242714 252591534 253768024 256844521 258323975 259384575
3572B59384575J425323J925278K292748K117233J665287O23531J973191J858997J668415
$$ 259384575 260809898 262735176 265027924 267145157 268810444 269433975 271407166 273266163 274934578
3580.7B74934578J973152J986923K254734J796093L327694J887360l3741J935692J321430
$$ 274934578 276907730 278894653 281149387 282945480 286273174 288160534 288126793 290062485 291383915
3589.4B91383915K599392K325344K589016K235851J607113K749901J157188K307415
$$ 291383915 293983307 296308651 298897667 301133518 302740631 305490532 306647720 308955135
3597.1C08955135K651997J988850L010730J352024J565075K409592K203369K932739
$$ 308955135 311607132 313595982 316606712 317958736 319523811 321933403 324136772 327069511
3604.8C27069511L549118K518044Q06007M126053J167107R10911N975342J618042L93067
$$ 327069511 330618629 333136673 333942680 338068733 339235840 340146751 346122093 347740135 348133202
3613.5C48133202L760414J927833M348488L875122K805100K950248Q20351J912041
$$ 348133202 351893616 353821449 358169937 362045059 364850159 367800407 368620758 370532799
3621.2C70532799L261490L448639L030471L726769L497352L459778N589333N7602m686470
$$ 370532799 373794289 377242928 380273399 384000168 387497520 390957298 396546631 396604233 391917763
3629.9C91917763N265922O252747O254616L347435K97088K851410M136162L511620
$$ 391917763 397183685 403436432 409691048 413038483 413335571 416186981 420323143 423834763
3637.6D23834763K048721K789497L967591M045868L339538K324562L293228M505005
$$ 423834763 425883484 428672981 432640572 436686440 440025978 442350540 445643768 450148773
3645.3D50148773O025200J252556r52072P132988L259887q83903P33719N743789N336876
$$ 450148773 456173973 457426529 456474457 463607445 466867332 465983429 466717148 472460937 477797813
3654D77797813M382286M823380l927231M704323O438980K419663K954521J345978K701568
$$ 477797813 482180099 487003479 483076248 487780571 494219551 496639214 499593735 500939713 503641281
3662.7E03641281K432099L603973L481178J659470M777107K950478J634178L03573
$$ 503641281 506073380 509677353 513158531 514818001 519595108 522545586 524179764 524483337
3670.4E24483337m009704M250831Q353959R331131j286583j3481369L517341P593346
$$ 524483337 520473633 524724464 533078423 542409554 541122971 527641602 531158943 538752289
3678.1E38752289N690574j04827J021843K413558K716179K512093J340446J107445
$$ 538752289 544442863 544338036 545359879 547773437 550489616 553001709 554342155 555449600
3685.8E55449600M255333O624565q244476k138100Q197441l943023P12433N480995
$$ 555449600 559704933 566329498 558085022 555946922 564144363 560201340 560913773 566394768
3693.5E66394768J208496J536407Q93174K69813J735497J037025K877731K723427m419060
$$ 566394768 567603264 569139671 570032845 570302658 572038155 573075180 575952911 578676338 574257278
3702.2E74257278o45141M357719J103058K5597J044845L217888L638878n783920L424911
$$ 574257278 573612137 577969856 579072914 579098511 580143356 583361244 587000122 581216202 584641113
3710.9E84641113L994103j1468125M096756M894600J006012P89719K161865J464462
$$ 584641113 588635216 577167091 581263847 586158447 587164459 587954178 590116043 591580505
3718.6E91580505l033599J676292N297050l307647k833100N488930J740913j340484
$$ 591580505 588546906 590223198 595520248 592212601 589379501 594868431 596609344 595268860
3726.3E95268860l176193L38783M211426J738052M801331l243294o331558R231720
$$ 595268860 592092667 592431450 596642876 598380928 603182259 599938965 593607407 602839127
3734F02839127K086906p935944k095756J232910J100273K697449L693619k807122L567315
$$ 602839127 604926033 596990089 594894333 596127243 597227516 599924965 603618584 600811462 604378777
3742.7F04378777J0341224j2312851j1916618R967689O237870N385399m650879p642174
$$ 604378777 614720001 602407150 590490532 600458221 606696091 612081490 607430611 599788437
3750.4E99788437J0208168p628975n696487O967315M156380K721176m769478K593155
$$ 599788437 609996605 602367630 596671143 603638458 607794838 610516014 605746536 608339691
3758.2F08339691N052681p835579r48601L775368R09805Q03299M157944k266311m700776
$$ 608339691 613392372 605556793 604608192 608383560 609293365 610096664 614254608 611988297 607287521
3766.8F07287521K829018L664246O3362o854019K701149L123970J1596R09882o73371
$$ 607287521 610116539 613780785 613844147 606990128 609691277 612815247 612826843 613736725 613063354
3775.5F13063354R66874L59230K308922J31912o788674K570572K421913J490631K084694
$$ 613063354 614030228 614389458 616698380 616830292 610041618 612612190 615034103 616524734 618609428
3784.2F18609428k567062j642189O46515P99293J71204K58141O13060L91616N77889
$$ 618609428 616042366 614400177 615046692 615845985 616017189 616275330 616888390 617280006 617857895
3792.9F17857895k52838J033516J896705l572578k536240K847939M136009M924622
$$ 617857895 617605057 618638573 620535278 616962700 614426460 617274399 621410408 626335030
3800.6F26335030q040886j0653076M981307L924027N471649M932480j0178986l506088
$$ 626335030 618294144 607641068 612622375 616546402 622018051 626950531 616771545 613265457
3808.3F13265457M262848J987724N82199L71323J28632J068115M958000j315575j2532653
$$ 613265457 617528305 619516029 620098228 620469551 620598183 621666298 626624298 625308723 612776070
3817F12776070M177436N035096L291893j03760j3832359K488479M812584K341271K382736
$$ 612776070 616953506 621988602 625280495 625176735 611344376 613832855 618645439 620986710 623369446
3825.7F23369446j564026m254456J358757K863617L115998J404647o868209K509002
$$ 623369446 621805420 617550964 618909721 621773338 624889336 626293983 619425774 621934776
3833.4F21934776N826798o848374J17569O945572r546013k415542P911033l468361
$$ 621934776 627761574 620913200 621030769 627976341 618430328 616014786 623925819 620457458
3841.1F20457458n86624M698830k956619k877312K613030R53941j106J750488O6109
$$ 620457458 619870834 624569664 621613045 618735733 621348763 622302704 622301598 624052086 624118195
3849.8F24118195K533760M442443o841735j854287j3030166L461494R710770j109581
$$ 624118195 626651955 631094398 624252663 622398376 609368210 612829704 622540474 621430893
3857.5F21430893j070747K212066J764527K306175m247132K02370M995003o294556
$$ 621430893 620360146 622572212 624336739 626642914 622395782 622598152 627593155 621298599
3865.2F21298599m247589M093895M673004M587136q654061p843780M508857N928536
$$ 621298599 617051010 621144905 625817909 630405045 621750984 613907204 618416061 624344597
3872.9F24344597K619133q996620J387176M035149p06139J849251L984566m875717
$$ 624344597 626963730 617967110 619354286 623389435 622683296 624532547 628517113 623641396
3880.6F23641396n921174M789391Q17184J497307K887192j1844177K378959L993607
$$ 623641396 617720222 622509613 623326797 624824104 627711296 615867119 618246078 622239685
3888.3F22239685J050072L544998k394600o572151K089615K583046j580963J198234
$$ 622239685 623289757 626834755 624440155 617868004 619957619 622540665 620959702 622157936
3896.1F22157936J745758K308731o42776q461113N786323L21198m651489M482460k732850
$$ 622157936 623903694 626212425 625569649 617108536 622894859 623216057 618564568 623047028 620314178
3904.7F20314178q01849L50037Q28209J780319r995R5024m39567J67084r461l53546
$$ 620314178 619512329 619862366 620690575 622470894 622460899 622555923 622116356 622283440 622273979 621920433
3914.4F21920433M5319O75850k707024j961632M069405r18503l043633K203866J605911
$$ 621920433 621965752 622641602 619934578 617972946 622042351 621123848 618080215 620284081 621889992
3923.1F21889992N40581k236252j976967J304397J234436R34182p04766o72607J577186
$$ 621889992 622430573 620194321 618217354 619521751 620756187 621690369 620985603 620312996 621890182
3931.7F21890182j657562j534576J689987J67847l58658m55704j50757N59464j38512
$$ 621890182 620232620 618698044 620388031 620555878 620197220 619741516 619590759 620150223 620011711
3940.4F20011711J809883R10416l798790o14586J106072O56967O51054j415520M46015
$$ 620011711 621821594 622732010 618933220 618318634 619424706 620081673 620732727 619317207 619763222
3949.1F19763222p19071j537132K020264n23796j126404N33142M84466K0028n09224
$$ 619763222 619044151 617507019 619527283 619003487 617877083 618410225 618894691 618914719 618405495
3957.8F18405495J248436L46107j8463n17464j933174J73493P33986q5946m80232N71251
$$ 618405495 619653931 620000038 619981575 619464111 617530937 617704430 618438416 618352470 617872238 618443489
3967.4F18443489P54852o30645n80101N08499N85594n18112R4795J55411j97983k90299
$$ 618443489 619198341 618567696 617987595 618496094 619081688 618563576 618658371 618813782 618615799 618325500
3977.1F18325500l48434J28326j20964M99459O2637m31480M0092K47040M41933l66173
$$ 618325500 617977066 618105392 617984428 618483887 618546524 618115044 618155136 618402176 618844109 618477936
3986.7F18477936l36495J11275M6845l87345K69509N32035l68194M4861J81160P68966
$$ 618477936 618141441 618252716 618299561 617912216 618181725 618713760 618345566 618390427 618571587 619340553
3996.3F19340553j3275j382675O6032J015320
$$ 619340553 619327278 617944603 618010635 619025955
4000.2F19025955
$$ 619025955
##END=$$ End of the data block
