##TITLE=$$ Begin of the data block
##JCAMP-DX=5.00 $$ ACD/SpecManager v 10.08
##SPECTROMETER/DATA SYSTEM=Varian
##DATE=07 Jan 2013 17:15:52
##DATA TYPE=INFRARED SPECTRUM
##DATA CLASS=XYDATA
##ORIGIN=
##OWNER=
##NPOINTS=3735
##FIRSTX=399.26403809
##LASTX=4000.35498047
##MAXX=4000.35498047
##MINX=399.26403809
##MAXY=74.33058167
##MINY=35.89289474
##XFACTOR=1.0000000000
##YFACTOR=0.000000100000000
##FIRSTY=53.79202271
##DELTAX=0.96440572
##XUNITS=1/CM
##YUNITS=TRANSMITTANCE
##XYDATA=(X++(Y..Y))
399.3E37920227p156486O241111O153069p515869o153984o135788J86691K408218J625290
407.9E27572479l50456k347488L825302n626831l724633L555680J586532Q25577o346588
416.6E18969574n069313O842918J0467224J801072l75023r626084r445800N529518
424.3E19094086L731079O421661j173401r099731k096367L852386J976128j616630
432.1E21089211K874488j307220j798592M734879P43561l878060m222870L391724J450882
440.7E23078003K24686P770004l43933l856240l528938j586876J877213k108422j565780
449.4E19959717K945289M284935K261353j356430k665138j355210j969871j438332
457.1E20666313J573563N379m782868n455246L058510N746040L269120p04995l062248
$$ plain form
399.3 537920227 530763741 537004852 543157921 535642052 529488068 523352280 523538971 525947189 527572479
407.9 527572479 527222023 524874535 528699837 523073006 519348373 522904053 524490585 525316162 518969574
416.6 518969574 513900261 520743179 531210403 533011475 532636452 523010368 513564568 519094086
424.3 519094086 522825165 529246826 528073425 518973694 516877327 520729713 522705841 521089211
432.1 521089211 523963699 522656479 520857887 525592766 526336327 522458267 518235397 521627121 523078003
440.7 523078003 523302689 531072693 530728760 526872520 523343582 521756706 523633919 521525497 519959717
449.4 519959717 522905006 527189941 529451294 528094864 525429726 524074516 522104645 520666313
457.1 520666313 522239876 522245255 517462387 512007141 515065651 520811691 524080811 523375816 520313568
465.8E20313568j447716j568374J902771J844406n1537J580735K861328j537400n503273
474.5E18394508l372726j252861K7962O64482r23538k393532m8523L889274K186852
483.2E17171898J43433j591187p42950R47189n29213j273918m175225q40911M198989
491.8E13308105K029686J582718p95211j522942M09203q94166j346282q40226k385177
500.5E09545708j291924L219147J11732j767196J458091J984025o9504k784386j761131
509.2E08644562j490479j518249R03625r46350n08919J499329p62291k75001J798095
517.9E07344322J73302k291908p35093j699676l554459Q48694K891617J130791k356301
526.6E01751289l242J979484k005233j718445n92499M97932J159707p29332M79622
$$ plain form
465.8 520313568 518865852 517297478 519200249 521044655 520993118 522573853 525435181 523897781 518394508
474.5 518394508 515021782 513768921 513796883 514461365 513537827 511144295 511095772 514985046 517171898
483.2 517171898 517315331 515724144 514981194 515928383 515399170 514125252 509950027 509109116 513308105
491.8 513308105 515337791 516920509 516125298 514602356 515011559 514117393 512771111 511930885 509545708
500.5 509545708 508253784 511472931 511584663 509817467 511275558 513259583 513190079 510405693 508644562
509.2 508644562 507154083 505635834 506539459 505593109 505084190 506583519 505821228 505546227 507344322
517.9 507344322 507517624 505225716 504490623 502790947 499236488 500085182 502976799 504107590 501751289
526.6 501751289 501748047 503727531 501722298 500003853 499411354 499909286 501068993 500339661 500819283
535.2E00819283n52674j058082J097450l18947p69844j124382k050285P55577K108993
543.9D98907089N12810j121864k038689m98009N38559P55348N04189j449127k644768
552.6D93465538j506615J626053J868668k62680j099167M616R82628k52190l30849
561.3D94496002j499862j970025L95928P02629J179962K215576J864128o6414j569786
570D95748138n21888o22902j330261j268540k07062J510849J490403n99251j565171
578.6D92634315l96842Q36181M99230M4555K88658p95936j109276J51939O1417P18079
588.3D92932320J285438J60828m7798P53326R84497j23062j621742M20074K381592
597D97125473k93846j520844K51694K110138J611328j321716k097397j346741n04799
$$ plain form
535.2 500819283 500266609 499208527 500305977 499987030 499217186 498092804 496042519 496798096 498907089
543.9 498907089 499419899 498298035 496259346 495761337 496299896 497055244 497559433 496110306 493465538
552.6 493465538 491958923 493584976 495453644 495190964 494091797 494096413 495079041 494826851 494496002
561.3 494496002 492996140 491026115 491422043 492124672 493304634 495520210 497384338 497317924 495748138
570 495748138 495226250 494603348 493273087 492004547 491797485 493308334 494798737 494199486 492634315
578.6 492634315 492237473 493073654 493572884 493617439 493906097 493110161 492000885 492152824 492214241 492932320
588.3 492932320 494217758 494378586 494330788 495084114 496068611 495945549 494323807 494743881 497125473
597 497125473 496831627 495310783 495562477 497672615 499283943 497962227 495864830 494518089 494013290
605.6D94013290r3078m12941N48363M67147n64308p58285k80876P53898N55229j115150
615.3D93113289j277886m09812j291848p34939J054611J689758J306992P01713R13849
624D95065727J304245J549378P69157m42047l36418K21519R08280O89201P69081J798897
633.6E02297020J182976J334533J712113O02989P03201J161805J171646J030197Q01430
642.3E11997910O98242Q61702J487922R56078m03214P0496J143341J148224J049385
651E19010086M63181L45115n72395j314278J113930J446762o17142q40454m8485M66729
660.6E19453049O67152J22681n87502j9455P14913L00636k149048m962311L184319
669.3E16724434K058563J877976J474990J012612N38025K16980R71183Q31070q43620
$$ plain form
605.6 494013290 493920212 493507271 494055634 494522781 493958473 493200188 492919312 493673210 494228439 493113289
615.3 493113289 491835403 491425591 490133743 489398804 490453415 492143173 493450165 494151878 495065727
624 495065727 496369972 497919350 498688507 498246460 497910042 498131561 499039841 499729042 500498123 502297020
633.6 502297020 503479996 504814529 506526642 507129631 507832832 508994637 510166283 511196480 511997910
642.3 511997910 512696152 513557854 515045776 516001854 515598640 515669136 516812477 517960701 519010086
651 519010086 519473267 519818382 519245987 517931709 519045639 520492401 519875259 519034805 518986320 519453049
660.6 519453049 520120201 520242882 519655380 519635925 520350838 520651474 518502426 513540115 516724434
669.3 516724434 518782997 520660973 522135963 523148575 523686600 523903580 524874763 525705833 524862213
678E24862213q93097J203156J609688J163597J418571K053909K080231J078606R10492
686.7E35487366j89743j154976j389694j033020J161651K091599J653480J095848R24301
695.3E38646812J628952J034699j064186j481400l97339K52800N21126Q9302N96009
704E39826775J578025K301712J558381P667P63931K9068j071090o05088j1482P77359
713.7E45155258R35097R75189J114731K406197J111450m05770O49300j063843j436844
722.3E49440765K73705J668434J439476O62270R02290M48265J483269K223663K01187
731E58743324j428680Q2092M43154k77558P35016N05981Q68836P63130J268234J300125
740.7E63003654o36215n33600o84814O42815J490898O62307M07677M83170J497192
$$ plain form
678 524862213 523969116 525172272 526781960 527945557 529364128 531418037 533498268 534576874 535487366
686.7 535487366 535297623 534142647 532752953 531719933 532881584 534973183 536626663 537722511 538646812
695.3 538646812 540275764 541310463 540246277 538764877 538367538 538620338 539141464 539230766 539826775
704 539826775 541404800 543706512 545264893 545272560 546036491 546065559 544994469 544389381 544377899 545155258
713.7 545155258 546090355 547065544 548180275 550586472 551697922 551292152 551941452 550877609 549440765
722.3 549440765 549714470 551382904 552822380 553484650 554386940 554835205 556318474 558542137 558743324
731 558743324 557314644 557396736 557839890 557562332 558297348 558803329 559672165 560435295 561703529 563003654
740.7 563003654 562367439 561833839 561149025 561791840 563282738 563945045 564352722 564835892 566333084
749.3E66333084O03294K89116N07203k18888k22397O58799J240272M51813P56111J081467
759E71479874J146774P91473M04244R45015J163788J123123J67885k28119n44548J54571
768.6E76604080M31557j48354R73664L66630r0370K5482l04680n71251r69543m11301
778.3E75905914Q46634J884575N92728N73311R23614l13072J99318J31721p18765o25954
787.9E79400024K38152R45396J334877N55687J56632n21240j835633j77498m67720
796.6E79628677r76524p0000j30386L73001j08795k93808n56145p48291j416015k040253
806.2E73661461j639938j177330l49503r70116m74930J88714n54772p04346o61964
814.9E67317276j393585j590233l26691j610222j047973Q27217M68674J574974K215042
$$ plain form
749.3 566333084 566936378 567225494 567732697 567513809 567291412 567950211 569190483 569642296 570398407 571479874
759 571479874 572626648 573418121 573822365 574767380 575931168 577054291 577222176 576994057 576449509 576604080
768.6 576604080 577035637 576887283 577860947 578227577 578137207 578162689 577858009 577286758 576317215 575905914
778.3 575905914 576752548 578637123 579229851 579803162 580726776 580413704 580613022 580744743 580025978 579400024
787.9 579400024 579638176 580583572 581918449 582474136 582630768 582109528 580273895 580096397 579628677
796.6 579628677 578652153 578582153 578451767 578824768 578715973 578422165 577866020 577117729 575701714 573661461
806.2 573661461 572021523 570844193 570494690 569524574 569049644 569238358 568683586 567979240 567317276
814.9 567317276 565923691 564333458 564006767 562396545 561348572 562175789 562644463 564219437 566434479
823.6E66434479K344436J400185J126900R79576J79176J486664J324043J809349K191048
832.3E79275856J532135K307930L120995L161125J641845N07584k05231K4796R67941
841E92334976J810951J032563K34413K409439K652664J257744P17087N87387l31955
849.6F02705269R3880J396331j29127n53322P48405K592011K938156K269058J684723
858.3F13745384J085968J109352o03714m40902J793m48342l22227J068802K212181
867F17408295n4436n84450o85921n59425j549721k658119j628342k237510q82797J67655
876.7F06735229N19791J98898K76719J201095j022110p52601l21503j485214j966477
885.3F03383827j487121k21062K55318N34820k79198M53759N93872k43035r9830m72641
$$ plain form
823.6 566434479 568778915 570179100 571306000 572285576 572464752 573951416 575275459 577084808 579275856
832.3 579275856 580807991 583115921 586236916 589398041 591039886 591547470 591342239 591367035 592334976
841 592334976 594145927 595178490 595412903 597822342 600475006 601732750 602449837 603037224 602705269
849.6 602705269 602799149 604195480 604066353 603513031 604261436 606853447 609791603 612060661 613745384
858.3 613745384 614831352 615940704 615336990 614896088 614897881 614449539 614127312 615196114 617408295
867 617408295 617353859 616769409 616083488 615524063 613974342 611316223 609687881 607450371 606567574 606735229
876.7 606735229 607255020 607453918 607730637 608931732 607909622 607157021 606835518 605350304 603383827
885.3 603383827 601896706 601675644 601930962 602465782 602186584 602640343 603234215 602991180 602891350 602418709
895F02418709l24402m61273J72157K71568N81475P28492m05311j18942P38945J605606
904.6F05207024P08122j75476M45747J306038N84908j54267J347275O71349P4806m31633
914.3F09583893j335488n91697p20940j921081k608490k039109k721252k149773o03218
922.9E94892845j432953k813339k931061j945305k191467k557678l154068k720528
930.7E75146446j529617j753731q47549O5422J46942j90010p78465r60312p97959n31234
940.3E67969933o94695p55920p97921j99966j01051k26860J3084l52135m47578k22054
949.9E64184837K69356q01391j305657q93745j077881k17972r26666j800347k042350
958.6E55388184j992875j024398j566887k350884j965675j499252j373520j201287
$$ plain form
895 602418709 602094307 601633034 601805191 602076759 602658234 603386726 602981415 602862473 603601418 605207024
904.6 605207024 605915146 605739670 606185417 607491455 608076363 607922096 609269371 609940720 610015526 609583893
914.3 609583893 608248405 607656708 606935768 605014687 602406197 600367088 597645836 595496063 594892845
922.9 594892845 593459892 590646553 587715492 585770187 583578720 581021042 577866974 575146446
930.7 575146446 573616829 571863098 571015549 571080971 571227913 571037903 570259438 569299126 568501167 567969933
940.3 567969933 567275238 566519318 565721397 565521431 565420380 565193520 565206604 564854469 564406891 564184837
949.9 564184837 564454193 563652802 562347145 561453400 560375519 560157547 559230881 557430534 555388184
958.6 555388184 553395309 552370911 550804024 548453140 546487465 544988213 543614693 542413406
966.3E42413406j382522j381073j031876j172714j567230j933060k225227k280274
974.1E29439430j865463k317810k055321j837959l260574l687325l714485l019447
981.8E07681046k607842l206062l647423m052048l857994l166008l050690l393135
989.5D80699844k540588k077217k327538l072395l226852k374268k808037k580147
997.2D59692802j759338j712494k199364k300872k159615j603775r51652j483765j675491
1005.9D43846436k117081j318894q47892j363488o00509j109772j295738j030388j208534
1014.6D32954140j936112k437820j794205j701889j716804k556992k671089j423187
1022.3D16716042q27942j192665j323357j590195j618232n62020r67522l96537k24572
$$ plain form
966.3 542413406 541030884 539649811 538617935 537445221 535877991 533944931 531719704 529439430
974.1 529439430 527573967 525256157 523200836 521362877 518102303 514414978 510700493 507681046
981.8 507681046 505073204 501867142 498219719 494167671 490309677 487143669 484092979 480699844
989.5 480699844 478159256 476082039 473754501 470682106 467455254 465080986 462272949 459692802
997.2 459692802 457933464 456220970 454021606 451720734 449561119 447957344 447005692 445521927 443846436
1005.9 443846436 441729355 440410461 439562569 438199081 437598572 436488800 435193062 434162674 432954140
1014.6 432954140 431018028 428580208 426786003 425084114 423367310 420810318 418139229 416716042
1022.3 416716042 415888100 414695435 413372078 411781883 410163651 409601631 408634109 408237572 408013000
1031D08013000r69696m68368l98178j35460l03841O39344J552276J598854J239777
1039.6D10767708N31235R24873J211777O37817m5509Q21647K48337r88731r44748r29375
1049.3D12235031l74222r43184o95343n79948j060371j558838j275368J37024q51555
1058D05033226l75710J065178K168465J608696O12640J862030K166596K205505R59473
1066.6D17306099J223679J662139P33147O75812Q43582J660919M42810J2856l2692
1075.3D24528351J69716M61693n57518P33146K64511L27263J470490L67775J12762
1084D27878189J274681J679306K30255O39458J310005Q79593J000061J061592R68437
1092.7D36921577J309205K205734J348228N02205R00803J713638J753388P85598P01714
$$ plain form
1031 408013000 407043304 406574936 406176758 406041298 405737457 406376801 407929077 409527931 410767708
1039.6 410767708 411298943 412223816 413435593 414073410 414027901 414849548 415097885 414109154 413164406 412235031
1049.3 412235031 411860809 410917625 410222282 409642334 408581963 407023125 405747757 405884781 405033226
1058 405033226 404657516 405722694 407891159 409499855 410112495 411974525 414141121 416346626 417306099
1066.6 417306099 418529778 420191917 420925064 421600876 422444458 424105377 424548187 424561043 424528351
1075.3 424528351 424698067 425159760 424602242 425335388 425599899 425927162 427397652 427765427 427878189
1084 427878189 429152870 430832176 431062431 431701889 433011894 433891487 434891548 435953140 436921577
1092.7 436921577 438230782 440436516 441784744 442286949 443187752 444901390 446654778 447440376 448142090
1101.4D48142090J302681J468468Q42018J536636J332474L06129J063576J078110M66270
1110D57538452K9030M63295R15070P35931J110611J177978J02616l68958L98102R0332
1119.7D62192459M76685M58717n03082J97334J96533P7362N86472J279182J230355
1128.4D66192017O91909J145058J396027J291008J104583J702614J927490J589547
1136.1D77040253J717338K108345J742935O13442Q53119R29756Q85162J341629J324807
1144.8D88556786J008071O81534N94712j34468j62468K25944J20773J78223j14517
1153.4D90954590J06544j98593o47087J42784J8120q00819p52983l30506o57692j008835
1163.1D86825523l75328M90113J321144J647148J327972J631317K213631J977730J860695
$$ plain form
1101.4 448142090 449444771 450913239 451755257 453291893 454624367 454930496 455994072 457072182 457538452
1110 457538452 457567482 458030777 458945847 459681778 460792389 461970367 462072983 461704025 462102127 462192459
1119.7 462192459 462669144 463127861 462624779 462822113 463018646 463096008 463682480 464961662 466192017
1128.4 466192017 466883926 468028984 469425011 470716019 471820602 473523216 475450706 477040253
1136.1 477040253 478757591 480865936 482608871 483222313 484075432 485005188 485890350 487231979 488556786
1144.8 488556786 489564857 490246391 490841103 490706635 490544167 490770111 490890884 491069107 490954590
1153.4 490954590 491061134 490862541 490215454 490358238 490376358 489575539 488822556 488492050 487834358 486825523
1163.1 486825523 486450195 486940308 488261452 489908600 491236572 492867889 495081520 497059250 498919945
1171.8D98919945J794433J767998J743355J852379J865921J773681J847763J944695
1179.5E13510170K600212K214890J411819R97467O42548K61650L88832R88502L55606
1188.1E23371696M96293R48181P83844O16798M5700m29840p84759j005669j562729
1196.8E22479515r87167j45378m40483j056939j181221j40495M5548n19448q18634
1205.5E17235298q92258j082496j380158p42302k91442P4806L68118J70441J38511
1214.2E13598518j68342m26903o18439q15239j122894q24737l86467m04282K72789
1222.9E09104004L78380M310k91023n42259l03307n67398q75931j018714j036950r39521
1232.5E03911591p94754k01798l6888K39067N21317K0751m70161n25703n21050o18973
$$ plain form
1171.8 498919945 500714378 502482376 504225731 506078110 507944031 509717712 511565475 513510170
1179.5 513510170 516110382 518325272 519737091 520734558 521377106 521638756 522027588 523016090 523371696
1188.1 523371696 523867989 524816170 525600014 526216812 526262512 525832672 525047913 524042244 522479515
1196.8 522479515 521492348 521346970 520906487 519849548 518668327 518527832 518573380 518053932 517235298
1205.5 517235298 516343040 515260544 513880386 513138084 512846642 512921448 513289566 513460007 513598518
1214.2 513598518 513430176 513003273 512384834 511569595 510446701 509621964 509235497 508831215 509104004
1222.9 509104004 509482384 509486694 509195671 508653412 508350105 507782707 506906776 505888062 504851112 503911591
1232.5 503911591 503116837 502915039 502878151 503117218 503638535 503659286 503189125 502663422 502142372 501523399
1242.2E01523399m82368m78783k64168o4430j3313K39754l281j17149l50304n44624
1251.8D99444733l97835l07350l33405n42640j6861L20358N53551N74951p057L09562
1261.4D99598007N24636j84517o93283q4725K59628M96941J061401P49855J234360
1270.1E02962303J568947P63817K81029K24113L56751L88450N80063J059380J318588
1278.8E09503441J198768J045914J271973J159057P58095J090851R24721M77028P91015
1287.5E18220863J163025J071739R09501J106834P75871Q73680Q47855O40907Q10280
1296.2E26420555J32370J07918K07329N26275N28908M91066R32198J51443o2752l53660
1305.8E29081650m29497k43759r0637K03628m36210l23449m20417l32146q4610m40674
$$ plain form
1242.2 501523399 501041031 500562248 500298080 500233650 500220337 500460091 500456810 500339661 499989357 499444733
1251.8 499444733 499046898 498739548 498406143 497863503 497846642 498167000 498720551 499295502 499288445 499598007
1261.4 499598007 500122643 499938126 499244843 499160118 499419746 499916687 500978088 501727943 502962303
1270.1 502962303 504531250 505295067 505576096 505800209 506156960 506545410 507125473 508184853 509503441
1278.8 509503441 510702209 511748123 513020096 514179153 514937248 516028099 516952820 517429848 518220863
1287.5 518220863 519383888 520455627 521365128 522471962 523247833 524121513 524969368 525610275 526420555
1296.2 526420555 526552925 526660843 526868172 527394447 527923355 528414421 529346619 529498062 529435310 529081650
1305.8 529081650 528652153 528408394 528317757 528521385 528085175 527761726 527341309 527009163 526924553 526483879
1315.4E26483879P9765L78266K97241p6447j82380L05977P19375P55921P12051P51076
1325.1E30224724L52783L48701P5532R2544m005n88189m76684m88625l87993j92298
1334.7E28956490L2692k1973q2894L06969N45159J80854l03993M65012N98106L62435
1344.4E31038857N54237O15463O60324K09580K51198r2240j48926k43415m95453k87743
1354E32061882m88243J31531R8037K3461N9814L0556j65100q28476l86772j143952
1363.7E29392738k24189J67236k94151J21421l78990m11644j37596p1983j61057j52893
1373.3E27848892l84140q63075l07541j40152J55907J54915L48587j57891p77092p64122
1382.9E25114288j248932r02137m87557m57153k133141r31129J00098r83735p50732
$$ plain form
1315.4 526483879 526563644 526941910 527239151 527162704 526980324 527286301 528005676 528761597 529473648 530224724
1325.1 530224724 530577507 530926208 531001740 531094284 531090279 530502090 530025406 529536781 529148788 528956490
1334.7 528956490 528989182 528967209 528884315 529191284 529736443 529917297 529613304 530078316 530676422 531038857
1344.4 531038857 531593094 532208557 532868881 533078461 533329659 533237419 533088493 532845078 532349625 532061882
1354 532061882 531573639 531705170 531803207 531826668 531886482 531917038 531751938 530923462 530536690 529392738
1363.7 529392738 529168549 529335785 529041634 529163055 528784065 528372421 528234825 528162842 528001785 527848892
1373.3 527848892 527464752 526601677 526294136 526153984 526309891 526464806 526813393 526655502 525878410 525114288
1382.9 525114288 523865356 522963219 522475662 522018509 519885368 518954239 519054337 518070602 517319870
1391.6E17319870p96165o54793k363854l075409r92431j355820o58531k375145j850777
1400.3E03196945m67453j554642j125717r15146k121658k077751j223641j526870j634712
1409D90549355j318055j058998n12848q16192p33452k90756m21791q62732p25403K46124
1418.6D84055252k732582o44112J009827M06494R09233l50151N27001J009750M7874
1427.3D84238586N00184O6185n0164O95687J177902O66084J038818K153512J929893
1436D92416687N14984O3477K033729J181183N48515R09234L79524Q12301P40586J355018
1445.6E00955238J467438P61032o12335P49245J728172N38063P39632O14853J205635
1454.3E08146973J039810Q86955J492272k06299K539406Q91952J559830Q71238O07834
$$ plain form
1391.6 517319870 516523705 515868912 513505058 510429649 509437218 508081398 507422867 505047722 503196945
1400.3 503196945 502729492 501174850 500049133 499133987 497012329 494934578 493710937 492184067 490549355
1409 490549355 489231300 488172302 487659454 486843262 486109810 485819054 485397263 484534531 483809128 484055252
1418.6 484055252 481322670 480678558 481688385 482094879 483004112 482653961 483180962 484190712 484238586
1427.3 484238586 484738770 484804955 484754791 485450478 486628380 487294464 488333282 490486794 492416687
1436 492416687 492931671 492995148 495028877 496210060 496758575 497667809 498047333 498859634 499600220 500955238
1445.6 500955238 502422676 503183708 502571373 503320618 505048790 505586853 506326485 506941338 508146973
1454.3 508146973 509186783 510073738 511566010 511359711 513899117 514791069 516350899 517222137 517829971
1463E17829971J847039K7999J626664K082023K289696J695595K082786L307343J917419
1471.7E34706535J454430J391716K426300K513847J685448J590767J782722J934205
1479.4E49485970J634101J458092J322441J538353Q84438L15513J461716J049538O1798
1488.1E59211960J246643M90265n31960J40267N23529j77269n74951o67420l899345
1496.7E55761719L92723l51868k239303J88751m55513j150818j064224O75239J093712
1505.4E52850418k224808m365844j026497P97538n37567P05033n49660j277428K96517
1514.1E44667702n22309k22854j563912k783584P32269J407585q02269k353325Q97713
1522.8E39457016J277657J721191m89693L76206R00459o34842L88374P94373R43642
$$ plain form
1463 517829971 519677010 519705009 521331673 523413696 525703392 527398987 529481773 532789116 534706535
1471.7 534706535 536160965 537552681 539978981 542492828 544178276 545769043 547551765 549485970
1479.4 549485970 551120071 552578163 553900604 555438957 556323395 556638908 558100624 559150162 559211960
1488.1 559211960 560458603 560948868 560416908 560557175 561080704 560903435 560328484 559661064 555761719
1496.7 555761719 556154442 555802574 553563271 553752022 553296509 552145691 551081467 551756706 552850418
1505.4 552850418 550625610 546259766 545233269 546030807 545493240 546198273 545648613 544371185 544667702
1514.1 544667702 544145393 543922539 542358627 539575043 540307312 541714897 540912628 538559303 539457016
1522.8 539457016 540734673 542455864 541966171 542342377 543242836 542607994 542996368 543790741 544734383
1531.5E44734383J068115K58217j586342J237678R90296R35211K353325k387161m267655
1540.1E43336067L024750N28068P0916K410583J629906j429443R46846O60591J034927
1548.8E52213211J00632j617928P66831R36699J802673j367683m73404K294311K341004
1557.5E56996346k055436j0431022K774658K340279Q99734p81822o28586j847878j627502
1566.2E45638771l29666r37271L04642n555611j725044j296540l158493k308197j286659
1574.9E29345932J06277j0551185r88083j258659k706261k528763l869667k580109
1582.6E04969482m392128k962226l858147l400498l206596l735886k233543m237900
1590.3D76942558k285652m028015k627602k695808l955345k781258m259872j833763
$$ plain form
1531.5 544734383 545802498 546060715 544474373 545712051 546702347 547637558 549990883 547603722 543336067
1540.1 543336067 546360817 546888885 546959801 549370384 551000290 549570847 550517693 551178284 552213211
1548.8 552213211 552313843 550695915 551462746 552399445 554202118 552834435 552361031 554655342 556996346
1557.5 556996346 554940910 544509888 547284546 549624825 550524559 549742737 549114151 547266273 545638771
1566.2 545638771 545309105 544371834 544676476 539120865 537395821 536099281 532940788 530632591 529345932
1574.9 529345932 529452209 518901024 517912941 516654282 513948021 511419258 507549591 504969482
1582.6 504969482 500577354 497615128 493756981 490356483 487149887 483414001 481180458 476942558
1590.3 476942558 474656906 470628891 468001289 465305481 461350136 458568878 454309006 452475243
1598D52475243l616028j627541k308731k861557j790161l345261j193733k739677j112252
1606.7D31880302l006897j646232j184158k610512N1536j952362o9999j515274P98377
1615.4D20744781M00925o151237J364364q47168Q07991j050109J020164Q1673k024575
1624D14346809J472283k67678J558648j745263L75824O44646M61006R13811k30293
1632.7D17529793K557411J431656K61955j360283K251435J020126J173324K082291
1640.4D26947708j33667J872139L52135K310829K409058J7395K486267j582833J876564
1649.1D36555595J127549K924957K935905r60083m814605P59391L607178Q16193J697044
1657.8D44649124J243782J604958J721992J446266K121773q34541K542076J924934
$$ plain form
1598 452475243 448859215 447231674 444922943 442061386 440271225 436925964 435732231 432992554 431880302
1606.7 431880302 428873405 427227173 426043015 423432503 423484039 421531677 421461678 419946404 420744781
1615.4 420744781 421145706 414994469 416358833 415511665 416319656 415269547 416289711 416371384 414346809
1624 414346809 415819092 415551414 417110062 415364799 415740623 416385269 416846275 417760086 417529793
1632.7 417529793 420087204 421518860 421780815 420420532 422671967 423692093 424865417 426947708
1640.4 426947708 426814041 428686180 429038315 431349144 433758202 433775597 436261864 434679031 436555595
1649.1 436555595 437683144 440608101 443544006 442583923 437769318 438528709 442135887 442952080 444649124
1657.8 444649124 445892906 447497864 449219856 450666122 452787895 451953354 454495430 456420364
1665.5D56420364K205468K603645K796326K175827J51443L732185J755066L463974
1673.2D75304298L310891J484718J516457K969551M082374K672119L342972J707955
1680.9D96391335M154586O372872L343277j739922J035652N699768L781624K570648
1688.6E21609840L386803K744370L853874L702240M278030M912224M978142m3297L221779
1697.3E52644005M803085N027542K486954l141708O746139M982300L977928L144417
1705E80670662L144150J759758J148033K989387J987687J082077J499137K285042L116532
1713.7E99682465Q80241Q33321L767509K717552l985367J634293K437134J065140J160087
1722.4F10192375R55200O18668J167030J719971J662903J750526K126656m02985j61476
$$ plain form
1665.5 456420364 458625832 461229477 464025803 466201630 466353073 470085258 471840324 475304298
1673.2 475304298 478615189 480099907 481616364 484585915 488668289 491340408 494683380 496391335
1680.9 496391335 500545921 506918793 510262070 508522148 509557800 515257568 519039192 521609840
1688.6 521609840 524996643 527741013 531594887 535297127 539575157 544487381 549465523 549422226 552644005
1697.3 552644005 557447090 562474632 564961586 561819878 568566017 573548317 577526245 580670662
1705 580670662 583814812 585574570 586722603 589711990 591699677 592781754 594280891 596565933 599682465
1713.7 599682465 600562706 601396027 605163536 607881088 603895721 605530014 607967148 609032288 610192375
1722.4 610192375 611147575 611766243 612933273 614653244 616316147 618066673 620193329 619790344 619628868
1731.1F19628868L305664L521691j200333n998688L721314M055786K369117L050995
1738.8F32454414J344376j029167K967796K210503q9646J162300K967339K615433K543335
1747.5F47146683L021698J932296M038010J949921J72348L373337J712341J956787
1755.2F65303421K726212J83792J769790K812958K748871L711853M83856J25199K384491
1763.9F82250443J071624R98459J813660J987991j907196J551514M642257K011567
1771.6F94420319q19703j695251L179398J959533r97696Q85010L0136J269379J003265
1780.3F99234390j39770J336975J898346J784820N3635L53622Q47397j46942r6054
1788.9G05126419J243515Q52890R55505q48617m05884L548203J599960k91901N38941
$$ plain form
1731.1 619628868 622934532 626456223 625255890 619257202 622978516 627034302 629403419 632454414
1738.8 632454414 633798790 632769623 635737419 637947922 637858276 639020576 641987915 644603348 647146683
1747.5 647146683 650168381 652100677 656138687 658088608 658260956 661634293 663346634 665303421
1755.2 665303421 668029633 668213425 669983215 672796173 675545044 679256897 679740753 679865952 682250443
1763.9 682250443 683322067 684320526 686134186 688122177 686214981 687766495 692408752 694420319
1771.6 694420319 693600616 691905365 695084763 697044296 696046600 696931610 696961746 698231125 699234390
1780.3 699234390 699094620 700431595 702329941 704114761 704168396 704522018 705369415 705222473 705126419
1788.9 705126419 706369934 707222824 708178329 707329712 706923828 710472031 712071991 711780090 712319031
1797.6G12319031J229248J46179j506882J240616m6844O96182J975021J006928J095581
1806.3G18155060R18960M19999K70156O66428j648178m26560P96280J91269J295319
1815G20638733J042251J545334K77253J61972P78274j3428M58222o86112L73154O34232
1824.6G25209885j581498M72641K472077K808990Q49686k875595o60248J379547J23749
1833.3G28199234j49994k4490N08194Q60824J17493J389618O03332L96958M18243J328354
1842.9G33647766O27213n174561J249619J746673K20032j01929M43039J456833L48892
1851.6G34463577K56501k21863K09350j04828k54974L37677l32107K60543J61209R32847
1861.3G35707932M75921L16239N49240k93198J30158k07901J059341m44946j761628
$$ plain form
1797.6 712319031 713548279 713694458 712187576 713428192 713381348 714077530 716052551 717059479 718155060
1806.3 718155060 719074020 719494019 719764175 720430603 718782425 718355865 719152145 719343414 720638733
1815 720638733 721680984 723226318 723503571 723665543 724443817 724430389 724888611 724202499 724575653 725209885
1824.6 725209885 723628387 724101028 726573105 729382095 730231781 727356186 726695938 728075485 728199234
1833.3 728199234 728049240 728024750 728532944 729393768 729511261 730900879 731504211 731901169 732319412 733647766
1842.9 733647766 734274979 729100418 730350037 732096710 732316742 732214813 732657852 734114685 734463577
1851.6 734463577 734720078 734498215 734707565 734602737 734347763 734685440 734353333 734613876 734775085 735707932
1861.3 735707932 736183853 736500092 737049332 736756134 736886292 736678391 737737732 737292786 735531158
1869.9G35531158N05829R35822R49631K26821O11954J02310l46756m29763P476K15607
1879.6G38310089m03213L69491R8725P38983M12216j87531J48774n3101J046600k27966
1889.2G40253067j564178K63519Q83713P6828L78112N99518o07681P9956k08664m730
1898.9G40149460k26517n3482O16684j05133N54199P3395K35138L37524K8687P0648
1908.5G41680603j87378q4686n35050N48630L2272K00043K73133N0811J327439j708374
1918.2G41597443p61338J041870Q7281R9487p41425l83453K67182P96279L27454n9662
1927.8G42271118R7733L06778M3792o70700q8272l58124j59988j24741m4250K09885
1937.5G41483231K02407P43485J42898O72837m72260j739120J77917N3177l79333p9422
$$ plain form
1869.9 735531158 736036987 736972809 737922440 738149261 738761215 738863525 738516769 738087006 738094482 738310089
1879.6 738310089 737906876 738276367 738375092 739114075 739526291 739338760 739487534 739434433 740481033 740253067
1889.2 740253067 738688889 738952408 739836121 739912949 740291061 740890579 740282898 740362854 740154190 740149460
1898.9 740149460 739922943 739869461 740486145 740381012 740935211 741008606 741243744 741581268 741609955 741680603
1908.5 741680603 741493225 741408539 740873489 741422119 741454391 741654434 741927567 741978378 743305817 741597443
1918.2 741597443 740836105 741877975 741965256 742064743 741323318 740939865 741207047 742003326 742330780 742271118
1927.8 742271118 742368851 742675629 742719421 742048721 741960449 741602325 741442337 741317596 741273346 741483231
1937.5 741483231 741685638 742429123 742572021 743244858 742772598 741033478 741211395 741264572 740885239 740805817
1947.1G40805817Q78982P3929l27301M21906L96041P9422n01022l72925n76629J9226
1956.7G40897446O1569p4463L86581k4719K36969J12686K99073k32544q18405l02964
1966.4G40541229k87475k28882m23126K03170O40641O88934L90472l2348J08032k52228
1976G41348419l15018m43344l24630l75443k74505K22702M80575M87442J5488K94494
1985.7G41116180J56632k6474o58875j055526j85929j92566m75769k02331Q84018P54089
1995.3G40113449K89459R003m45023j94931q22143k90909l74069m99649J7090j47171
2005G37655106O94198O34232P17392K61306p83691j087341o37055j37787o62307k3041
2014.6G36631012L49960M63257R7504J47476Q17795n6381j89209p07245r45664p20367
$$ plain form
1947.1 740805817 741684799 741758728 741431427 741853333 742249374 742328796 741827774 741454849 740878220 740897446
1956.7 740897446 740959015 740884552 741271133 741246414 741483383 741596069 741895142 741662598 740844193 740541229
1966.4 740541229 740253754 740024872 739601746 739804916 740445557 741134491 741524963 741492615 741600647 741348419
1976 741348419 741033401 740590057 740265427 739889984 739615479 739838181 740318756 740806198 740821686 741116180
1985.7 741116180 741272812 741246338 740587463 739531937 739346008 739153442 738677673 738475342 739359360 740113449
1995.3 740113449 740402908 740411911 739966888 739771957 738949814 738658905 738284836 737785187 737802277 737655106
2005 737655106 738349304 738983536 739700928 739962234 739178543 738091202 737454147 737316360 736654053 736631012
2014.6 736631012 736980972 737444229 737541733 737689209 738507004 738450623 738261414 737554169 736608505 735888138
2024.2G35888138m38080j81503j57471O44684M86679P09839L80859l27225m47158o60325
2033.9G35898437n58166q69675m52652j49612N24597N46188M15650Q67691K32468Q7661
2043.5G36542587r30176r40246r29184j012802j35346q4762P48062N15442O09360P34329
2053.2G35117264J14136l77732j033325l47977o66198o01120N7067K38572L56292M02298
2062.8G33259277O19049N6687J51520k28348n92117q91343j073150l70484k59933L91769
2072.5G31062927P07398R82284O64673J25122O9428p15561q75931r66263n02243o4011
2082.1G30487823K62986K60544L61480J005249L08838K7390m42658m23965n53131j032639
2091.7G30261917k68936k46124m883J39160P20291P52564q1101j60446m32281l80021
$$ plain form
2024.2 735888138 735450058 735268555 735111084 735755768 736242447 736952286 737333145 737005920 736558762 735898437
2033.9 735898437 735340271 734470596 734017944 733868332 734392929 734939117 735354767 736222458 736454926 736542587
2043.5 736542587 735612411 734672165 733742981 732730179 732594833 732510071 733258133 733773575 734382935 735117264
2053.2 735117264 735231400 734853668 733820343 733472366 732806168 732205048 732262115 732500687 732856979 733259277
2062.8 733259277 733878326 733935013 734086533 733858185 733266068 732374725 731301575 730931091 730671158 731062927
2072.5 731062927 731770325 732752609 733417282 733542404 733611832 732896271 732020340 731054077 730551834 730487823
2082.1 730487823 730750809 731011353 731372833 732378082 732686920 732714310 732271652 731847687 731294556 730261917
2091.7 730261917 729992981 729746857 729741974 729881134 730601425 731353989 731272888 731112442 730680161 730300140
2101.4G30300140p34405m80118l36838k81524L22418L49274M58297J77841L10288N2338
2111G30137711l00751o50330q84781l60260j97830K53754K5711L44086M86068J297
2120.7G28854675J20697n8517o5842p75375n99594j48850l0060L35694M04281L18833
2130.3G28355942k38877L55683Q7356l89099l31344m35868j10244n49469%L24859O43845
2140.9G27712784N73654o8283K39029j72959k93655n09033k94724k52151j77002M53033
2150.6G27210693L47901O19812R5901l4256N7526q2855l45612o95343k63595l16773
2160.2G26593399M64783M30603J71051M35409J92337L35541k04773k92282o73904n11551
2169.9G26940613K4719J75018N42755J97602N83954K94113j24665j77307j64032j2664
$$ plain form
2101.4 730300140 729565735 729085617 728748779 728467255 728789673 729138947 729597244 729775085 730085373 730137711
2111 730137711 729836960 729186630 728301849 727941589 727743759 727997513 728023224 728367310 728853378 728854675
2120.7 728854675 728975372 728916855 728851013 728075638 727476044 727327194 727297134 727632828 728037109 728355942
2130.3 728355942 728117065 728472748 728560104 728171005 727839661 727403793 727293549 726744080 726744080 727068939 727712784
2140.9 727712784 728286438 728218155 728457184 728284225 727990570 727481537 727186813 726934662 726757660 727210693
2150.6 727210693 727558594 728178406 728274307 728240051 728297577 728214722 727869110 727173767 726910172 726593399
2160.2 726593399 727058182 727488785 727659836 728095245 728287582 728623123 728418350 728126068 727452164 726940613
2169.9 726940613 726965332 727140350 727683105 727880707 728464661 728758774 728634109 728456802 728292770 728280106
2179.5G28280106n58930l88412j83945L30505N62973N09186L97720J30158J74179m69055
2189.1G28784485o56510o87484l0747L30582L1586P2326p2784L20968L38440O99311
2198.8G29130173J01776n02777l45764n41459K38419j52283j95312K31170N04227M77371
2208.4G28945541q2397K06146k82821j05820j86463n48095j33286L47672L99017l93372
2218.1G28166122M41056N99441J14365J678n18264o54450m59823J06811m61197P3853
2227.7G27409592O49414K49099J49460r6740N73501Q7280m99572m90113j51138R2545
2237.4G27973328l58277o4163J43356P24106M31366n8441n188m6921n9967q21838n66406
2248G27290955j51139J08185K91519N94940K55356m62112K92892q5525k59781j49689
$$ plain form
2179.5 728280106 727721176 727332764 727148819 727479324 728042297 728551483 728949203 729079361 729253540 728784485
2189.1 728784485 728127975 727440491 727409744 727740326 727771912 727844238 727771454 728092422 728430862 729130173
2198.8 729130173 729231949 728729172 728383408 727841949 728080368 727928085 727732773 727963943 728468170 728945541
2208.4 728945541 728863144 729069290 728786469 728680649 728494186 727946091 727812805 728160477 728559494 728166122
2218.1 728166122 728607178 729206619 729320984 729322662 728804398 728149948 727690125 727796936 727335739 727409592
2227.7 727409592 728059006 728308105 728457565 728360825 728934326 729021606 728522034 728031921 727880783 727973328
2237.4 727973328 727615051 727550888 727694244 728418350 728849716 728791275 728786087 728739166 728679199 727857361 727290955
2248 727290955 727139816 727248001 727539520 728134460 728389816 727927704 728220596 728135071 727875290 727725601
2257.6G27725601k89612l96957l75977N57480L45764N25513L25012k20871l35159l79028
2267.3G27481766J9302k90604m4326j92108m9820j29700j51062M95300J94092K18124
2276.9G27550964l22876J64719J02615m81262k51770n37948J6632l75138J23444M29687
2286.5G26419067R1248K1286m41742M42429k34147k32391K01874l34244k19650j59073
2296.2G25554657L19061R0637J36643m03290l2501N13611m54560k21481k98920o5155
2305.8G25138702j68838K11410M40140j85852J39389j45645O5155n31082l50952R5138
2315.5G24707565j2741N84564k52227l64380j36261K45666l44925j64947O88553J11084
2325.1G25061951N50155k97470n26047j279525j315613l64838J12763J174926j36260
$$ plain form
2257.6 727725601 727435989 727039032 726663055 727220535 727566299 728091812 728416824 728195953 727860794 727481766
2267.3 727481766 727501068 727210464 727166138 726974030 726924210 726794510 726643448 727138748 727332840 727550964
2276.9 727550964 727228088 727392807 727495422 727014160 726762390 726224442 726241074 725865936 725989380 726419067
2286.5 726419067 726510315 726531601 726089859 726532288 726298141 726065750 726267624 725933380 725713730 725554657
2296.2 725554657 725873718 725964355 726100998 725697708 725665207 726178818 725724258 725502777 725203857 725138702
2305.8 725138702 724969864 725181274 725621414 725435562 725574951 725429306 725494461 724963379 724612427 724707565
2315.5 724707565 724694824 725279388 725027161 724662781 724526520 724772186 724427261 724262314 724950867 725061951
2325.1 725061951 725612106 725314636 724788589 723509064 722193451 721828613 721941376 723116302 722980042
2333.8G22980042J034545N72205j858749j283265J015015K043381m77295j093369j360550
2342.5G21571960l73687L62701l60565p6218n00717O64292J364135Q41141k67410Q926
2352.1G23234558J27030j177750p95746L09448R76792j256485j413117n03158k89383
2360.8G19212189L99399m83628O82144J120911M99115o77032J01852n37262j423035
2369.5G18894653M77448j91651o87713o94351J02539K05002J7089o2179j310959l75366
2379.1G16374512K5406k42691k56348n37949j11465K57644K68479k12937o3400j18332
2388.8G15382919k52762n59539p81479P3089j15203j5336k5558o7825K84042M7302
2398.4G13969650J01242m47158p61185p66602m33349l48358l15705L84827K62832J33210
$$ plain form
2333.8 722980042 724014587 724586792 722728043 721444778 722459793 724503174 724025879 722932510 721571960
2342.5 721571960 721198273 721560974 721200409 721124191 720623474 721287766 722651901 723493042 723225632 723234558
2352.1 723234558 723361588 722183838 721388092 721697540 722674332 721417847 720004730 719501572 719212189
2360.8 719212189 719611588 719127960 719810104 720931015 721430130 720753098 720854950 720317688 718894653
2369.5 718894653 719372101 719180450 718492737 717798386 717900925 718105927 718123016 718060837 716749878 716374512
2379.1 716374512 716399918 716157227 715900879 715362930 715251465 715509109 715777588 715564651 715501251 715382919
2388.8 715382919 715130157 714570618 713789139 713862228 713747025 713731689 713706131 713638306 713922348 713969650
2398.4 713969650 714070892 713623734 712862549 712095947 711662598 711314240 710998535 711383362 711646194 711779404
2408.1G11779404j51825j92871k27051k45209m40521p47070j55793p56530o22559K31476
2417.7G08471451K80762L48968M1046m00467n99518o6528m34723n95703m71496p11289
2427.3G05862503j13220M7149K04850J61056J78681k61078m13895j24054p79571n73502
2437G04188919p55920n66330r9030n6686L43628J3961Q545L2731O4849k75650n60226
2447.6G02338791p02667p99561j79443m22364j75933K02713L45077J20087m18701l7918
2457.2G00270081o98243j037140n61828m14658k14615L6164R9487J71280M39682j07498
2466.9F97982712l22418n71289q79670q08563q25272m87976m67147k50473l7995M66156
2476.5F93798065K82898l69263k35519n13306l96194o55136p45239o22178n03082L7766
$$ plain form
2408.1 711779404 711627579 711434708 711207657 710962448 710521927 709774857 709619064 708862534 708239975 708471451
2417.7 708471451 708752213 709101181 709142227 708741760 708142242 708075714 707640991 707045288 706573792 705862503
2427.3 705862503 705749283 705796432 706001282 706162338 706341019 706079941 705666046 705541992 704762421 704188919
2437 704188919 703432999 702866669 702767639 702710953 703054581 703068542 703077087 703109818 703174667 702899017 702338791
2447.6 702338791 701636124 700836563 700657120 700234756 700058823 700261536 700606613 700726700 700307999 700270081
2457.2 700270081 699571838 698534698 697972870 697558212 697343597 697379761 697479248 697650528 698090210 697982712
2466.9 697982712 697660294 697089005 696209335 695400772 694575500 694087524 693620377 693369904 693331909 693798065
2476.5 693798065 694080963 693711700 693476181 692962875 692566681 691911545 691166306 690544128 690041046 690078812
2486.2F90078812J7776L19901L8452j71890k33078m29154o08520q83561l06930o44913
2495.8F87176895q24966k19651M22593L11584m37775j53579k13852n38025q97217n27267
2505.5F84098740k91443o66428l51181m82407j99813L5782K89840O8588o43157l29361
2515.1F81529160m11988n50079n61295l54080k87552k61383P706M7836J21460k79465
2524.7F79000320m41284p03048m38767m49905r22089k77634n5084K48413r4452m00085
2534.4F75466385r0485l18451j75705j45797l45078o07834j22452l04794p27081p8735
2544F72549973K4642K8229l41263k54821k46888m72488l80630o06690m15726o95037
2553.7F69189301l37983J44272J24588R0637m50744k80991k66571l82995m48151o02799
$$ plain form
2486.2 690078812 690096588 690416489 690454941 690283051 690049973 689620819 689012299 688128738 687821808 687176895
2495.8 687176895 686351929 686132278 686554871 686866455 686428680 686275101 686061249 685523224 684626007 684098740
2505.5 684098740 683807297 683140869 682789688 682307281 682107468 682143250 682433090 682501678 681858521 681529160
2515.1 681529160 681117172 680567093 680005798 679651718 679364166 679102783 679110489 679158325 679279785 679000320
2524.7 679000320 678559036 677855988 677417221 676967316 676045227 675767593 675712509 675960922 675866470 675466385
2534.4 675466385 675375900 675057449 674881744 674735947 674390869 673783035 673660583 673355789 672628708 672549973
2544 672549973 672574615 672602844 672261581 672006760 671759872 671287384 670906754 670300064 669884338 669189301
2553.7 669189301 668851318 668995590 669120178 669210815 668760071 668479080 668212509 667829514 667381363 666778564
2563.3F66778564m00924j31150k33764n41840j43204J30005J92871j83715o54297o40259
2573F64172287k86026O714m69895k92892k79541l58505k75727m09240Q8195L1128l04031
2583.6F61622467p08466m68444j20087m73480n17197j61896K99759k83279m59519k86102
2593.2F58443756k67563k97546n46417j40610n28488k87476O2409l69568k01721j13297
2602.9F55753479j58310p29141m22211j00555p15637o54755R1019K96249m93393m47922
2612.5F52418823l17917k36129l78876q69599l26614r4376m14352o89850k87170j75476
2622.1F48628464k94571o9504m27780m04892m16031j89133k27813q20694n36118j16653
2631.8F45125275k61155l66439j1521l3416J9760m86222j020736n06287m47082m30756
$$ plain form
2563.3 666778564 666377640 666246490 666012726 665470886 665327682 665457687 665650558 665466843 664812546 664172287
2573 664172287 663886261 663892975 663423080 663130188 662850647 662492142 662216415 661807175 661895370 661926498 661622467
2583.6 661622467 660914001 660445557 660325470 659851990 659334793 659172897 659472656 659189377 658729858 658443756
2593.2 658443756 658176193 657878647 657332230 657191620 656663132 656375656 656438065 656068497 655866776 655753479
2602.9 655753479 655595169 654866028 654443817 654343262 653627625 652972870 653063889 653360138 652866745 652418823
2612.5 652418823 652100906 651864777 651485901 650616302 650289688 650195312 649780960 649091110 648803940 648628464
2622.1 648628464 648333893 648264389 647836609 647431717 647015686 646826553 646598740 645778046 645241928 645125275
2631.8 645125275 644864120 644497681 644486160 644452744 644472504 643986282 642965546 642459259 642012177 641581421
2641.4F41581421m38919k32697l36761m11987j29700l91045l44734m90761j07193j3466
2651.1F38684158m21333l15094m41971k00004L166O8092m28123o13327m15535m08974
2660.7F35511055N1270j97526m81452o33164k11182L6927k74506K0828k93007l42025
2670.4F33187218l18146k49977j77231n00298m06112n10941j40419J00441j19056K5253
2680F30890732j94206q60939m39454J52016m04053l66096n10864m18892N607k04200
2689.6F27649651j82419o3706K02446m24232p13883m34837k50816J64299m36898n47103
2699.3F24962502q0719K5482j94855j86272K9068k65464l48320m71306k00844j77841
2708.9F23091431n13459m37011k20414q1596l35045N1575J34888l80822o38961l08724
$$ plain form
2641.4 641581421 641142502 640909805 640573044 640161057 640031357 639640312 639295578 638804817 638697624 638684158
2651.1 638684158 638262825 637947731 637505760 637305756 637308922 637377014 636948891 636335564 635920029 635511055
2660.7 635511055 635562325 635364799 634883347 634250183 634039001 634075928 633801422 633822250 633529243 633187218
2670.4 633187218 632869072 632619095 632441864 631941566 631535454 631024513 630884094 630984535 630865479 630890732
2680 630890732 630696526 629835587 629396133 629548149 629144096 628778000 628267136 627848244 627853851 627649651
2689.6 627649651 627467232 627403526 627605972 627181740 626467857 626033020 625782204 625946503 625509605 624962502
2699.3 624962502 624881783 624907265 624712410 624526138 624555206 624289742 623941422 623470116 623269272 623091431
2708.9 623091431 622577972 622140961 621920547 621838951 621503906 621555481 621690369 621309547 620670586 620361862
2718.6F20361862J7777m36020j39199J09025r8496o5193J28898j09291n17654l32222
2728.2F18919487m00467j80397k52647k96936n35927n20478N27611J38893L6011m8141
2737.9F17387009o10390m85916l09220R9335j49917l26539n97763j74484O15692N5237
2747.5F15503044o5689J60866j60790p98263n81055k74849l35922l23181n87616n7984
2757.2F12478561L93258K87094o4659J33285J81732m89387o73752p65038j27334k32964
2766.8F11120796k84729L56446j30082m42772o63642l03498J13678N570m34113r36012
2776.4F08401642m90494o8817J030l82271j32599Q3771j44539R4833n00984n82504
2786.1F06279068j74294l73497n60951n29670o12832l80592K89650J3809m01039o37398
$$ plain form
2718.6 620361862 620379639 619943619 619804420 619913445 619814949 619749756 619878654 619769363 619251709 618919487
2728.2 618919487 618519020 618338623 618085976 617789040 617253113 616732635 617260246 617399139 617435150 617387009
2737.9 617387009 616776619 616290703 615981483 616080818 615930901 615604362 615006599 614832115 615447807 615503044
2747.5 615503044 615437355 615598221 615437431 614639168 614058113 613783264 613447342 613124161 612536545 612478561
2757.2 612478561 612871819 613158913 613094254 613227539 613409271 612919884 612246132 611481094 611353760 611120796
2766.8 611120796 610836067 611192513 611062431 610619659 609956017 609652519 609766197 609771767 609337654 608401642
2776.4 608401642 607911148 607842331 607843361 607461090 607328491 607412262 607267723 607362556 606861572 606279068
2786.1 606279068 606104774 605731277 605170326 604640656 604027824 603647232 603936882 603950691 603549652 602912254
2795.7F02912254n04684l67584o33049k99530k74659n14793p88193o51359k96631m07066
2805.4E98174706m91524m20037n5847j55830o20766r81521o61774l52364m76989k17286
2815E93740768n71098q20618m91828p2251m49982r72824m69284m77142n97839o67229
2824.7E88150673o73218o98051n37758q9493k95868m99916q87909n19485l61863q17260
2834.3E82769852p99218j388664r42573l72048r75647j193466p80792o87065j239357
2843E74391022j555100j392021p77321j081466j946450k005768j279983q95577j298103
2851.7E62159233q81653q85963o55022J58959K28958L20129J5297k60582m78401l14713
2861.3E59406242L9902N0316n00412r23080k45858n04379q37402r74808q01201J54572
$$ plain form
2795.7 602912254 602407570 602039986 601406937 601107407 600832748 600317955 599529762 598878403 598581772 598174706
2805.4 598174706 597683182 597263145 597207298 597051468 596430702 595449181 594787407 594435043 593958054 593740768
2815 593740768 593169670 592349052 591857224 591784973 591334991 590362167 589892883 589415741 588817902 588150673
2824.7 588150673 587477455 586779404 586241646 586152153 585856285 585356369 584468460 583948975 583587112 582769852
2834.3 582769852 581970634 580581970 579639397 579267349 578291702 577098236 576317444 575630379 574391022
2843 574391022 572835922 571443901 570666580 569585114 567638664 565632896 564352913 563457336 562159233
2851.7 562159233 561277580 560391617 559736595 559895554 560124512 560444641 560459938 560199356 559720955 559406242
2861.3 559406242 559446144 559496460 558996048 558072968 557827110 557322731 556485329 555510521 554709320 554863892
2870.9E54863892m8180l60260o64253p69234m24805l47900l92647l80440k84118p08580
2880.6E50483475o12412l42254n68543p01675n53665m26140p88727q95882p85866l27034
2890.2E44481277n18875q91685l61748m84352n84297n87158p44286p75719m38461k59399
2899.9E38835297q24967o61888n17578m71993m46434p55806m32472m55665q07076o04553
2909.5E32856865n91965j065101r14841m50249o25839j290817j647568j296921r24148
2918.2E24049416p70379r16328m57001l71132q28857m06532p11289q77456j83373M92935
2927.8E19020004L72696p7019K34032j62849k48642J22642j77231n8288N83725P80639
2937.5E20389709P55883R81941N30281M62837O83251J84059J14898N43938Q25272N56221
$$ plain form
2870.9 554863892 554815712 554455452 553791199 553021965 552597160 552249260 551856613 551476173 551192055 550483475
2880.6 550483475 549871063 549528809 548960266 548258591 547704926 547278786 546490059 545594177 544808311 544481277
2890.2 544481277 543962402 543070717 542708969 542224617 541640320 541053162 540308876 539533157 539094696 538835297
2899.9 538835297 538010330 537348442 536830864 536358871 535912437 535156631 534724159 534268494 533461418 532856865
2909.5 532856865 532264900 531199799 530284958 529834709 529208870 527918053 526270485 524973564 524049416
2918.2 524049416 523279037 522362709 521905708 521534576 520705719 520299187 519587898 518710442 518527069 519020004
2927.8 519020004 519392700 519315681 519549713 519386864 519138222 519260864 519083633 519025345 519609070 520389709
2937.5 520389709 521145592 522127533 522657814 523120651 523803902 523987961 524102859 524646797 525472069 526028290
2947.1E26028290L76968N60036M61044J14632M22973O48766K13966K71683K35787K34871
2956.8E29569016M75120O04286m2343n76286K93121Q07152Q71544Q27827Q77228M86603
2966.4E34193268L58925O96563J908L96995O80809L73726M65317M39415N25551L32413
2976.1E38464890P12165L39089K51465O57348K47841K30370j03073J46026L12958K90947
2985.7E41550026L09792j17035k3880n3101J36261K52876M16222p7286p84378k21786
2995.3E41387711K16674J96724l79905l47939j06392P019J4038o20193l70560m90036
3005E39507141p28569l56941L0289O675n99174m09546k36588k21786j59226m47883
3014.6E36384392p55310p55081o12832l33290L9101n22652m98810k12402m14543l65181
$$ plain form
2947.1 526028290 526405258 526965294 527426338 527540970 527963943 528612709 528826675 529098358 529334145 529569016
2956.8 529569016 530044136 530648422 530606079 530029793 530322914 531130066 532001610 532829437 533706665 534193268
2966.4 534193268 534552193 535248756 535250664 535647659 536328468 536702194 537167511 537606926 538132477 538464890
2976.1 538464890 539177055 539516144 539767609 540424957 540672798 540903168 540800095 540946121 541259079 541550026
2985.7 541550026 541859818 541742783 541718903 541665802 541802063 542054939 542471161 542393875 541609497 541387711
2995.3 541387711 541604385 541801109 541421204 541073265 540966873 540973892 540987930 540367737 539997177 539507141
3005 539507141 538778572 538421631 538451920 538458595 537859421 537449875 537213287 536991501 536832275 536384392
3014.6 536384392 535629082 534874001 534261169 533927879 533966980 533444328 532945518 532733116 532318573 531953392
3024.3E31953392p31201r41620r52339m03938p1297l86009k98806k43377m00505m68216
3033.9E27056084n12047q49648o82258p86515p50694k27737l92914l35579n70145m15725
3043.6E21532822o62766q67348j77688o53496n49126n93910p84225m40865n26504l57628
3053.2E15919266m53148m07791q88787j111297n54886m69666m36973o94580o22978
3061.9E10279160l59955k10381p6027j11847n17921j017952p08504l78036l30849q07610
3071.5E05760078q83369j93481m76304r37919l43399J94092k34948o75201k82593K50282
3081.2E02177238m44068r02482n81703q23364o51703m99534m50554n45082l64571j65787
3090.8D96748390q80585r10224q23632k38533l6430l80325j2322o30684p21741l10859
$$ plain form
3024.3 531953392 531222191 530280571 529328232 528924294 528852997 528466988 528168182 527924805 527524300 527056084
3033.9 527056084 526544037 525694389 525012131 524225616 523474922 523247185 522854271 522518692 521948547 521532822
3043.6 521532822 520870056 520002708 519825020 519171524 518622398 518028488 517244263 516803398 516276894 515919266
3053.2 515919266 515466118 515058327 514169540 513058243 512503357 512033691 511596718 510902138 510279160
3061.9 510279160 509919205 509708824 509632797 509520950 509003029 507985077 507276573 506898537 506567688 505760078
3071.5 505760078 504876709 504683228 504206924 503269005 502925606 503119698 502884750 502209549 501926956 502177238
3081.2 502177238 501733170 500830688 500248985 499425621 498773918 498274384 497823830 497278748 496914177 496748390
3090.8 496748390 495867805 494957581 494133949 493895416 493858986 493478661 493466339 492835655 492113914 491803055
3100.5D91803055l47595p93724r69353l53279n82161o85234m50249K441P8965m97780
3110.1D87205086n83229r26171r58061k56233J18408o51169j052093m34418l73611
3118.8D82088509o00052o16951n63088q51135o02074j95083l99437p00455r24301l01132
3128.4D76334801j00975p56455o89087j59683n48172r55086q22677o30188j14785n25016
3138.1D71032677n63393m03099q38737j005669j014366l61634n79490l13988o4583
3146.8D65887718p13730n09567o23207m43764o19697o50292o07986q42819n99823j133957
3156.4D59142876j045990o34652J08338K4605p90100m55590p34939q21419q14667m34074
3166D53544388m46625r94263n18074o70204o89621o21528m11454l01361p23457o85845
$$ plain form
3100.5 491803055 491455460 490661736 489692383 489339104 488756943 488071709 487621460 487623901 487702866 487205086
3110.1 487205086 486621857 485695686 484737625 484481392 484599800 483948631 482896538 482462120 482088509
3118.8 482088509 481488457 480871506 480308418 479457283 478855209 478660126 478260689 477560234 476635933 476334801
3128.4 476334801 476233826 475477371 474788284 474628601 474080429 473125343 472302666 471672478 471557693 471032677
3138.1 471032677 470469284 470066185 469227448 468221779 467207413 466845779 466266289 465952301 465887718
3146.8 465887718 465173988 464664421 464041214 463597450 462977753 462327461 461719475 460876656 460276833 459142876
3156.4 459142876 458096886 457462234 457570572 457595177 456805077 456349487 455614548 454793129 453978462 453544388
3166 453544388 453097763 452103500 451585426 450915222 450225601 449604073 449192619 448891258 448167801 447481956
3175.7D47481956l92570j33247p00264n73349n83001r58366n26771o26221p55806q52585
3185.3D41379776k60124j16081q21877p30553n37796n67588o02837l41911m55361n50499
3195D36395149p26509q64563n02090p06597m65927j84402k05574m93126p40242o57349
3204.6D30848770p49016j53770j81046m95529n03578o24580n86510o93359j87836l05062
3214.3D26368484p86437o39229l73001O7100k33383p79228q14095p12318l84102j59683
3223.9D21554108n41611l32108k00653q82873n99709j75323p8049r2277k76108n14031
3233.5D17861366p17087p25364r48220m70733J7662j14479o93894j001243k05689j7357
3243.2D12984962m04815q17719m09774P8735m89388m42962l67241p20139o43730k71301
$$ plain form
3175.7 447481956 447089386 446956139 446255875 445682526 445099525 444141159 443614388 442988167 442232361 441379776
3185.3 441379776 441119652 441003571 440181694 439451141 438913345 438345757 437742920 437401009 436945648 436395149
3195 436395149 435668640 434804077 434301987 433595390 433129463 432945061 432739487 432246361 431506119 430848770
3204.6 430848770 430099754 429945984 429764938 429269409 428765831 428141251 427554741 426861382 426673546 426368484
3214.3 426368484 425582047 424942818 424569817 424636917 424403534 423624306 422810211 422097893 421713791 421554108
3223.9 421554108 421012497 420680389 420479736 419596863 418997154 418821831 418743782 418651505 418375397 417861366
3233.5 417861366 417144279 416418915 415470695 414999962 415017624 414903145 414209251 413208008 413002319 412984962
3243.2 412984962 412580147 411762428 411352654 411431389 410942001 410499039 410131798 409411659 408767929 408496628
3252.8D08496628l09754k63824l586o4926j43280p86209q69599o94274p62215l09143
3262.5D04289818k42500k16980p9537J15700q9874l56064k43798m88052l86162m17862
3272.1D01884689p30858m99954l5019l79676r82247m17251K14958K10838m86679j016960
3281.8C97761841l86086L04222N7946n42870m86145n4207J5602j98974r7351k43645
3291.4C96130333o44341o60743l07083L50341j94587p32041q3503j98861n30548k67143
3301C92861824j19553k73170l24135l64570l75596j56593p5798j92413n21164p93991
3310.7C89664841o0654P83844l51944j071968n57594o13671k93312n24215o57578m47807
3320.3C85869942o11763J52549K67296m45862r15946q21152j56975l84941r24416m05311
$$ plain form
3252.8 408496628 408186874 407923050 407919464 407854538 407711258 406925049 406055450 405361176 404598961 404289818
3262.5 404289818 404047318 403830338 403750801 403866501 403776627 403420563 403176765 402688713 402302551 401884689
3272.1 401884689 401153831 400653877 400618858 400239182 399256935 398839684 399054642 399265480 398778801 397761841
3281.8 397761841 397375755 397679977 397737923 397195053 396708908 396654701 396670303 396471329 396373978 396130333
3291.4 396130333 395485992 394825249 394518166 394868507 394673920 393941879 393858376 393659515 393128967 392861824
3301 392861824 392742271 392469101 392144966 391780396 391404800 391248207 391172409 390979996 390458832 389664841
3310.7 389664841 389604187 390388031 390036087 388964119 388406525 387792854 387499542 386975327 386317749 385869942
3320.3 385869942 385258179 385410728 385678024 385232162 384316216 383495064 383338089 382953148 382028732 381623421
3330C81623421q7548o59751m71535l04375m62303j25694n20745q47740o52618m51164
3339.6C77039948o7254n51185j197701p41691m07715k10915j7891n98602n38406K61116
3349.3C72969704l968r56840o62003m20532n27153K21596o56166q76656K74010K06947
3358.9C69568939J24283q36372j210785n25704j21002M09927n2604o07338p09458m04129
3368.6C65635757J71128k73094q47474n08728o5956j41525l56140j96838j79558n02243
3378.2C62735329O904j36261o27441K53105M00658l45650o08330M1847j79481n74875
3387.8C60965805J13945p4272K54402M70924k16865n14183k94151n2376m65775j4000
3397.5C60173454Q3161m24919k89383k63977j35003m425K88430p8316l31917J2856
$$ plain form
3330 381623421 381535873 380876122 380404587 380100212 379637909 379512215 378991470 378143730 377491112 377039948
3339.6 377039948 376972694 376421509 375223808 374482117 374074402 373863487 373845596 373246994 372708588 372969704
3349.3 372969704 372965736 372008896 371346893 370926361 370399208 370620804 369964638 369087982 369361992 369568939
3358.9 369568939 369693222 368856850 367646065 367120361 366999359 367409286 367356682 366749344 366039886 365635757
3368.6 365635757 365806885 365533791 364686317 364177589 364111633 363970108 363613968 363417130 363237572 362735329
3378.2 362735329 362742233 362605972 361978531 362231636 362632294 362286644 361678314 361720161 361540680 360965805
3387.8 360965805 361079750 361005478 361259880 361730804 361513939 360999756 360705605 360653229 360187454 360173454
3397.5 360173454 360256615 359831696 359542313 359278336 359143333 359138908 359427338 359349022 359017105 359029961
3407.1C59029961k8153p2861N8480L99589k8305j18980J91040k6131K79846J2360n82314
3417.7C59114532M4632N20897j16882L3760K02675r5291J81770L36838P25174N44815
3427.4C61492920J7128l63884m66766J70860N18303N30662J93367K8191K05955O43464
3437C62970200M45137k0066J71242k4185J15471j6632N54428N52635K66418J226387
3446.7C66241035o1302M63639J336288Q0109j01471L08418O87866L19138J050339P35969
3456.3C71060028j07651N59235n531K28386Q12683J097564M33350K37961J003341N03197
3466C75822563J116333L91731r2353R29031K49062M22935Q14400O29272N45807K77863
3475.6C81106644P05108J149788P33223O36521P16018M48838O59904M17709O12069
$$ plain form
3407.1 359029961 359001808 358928947 358987427 359387016 359358711 359239731 359430771 359404640 359684486 359696846 359114532
3417.7 359114532 359159164 359680061 359563179 359596939 359799614 359704323 359886093 360222931 360948105 361492920
3427.4 361492920 361510048 361146164 360679398 360850258 361368561 361899223 362092590 362120781 362326736 362970200
3437 362970200 363415337 363395271 363566513 363542328 363657799 363641167 364195595 364748230 365014648 366241035
3446.7 366241035 366179733 366643372 367979660 368059769 367958298 368266716 368954582 369273720 370324059 371060028
3456.3 371060028 370952377 371511612 371506081 371734467 372547150 373644714 374078064 374316025 375319366 375822563
3466 375822563 376938896 377330627 377238274 378167305 378416367 378839302 379653702 380282974 380828781 381106644
3475.6 381106644 381811752 382961540 383694763 384331284 385047302 385496140 386156044 386573753 387185822
3484.3C87185822N89942N42679J061554K26288M97093J191788R04808Q74901P27005
3493C93801880R12971Q56896N60531N84984N53017M99573N62858Q61702J528702J152840
3502.6D01875954n6954M25453Q10852L86200O66161J496124O60897q8654J017685P52754
3512.2D07946472Q76007R42116O02112J086387J252518R63326J220K94609J414261
3520.9D15379028J700631O53724n6114J092529J361084J277046M12598M27895R40857
3529.6D23189278Q14094R12781O36940J168747J187897J682663J032142q0871J421013
3538.3D31964684J415519J182823Q40455Q04595J328774J741447J330147K66495O27861
3547D41502800n1689J495323J675835J804199K276573n57709P28569N36957J253586
$$ plain form
3484.3 387185822 387775764 388318443 389379997 389606285 390103378 391295166 392199974 393074875 393801880
3493 393801880 394714851 395571747 396132278 396717262 397270279 397769852 398332710 399194412 400723114 401875954
3502.6 401875954 401819000 402244453 403055305 403441505 404107666 405603790 406264687 406176033 407193718 407946472
3512.2 407946472 408822479 409764595 410366707 411453094 412705612 413668938 413670158 413964767 415379028
3520.9 415379028 417079659 417733383 417677269 418769798 420130882 421407928 421820526 422248421 423189278
3529.6 423189278 424003372 424916153 425553093 426721840 427909737 429592400 430624542 430543671 431964684
3538.3 431964684 433380203 434563026 435403481 436208076 437536850 439278297 440608444 440874939 441502800
3547 441502800 441451111 442946434 444622269 446426468 448703041 448145332 448873901 449410858 450664444
3555.6D50664444K337990R65309J635590P04612J156960J259575J587944J051025N04074
3564.3D61867523L829613J047172M7722m5089l28713K924614J428375J769486J939430
3573D74480133J788139J180725J165581K054482L62282J692085J397819J070900K351456
3581.7D87543602K320175J315155L31841L824081K094002r63287R48715j172333K727013
3590.4D98968964L143921L159141K181625M84658K355308n39970J946449K914353R6168
3599E14710617K366028J602898O84738J845131K011909K533760L367691K231789k24533
3607.7E31130028L099899j155548n68352P048111J564369k253799L348923P13081L994713
3616.4E46921425M004021K48374J876603r00460P80526L466949K716599K041244K849503
$$ plain form
3555.6 450664444 453002434 453967743 455603333 456307945 457464905 458724480 460312424 461363449 461867523
3564.3 461867523 465697136 466744308 466792030 466746941 466418228 469342842 470771217 472540703 474480133
3573 474480133 476268272 477448997 478614578 480669060 481031342 482723427 484121246 485192146 487543602
3581.7 487543602 489863777 491178932 491510773 495334854 497428856 496465569 497414284 496241951 498968964
3590.4 498968964 502112885 505272026 507453651 507938309 510293617 509753647 511700096 514614449 514710617
3599 514710617 517076645 518679543 519364281 521209412 523221321 525755081 529122772 531354561 531130028
3607.7 531130028 534229927 533074379 532506027 539554138 541118507 538864708 542213631 542926712 546921425
3616.4 546921425 550925446 551173820 553050423 552149963 552930489 556397438 559114037 561155281 564004784
3625.1E64004784L162193K660217O607590J586952j1193046K950439M985848N504951
3632.8E80269928K010651p57866K522926L052101K037239J96648K000770K877770K360878
3641.5E96571045J506576O19965K487297L958397O481857N12200l803711N744781J692543
3650.1F15770950k880973j559907M749070M965133M582978M319420p809029J698570
3657.9F23836212N385666J639977J433181R57527K394410J047248J646729J708641
3665.6F40049591P26471M172440K559356P44858l69110o270065L303909Q295517Q828583
3674.3F62041550k88391j7244263K532654P900161M293595k363053o7825K279358J535568
3682.9F60619354J275101Q56399J066361M505157O805649q774490l703613Q250045
$$ plain form
3625.1 564004784 567166977 569827194 576434784 578021736 566828690 569779129 574764977 580269928
3632.8 580269928 582280579 581522713 584045639 587097740 589134979 589331627 591332397 594210167 596571045
3641.5 596571045 598077621 598697586 601184883 605143280 611625137 612137337 608333626 614078407 615770950
3650.1 615770950 612889977 611330070 616079140 621044273 625627251 629946671 622137642 623836212
3657.9 623836212 629221878 630861855 632295036 633252563 635646973 636694221 638340950 640049591
3665.6 640049591 640776062 644948502 647507858 648252716 647883606 641613541 644917450 653212967 662041550
3674.3 662041550 661753159 644508896 647041550 654941711 659235306 656872253 656804428 659083786 660619354
3682.9 660619354 661894455 662750854 663817215 668322372 675128021 666353531 662649918 670899963
3690.6F70899963n056839j107177M300689O08216J676101L02582j9836J445160L19137
3699.3F73367996K681732L671494m646607l547668L304138J671372P23343N78689L331070
3708F81135559M629059o761704L197785L704147j3883972L009872M557877J185761
3715.7F80774384Q26950K163543J396714l016510J277237N761413k430038m211502
3723.4F82542191M632186J954956q61587m125214m0054L721237L02277M801483j957779
3732.1F90969696n797195R098816R38034j0254822k33917L069763P63J192703K064514
3740.8F91048355l345642M031982J1741105r873734j5391540R379119N409623N934982
3748.5F98934250k625351r348297J0413589m917831o837616N022430L105088J856079
$$ plain form
3690.6 670899963 665843124 664735947 669036636 669644852 671320953 671623535 671603699 673048859 673367996
3699.3 673367996 676049728 679721222 675074615 671526947 674831085 676502457 677225800 677804489 681135559
3708 681135559 685764618 679002914 682200699 685904846 672020874 675030746 679588623 680774384
3715.7 680774384 681601334 683764877 685161591 682145081 683422318 689183731 686753693 682542191
3723.4 682542191 687174377 689129333 688267746 684142532 684102478 687823715 688125992 692927475 690969696
3732.1 690969696 685172501 694271317 695209351 684954529 684720612 687790375 687791138 688983841 691048355
3740.8 691048355 687702713 691734695 703475800 693602066 678210526 687589645 692999268 698934250
3748.5 698934250 696308899 686960602 697374191 692456360 685618744 690641174 693746262 695602341
3756.2F95602341n162430K169189N252762o715698k010651L922043J679611J75705
3763.9F94912872L540955j283722n124054K082977M899979N89447q088074J068726
3771.7F92599106K167663N81284J416016m58603L76663P70874L437195n75409q193054
3780.3F92121735K135238J757965Q13752K882614j632996j182403N85479L53546M77753
3789F98312683n16815j77536p0801O53229L08609J217728L315048l291092l673477
3797.7F96077576K104416L022766M527816o362762q343582L895721K580567M742660
3805.4G02245178M639206r565582l075104M225006J035614N19943N43671p30514J160049
3814.1G00997467N339584j853332j2798996M945145O612396N446777J213074j7126846
$$ plain form
3756.2 695602341 690439911 692609100 697861862 691146164 689135513 693057556 694737167 694912872
3763.9 694912872 698453827 697170105 692046051 694129028 699029007 699618454 691530380 692599106
3771.7 692599106 694766769 695348053 696764069 696305466 696682129 697453003 700890198 700314789 692121735
3780.3 692121735 694256973 696014938 696828690 699711304 698078308 696895905 697481384 697834930 698312683
3789 698312683 697795868 697618332 697547531 698200760 698509369 699727097 703042145 699751053 696077576
3797.7 696077576 698181992 701204758 705732574 699369812 691026230 694921951 697502518 702245178
3805.4 702245178 706884384 697318802 694243698 698468704 699504318 700024261 700567932 699837418 700997467
3814.1 700997467 706337051 704483719 691684723 696629868 703242264 708689041 709902115 692775269
3821.8F92775269J232833M932785J506882J686707m2343l165513j09252J808395L310699
3830.5G03936462J717072p192993K245254O872788n365525j105575P948837q014831
3838.2G01041489m982148P452393m960937n21546O283875k069550l308334J968536
3845.9G00903778J126251O0959J412201m84695K443924N826187m389496K149353j3837738
3854.6F95210724j332398Q543854j864929k108307K061539K610550K719192m963226
3862.3G00876999k71301O188202m329453n316696L168793M498901N749512n843964
3870G04720993r015884K558975M898147K649689q762283N34286L400040j75400K334671
3878.7G03143234L453675n477372n434723N870285J496430J555405M514618j1526948
$$ plain form
3821.8 692775269 694008102 698940887 700447769 702134476 702092133 698926620 698817368 700625763 703936462
3830.5 703936462 705653534 698460541 700705795 707578583 702213058 701107483 709056320 701041489
3838.2 701041489 696059341 703511734 698550797 698029251 704313126 702243576 698935242 700903778
3845.9 700903778 702030029 702090988 703503189 703018494 705462418 711288605 706899109 709048462 695210724
3854.6 695210724 693878326 702422180 700557251 698448944 700510483 703121033 705840225 700876999
3862.3 700876999 700605698 706793900 702464447 697147751 700316544 704815445 710564957 704720993
3870 704720993 695705109 698264084 703162231 705811920 697049637 697583923 700983963 700808563 703143234
3878.7 703143234 706596909 701119537 695684814 701555099 703051529 704606934 709121552 697594604
3886.4F97594604M49524K821274N40161M940186o45981q356628R70001L460083r35669
3895.1G00837555K12479N29480K374115J956176q167343L827057J478195m175186M614563
3903.8G03487091j758575j437302o16226j13678J905289j28251O9504k7389Q9340Q5525
3913.4G01555328n417J422196J850510k688752l005752K870483j391372l304673K790756
3922.1G00093307J961213M85687j895218k636719P41883J569290J524124o23474j04981
3930.8G01115112J392594k574387j259460J262588J52207O60018M88587q80737q16040
3939.5F99540482J61132J895295Q72879l639145n75714J383514R71222J218643j912384
3948.1F99915924J005097P59582k951889N38330K91443O67648L18451j033859L40042
$$ plain form
3886.4 697594604 698044128 700865402 701405563 706345749 705699768 697343140 698313141 701773224 700837555
3895.1 700837555 701050034 701579514 703953629 705909805 697742462 701569519 703047714 698872528 703487091
3903.8 703487091 701728516 700291214 699674988 699561310 701466599 701338348 701407852 701380463 701469803 701555328
3913.4 701555328 701549911 702972107 704822617 702133865 699128113 701998596 700607224 697302551 700093307
3922.1 700093307 702054520 702540207 700644989 698008270 698750153 700319443 701843567 701220093 701115112
3930.8 701115112 702507706 699933319 698673859 699936447 700088654 700748672 701237259 700356522 699540482
3939.5 699540482 699701614 701596909 702469788 698830643 698254929 699638443 700609665 701828308 699915924
3948.1 699915924 700921021 701680603 698728714 699267044 699558487 700226135 700544586 699510727 699850769
3956.8F99850769l19366J76467K83432O86722L74070j175156J62582M62952L4637r88998
3966.5F99548111p91092O35071n7678k14768O64520O26526O0959k59628o92063k12249
3976.1F99307709M71649L27530j83487n34516l3798k87094l23181N4245j3046O1340
3985.7F98847351P4844L19748M35791J95389m31900j34201M01383O02722N56946m05732
3995.4G00462341r4452K1515j49460L1815o92596
4000.2F99579163
$$ plain form
3956.8 699850769 699531403 699707870 699991302 700678024 701052094 699876938 700039520 700502472 700537109 699548111
3966.5 699548111 698757019 699392090 699334412 699119644 699784164 700410690 700471649 700212021 699519958 699307709
3976.1 699307709 699779358 700106888 699923401 699388885 699355087 699067993 698744812 698799057 698786011 698847351
3985.7 698847351 698922195 699241943 699677734 699873123 699441223 699307022 699708405 700311127 700868073 700462341
3995.4 700462341 700367889 700389404 700239944 700271759 699579163
4000.2 699579163
##END=$$ End of the data block
