##TITLE=$$ Begin of the data block
##JCAMP-DX=5.00 $$ ACD/SpecManager v 10.08
##SPECTROMETER/DATA SYSTEM=Varian
##DATE=07 Jan 2013 17:15:48
##DATA TYPE=INFRARED SPECTRUM
##DATA CLASS=XYDATA
##ORIGIN=
##OWNER=
##NPOINTS=3735
##FIRSTX=399.26403809
##LASTX=4000.35498047
##MAXX=4000.35498047
##MINX=399.26403809
##MAXY=74.40840149
##MINY=35.82321548
##XFACTOR=1.0000000000
##YFACTOR=0.000000100000000
##FIRSTY=53.72817612
##DELTAX=0.96440572
##XUNITS=1/CM
##YUNITS=TRANSMITTANCE
##XYDATA=(X++(Y..Y))
399.3E37281761j6630249m14276N838661m921837j60865K024917P259674J594696n579147
$$ 537281761 520651512 520237236 526075897 521154060 520993195 523018112 530277786 531872482 526293335
407.9E26293335P39632M566917J138039l562661L421669j910934n553474k50817o38885
$$ 526293335 527032967 531599884 532737923 529175262 532596931 530685997 525132523 524881706 524242821
416.6E24242821N297584k596283q939171N489541K959556K463341k154427J351471
$$ 524242821 529540405 526944122 518004951 523494492 526454048 528917389 526762962 528114433
424.3E28114433N862160M385147n181084r668502k289124J177826L778725L663177
$$ 528114433 533976593 538361740 533180656 523512154 521223030 522400856 526179581 529842758
432.1E29842758l25317J687507L69568p549629o926079l98597J322898K307816L072891
$$ 529842758 529517441 531204948 531574516 524024887 517098808 516700211 518023109 520330925 523403816
440.7E23403816O675453K834473m378281k277069j76544j018905k644158j044426j476669
$$ 523403816 530079269 532913742 528535461 526258392 526081848 525062943 522418785 521374359 519897690
449.4E19897690J582794N085564k63138k135239J769791L875999J311684p0305j682510
$$ 519897690 521480484 526566048 526302910 524167671 525937462 529813461 531125145 531054840 529372330
458.1E29372330p386704k750015L3722J286850O009102K439880m722366j377907J489792
$$ 529372330 521985626 519235611 519269333 520556183 526565285 529005165 524282799 522904892 524394684
466.8E24394684k21253R67598l722381l285370J618919m196357J004142O769905k139625
$$ 524394684 524173431 525141029 521418648 518133278 519752197 515555840 516559982 523329887 521190262
475.5E21190262m883156o64749j663818K323455K684250l419571P11060M042587q06541
$$ 521190262 516307106 515642357 513978539 516301994 518986244 515566673 516277733 520320320 519513779
484.1E19513779j781159q61130j780967k988739j972771L397217K281227n78537L055038
$$ 519513779 517732620 516871490 515090523 512101784 510129013 513526230 515807457 515228920 518283958
492.8E18283958K985230j194153k941627J40686L63617k709275j370239o06041k362442
$$ 518283958 521269188 520075035 517133408 517274094 517637711 514928436 513558197 512952156 510589714
501.5E10589714k964363J042442K771302K087249Q51670j122475p70569o64139r27620
$$ 510589714 507625351 508667793 511439095 513526344 514378014 513255539 512484970 511820831 510893211
510.2E10893211O33507J243744j016540j420632k34795k222938p10602J060753j216812
$$ 510893211 511526718 512770462 511753922 510333290 510098495 507875557 507164955 508225708 507008896
518.9E07008896j998978j021805l64990j597290O58646J749382Q5830k90412o74973
$$ 507008896 505009918 503988113 503623123 502025833 502684479 504433861 504519691 504229279 503554306
527.5E03554306L42789N1803n76820n59578l60336n66063j538735k44674O41517J060753
$$ 503554306 503897095 503948898 503372078 502812500 502452164 501886101 500347366 500102692 500744209 501804962
537.2E01804962j18675j814613p40166l32222k85416p80258n92499J090775J534271
$$ 501804962 501686287 499871674 499131508 498799286 498513870 497733612 497141113 498231888 499766159
545.9D99766159R61533j65024j78566k49558k401809k468949L79906O40793j255608
$$ 499766159 500727692 500562668 500384102 500134544 497732735 495263786 495643692 496284485 495028877
554.5D95028877r19189R29794J012879r76716j112518l20358p58896q25539m36668
$$ 495028877 494109688 495039482 496052361 495075645 493963127 493642769 492883873 492058334 491621666
563.2D91621666N03960J308441J529464J015473M75120P34177q02269j350212o48422
$$ 491621666 492125626 493434067 494963531 495979004 496454124 497188301 496386032 495035820 494387398
571.9D94387398r12438j318283r54094O36368R65195j07422l22952P82013J738472
$$ 494387398 493474960 492156677 491202583 491838951 492804146 492696724 492373772 493155785 494894257
580.6D94894257p11441r85337J058312l08152j736221n69954K21176L29132Q78983
$$ 494894257 494182816 493197479 494255791 493947639 492211418 491641464 491862640 492191772 493070755
589.3D93070755J662521J366005M6273J65672K11906l37448n4436j09062J013298R67598
$$ 493070755 494733276 496099281 496145554 496311226 496523132 496185684 496131248 496022186 497035484 498003082
598.9D98003082j36566k86598o73027N90973L71513j316643j627082j579133k76908
$$ 498003082 497866516 497579918 496906891 497497864 497869377 496552734 494925652 493346519 493069611
607.6D93069611J383438P98683j424370j093254J97716O26068L11355j291008j78031
$$ 493069611 494453049 495251732 493827362 492734108 492931824 493557892 493869247 492578239 492400208
616.3D92400208K05993j104584q087J135826J191788J45989k35749N54314K117500
$$ 492400208 492606201 491501617 491493530 492629356 493821144 493967133 493731384 494285698 496403198
624.9D96403198J480484L64914Q47092k35253O54412J223945L38211R82132K008782
$$ 496403198 497883682 498248596 499095688 498860435 499514847 500738792 501077003 502059135 504067917
633.6E04067917K081528m21257l8910K262230J916351J219444K32659N60951J396179
$$ 504067917 506149445 505728188 505689278 507951508 509867859 511087303 511319962 511880913 513277092
642.3E13277092P39326N09987M95415J24397K1782M90227M68063O54793J548500P58667
$$ 513277092 514016418 514526405 515021820 515146217 515167999 515658226 516126289 516781082 518329582 519088249
651.9E19088249N91736R14650n44395n47257J00708L2539l3454k49711J26229J183052
$$ 519088249 519679985 520594635 520050240 519502983 519603691 519636230 519602776 519353065 519479294 520662346
661.6E20662346P74803j056023r85298N22537J720200J100960l960228O88209J190796
$$ 520662346 521437149 520381126 519395828 519918365 521638565 522739525 518779297 519467506 520658302
670.3E20658302P51763Q06770R77135J323242P00226L02238j13830j84250L06244Q32138
$$ 520658302 521410065 522216835 523193970 524517212 525217438 525519676 525405846 525221596 525527840 526359978
679.9E26359978J181068J359062J562195J178856J977196J880226j5793o29578p6599
$$ 526359978 527541046 528900108 530462303 531641159 533618355 535498581 535482788 534853210 534776611
688.6E34776611J73149o58378k48146R61685J213036J514434J404000Q50067K48985
$$ 534776611 534949760 534291382 534043236 535004921 536217957 537732391 539136391 539986458 540235443
697.3E40235443M17748K59018l83072J08566j64948J5641J413994J459465J211776
$$ 540235443 540653191 540912209 540529137 540637703 540472755 540488396 541902390 543361855 544573631
705.9E44573631Q48656R21135J009674k46353p82318r32236p32460O6986J307449J605835
$$ 544573631 545422287 546343422 547353096 547106743 546324425 545392189 544659729 544726715 546034164 547639999
715.6E47639999J042405K446327J709823j61209J83029l28331j155853r97009J053924
$$ 547639999 548682404 551128731 552838554 552677345 552860374 552532043 551376190 550379181 551433105
724.3E51433105J789666N84297Q41827J698265J397515R33189O66161q09822o65017
$$ 551433105 553222771 553807068 554648895 556347160 557744675 558677864 559344025 558534203 557869186
733E57869186k52227J99508J054535M87519R31587M33998J321831J086082j040535
$$ 557869186 557616959 557816467 558871002 559358521 560290108 560724106 562045937 563132019 562091484
741.6E62091484K71645M68101N54390L95813M76036Q99773O6414O53724M63829P98378
$$ 562091484 562363129 562831230 563385620 563781433 564257469 565157242 565223656 565877380 566341209 567139587
751.3E67139587P44667k59208P0762J126633J448479n2376J90544J130829J230164
$$ 567139587 567884254 567625046 567695808 568822441 570270920 570218544 570409088 571539917 572770081
760E72770081Q73527M96140Q53004P85332Q77075P74879K65313m72870M72488O56738
$$ 572770081 573643608 574139748 574992752 575778084 576655159 577430038 577695351 577222481 577694969 578351707
769.6E78351707q3084P47528k38647o39420n22880l43704K62565j99432J89018R56764
$$ 578351707 578268623 579016151 578777504 578138084 577615204 577271500 577534065 577334633 577523651 578480415
779.2E78480415J460114N89790J38321M36325k55890n33943j23482q5029o25801L76167
$$ 578480415 579940529 580530319 580668640 581104965 580849075 580315132 580191650 580106621 579480820 579856987
788.9E79856987J047173J138343J423722M51622j294022j357346L44544j013603j551399
$$ 579856987 580904160 582042503 583466225 583917847 582623825 581266479 581611023 580597420 579046021
797.6E79046021n83153K03285Q92258q64830n35698k19269q64563o95648j547013j962967
$$ 579046021 578462868 578666153 579558411 578693581 578157883 577938614 577074051 576378403 574831390 572868423
807.2E72868423j656608r95636n61409j79749k42080j72997q86307j397247l86467
$$ 572868423 571211815 570216179 569654770 569475021 569232941 569059944 568173637 566776390 566389923
815.9E66389923q21991j455002j865043n96695P91588M62455Q59032J395378K443123
$$ 566389923 565567932 564112930 562247887 561651192 562442780 562905235 563764267 565159645 567602768
824.6E67602768K244453J761856J172905K52266J242791J784706J964340J565170K201996
$$ 567602768 569847221 571609077 572781982 573034248 574277039 576061745 578026085 579591255 581793251
833.3E81793251K980309K734184L184700K244644N60570q20885n19562n1651R72863
$$ 581793251 584773560 587507744 590692444 592937088 593497658 592676773 592157211 592105560 593078423
841.9E93078423J799202J216850K136535J828537J005173J497765J388626j71585k22626
$$ 593078423 594877625 596094475 598231010 600059547 601064720 602562485 603951111 603779526 603556900
850.6F03556900l20663q17948J740608J997071J740341K168579K625160K730599R15565
$$ 603556900 603236237 602418289 604158897 606155968 607896309 610064888 612690048 615420647 616336212
859.3F16336212N56374q66661j078644l93181l68156K64015J469917J776543m13742
$$ 616336212 616892586 616025925 614947281 614554100 614185944 614449959 615919876 617696419 617282677
868F17282677J42059l10020j336670j774407k895050j598129j672974j330452J78337
$$ 617282677 617424736 617114716 615778046 614003639 611108589 609510460 607837486 606507034 606685371
876.7F06685371J401711R88426J63078p7591j378059n55687o06689j720925k174606
$$ 606685371 608087082 609075508 609238586 609160995 607782936 607227249 606620560 604899635 602725029
885.3F02725029j207542r1629J58538R32694J89476R98382K59057j171570j8692k47307
$$ 602725029 601517487 601425858 601584396 602517090 602706566 603704948 603964005 602792435 602773743 602526436
895F02526436k65007k28348L45306J74408l12080M03900P87087L42636l83415Q38813
$$ 602526436 602261429 602033081 602378387 602552795 602240715 602644615 603431702 603774338 603390923 604229736
904.6F04229736J142769O06423O54525J465264J366272n89943j81008N56946M78363
$$ 604229736 605372505 605978928 606633453 608098717 609464989 608875046 608694038 609250984 609729347
913.3F09729347l41873o82030p63015j484375j590882k216263k022285k633095k094345
$$ 609729347 609387474 608705444 607942429 606458054 604867172 602650909 600628624 597995529 595901184
922E95901184j024589k073555k164994j831360j909828l018226l187905k798767k330665
$$ 595901184 594876595 592803040 590638046 588806686 586896858 583878632 580690727 577891960 575561295
930.7E75561295j424141j634179j018753l89976q7471q278m20570n32074q69065j026878
$$ 575561295 574137154 572502975 571484222 571094246 571006775 570998497 570577927 570045853 569176788 568149910
940.3E68149910j202240r08966m50363J36146j983n53475q9187j09558J07574R8267
$$ 568149910 566947670 566038704 565588341 565724487 565722504 565169029 565079842 564970284 565077858 565176125
949.9E65176125o24695j261864j021652l39165p95059q94928j131821j515693j691170
$$ 565176125 564551430 563289566 562267914 561928749 561133690 560238762 559106941 557591248 555900078
958.6E55900078j942825j158295j465683k605438j816483j421852j552467p52678q90351
$$ 555900078 553957253 552798958 551333275 548727837 546911354 545489502 543937035 543184357 542294006
967.3E42294006j224975j738396j895714j296081j508637k081871k870025k646180
$$ 542294006 541069031 539330635 537434921 536138840 534630203 532548332 529678307 527032127
975E27032127k011528j680603k102356l165893l556366l727570k948608l078194l566017
$$ 527032127 525020599 523339996 521237640 518071747 514515381 510787811 507839203 504761009 501194992
983.7E01194992l495140l788300l381614k818489k677079l294258k996673k260132
$$ 501194992 497699852 493911552 490529938 487711449 485034370 481740112 478743439 476483307
991.4D76483307k439194k716827k782059k690926k422752k271576k722282k543717
$$ 476483307 474044113 471327286 468545227 465854301 463431549 461159973 458437691 455893974
999.1D55893974k555618k074585j349754j481972j254005j585427j663284j510010
$$ 455893974 453338356 451263771 449914017 448432045 447178040 445592613 443929329 442419319
1006.8D42419319j091041q58918j378669j499176j314621j060830j242561j530762
$$ 442419319 441328278 440469360 439090691 437591515 436276894 435216064 433973503 432442741
1014.6D32442741k077980j844864j482238j612358k051697k691879j975327k104950
$$ 432442741 430364761 428519897 427037659 425425301 423373604 420681725 418706398 416601448
1022.3D16601448j618996r04922r79691j083717j703949r01298m04664j39198r96361
$$ 416601448 414982452 414077530 413097839 412014122 410310173 409408875 409004211 408865013 407868652
1031D07868652j236190o5728q3427j53046k10876J039200J398429J196900Q96683Q05435
$$ 407868652 406632462 406566734 406483307 406330261 406119385 407158585 408557014 409753914 410650597 411456032
1040.6D11456032J183510O82640J179352L46221j55563J96610k19498j057930r29527
$$ 411456032 412639542 413322182 414501534 414847755 414692192 414888802 414669304 413611374 412681847
1049.3D12681847o1531j288605m82636j012344k206268m06456L16085m35676j782532
$$ 412681847 412620316 411331711 410849075 409836731 407630463 407224007 407540092 407104416 405321884
1058D05321884n7716Q14628Q91266J942864K458954L191719K083664J045608P858M20914
$$ 405321884 405264168 406078796 406970062 408912926 411371880 414563599 416647263 417692871 417700729 418121643
1067.6D18121643J371918J816177J334458J10549Q53844K01874O2218N82161J053505
$$ 418121643 419493561 421309738 422644196 422754745 423608589 423810463 423872681 424454842 425508347
1076.3D25508347N54199o69213L11890M1046N64499J151123J044121P12204M70848
$$ 425508347 426062546 425393333 425705223 425746269 426310768 427461891 428506012 429218216 429689064
1085D29689064J364403N46303N91392J177254J359138R55658J091805J627273R85413
$$ 429689064 431053467 431599770 432191162 433368416 434727554 435683212 436775017 438402290 439387703
1093.6D39387703J171493R27811J396599J174736R34753J585122J145172J043205R19342
$$ 439387703 440559196 441487007 442883606 444058342 444993095 446578217 447723389 448766594 449685936
1102.3D49685936J573296J498756J525269J059341j90506N86052R18312J003914P11059
$$ 449685936 451259232 452757988 454283257 455342598 455152092 455738144 456656456 457660370 458371429
1111D58371429L70751M28390M78936P52143O48308R86824O57502L9367n40237o93894
$$ 458371429 458742180 459170570 459649506 460401649 461049957 462036781 462694283 462733650 462193413 461499519
1120.6D61499519l01971L83491J359406P62215R8152K11906J195755J105728N37033
$$ 461499519 461197548 461581039 462940445 463702660 463800812 464012718 465208473 466314201 466851234
1129.3D66851234J452523J497688J580124J162376J287880K335854J918220J342316
$$ 466851234 468303757 469801445 471381569 472543945 473831825 476167679 478085899 479428215
1137D79428215J666565J700973J055069R03283P19108J107598J534500P90519M23699
$$ 479428215 481094780 482795753 483850822 484754105 485473213 486580811 488115311 488905830 489329529
1145.7D89329529N34439M18396l7766j87950K41661M84276p6256j37405M03748J96075
$$ 489329529 489863968 490282364 490244598 490056648 490298309 490782585 490706329 490568924 490972672 491168747
1155.4D91168747R6664l79295m41742M2267p92694j485825j061630m81377r2010N49621
$$ 491168747 491265411 490886116 490444374 490486641 489693947 488208122 487146492 486665115 486573105 487122726
1165D87122726J062546J806374J909637J348915K109261K079544J672173J115112J023292
$$ 487122726 488185272 489991646 491901283 493250198 495359459 497439003 499111176 500226288 501249580
1173.7E01249580J863747K017860K361031K158203K260018K623939J837997J070672
$$ 501249580 503113327 505131187 507492218 509650421 511910439 514534378 516372375 517443047
1181.4E17443047J228790J588173J345634O58608L57628L07197L7422R00154J287804
$$ 517443047 518671837 520260010 521605644 522264252 522621880 522929077 522966499 523866653 525154457
1190.1E25154457M43916P8621m7569j17378n32112q17490j057396j424065n53016R346
$$ 525154457 525598373 525676994 525629425 525512047 524979935 524162445 523105049 521680984 521127968 521137314
1199.7E21137314j172943r66873O0119l23410n22537q84171j208496j090202j295662
$$ 521137314 519964371 518997498 519057617 518734207 518211670 517327499 516119003 515028801 513733139
1208.4E13733139q29697k34184r5329K15950L49121L82385J75934l26729p09114r28497
$$ 513733139 512903442 512669258 512573929 512789879 513139000 513521385 513697319 513370590 512661476 511732979
1218E11732979j067162q39691l31192j36795l6964J48849O3515J2626j80740o72340
$$ 511732979 510665817 509826126 509494934 509358139 509321175 509470024 509533539 509546165 509365425 508693085
1227.7E08693085q44765r94797j182518r13162p18346o79588l20435R652L29857M67147
$$ 508693085 507848320 506853523 505671005 504757843 504039497 503359909 503039474 503049126 503378983 503846130
1237.3E03846130O485n73005o81420q39309r51615k98195p6r880Q7357k0676P8850
$$ 503846130 503852615 503279610 502598190 501758881 500807266 500509071 500508995 500499115 500586472 500565796 500644646
1247.9E00644646k21672m61045j37214O8512k48337n97572n67856m65737j70135N4130
$$ 500644646 500422974 499961929 499824715 499893227 499644890 499047318 498479462 498013725 497843590 497897720
1257.6D97897720M69361O91719N40771K98386K54860L36723k78282m01154l88603L12348
$$ 497897720 498367081 499058800 499599571 499897957 500152817 500489540 500211258 499810104 499421501 499733849
1267.2D99733849J236457Q60176J446190J233330M59442P90406L31764J05057O68296
$$ 499733849 500970306 501830482 503276672 504510002 504969444 505759850 506091614 506196671 506864967
1275.9E06864967P97425N84831P05299J163597J130410J003608J847496J876717P28798
$$ 506864967 507662392 508247223 508952522 510116119 511246529 512250137 514097633 515974350 516703148
1284.6E16703148L60107N41916O52924Q64105J082916J039696J099396J113701R61532
$$ 516703148 517063255 517605171 518258095 519122200 520205116 521244812 522344208 523457909 524419441
1293.3E24419441Q47435R50203P13959M7607N4131J86310O49833N62287J72004J77803
$$ 524419441 525266876 526217079 526931038 526978645 527032776 527219086 527868919 528431206 528603210 528781013
1302.9E28781013L8300M96674L05977n0126k32086m20151l73535n07812l68805k51351
$$ 528781013 528819313 529315987 529621964 529571838 529339752 528919601 528546066 528038254 527669449 527418098
1312.5E27418098j30310n60150l09181K77634J05934J41792r0103J49155L86467M91371
$$ 527418098 527287788 526727638 526418457 526696091 526802025 526943817 526853714 527002869 527389336 527880707
1322.2E27880707O76231O03180R44939J013183M42276m05464l00979o2218k62108o22864
$$ 527880707 528556938 529160118 530105057 531118240 531560516 531155052 530854073 530791855 530529747 529906883
1331.8E29906883m42619K53067q2130p2632r3880o1035K66800k0905O1341J77307M69513
$$ 529906883 529464264 529717331 529635201 529562569 529468689 529407654 529674454 529653549 529714890 529892197 530361710
1342.4E30361710K92625N33829P86667M03213M94614N29861N62477m76417l44353M5052
$$ 530361710 530654335 531188164 531974831 532378044 532872658 533402519 533964996 533488579 533144226 533189278
1352.1E33189278m81263l20053l96843Q3580O5804r8572j40915K46353J83030q38471
$$ 533189278 532708015 532387962 531991119 532074699 532140503 532041931 531901016 532147369 532330399 531491928
1361.7E31491928k73437j230660p48939J10206j73149n3444k04963j07575k09389l36265
$$ 531491928 531218491 529987831 529238892 529349098 529175949 529122505 528917542 528809967 528600578 528264313
1371.4E28264313k67754J29967l81928r32617k12326j67808J43890J49574N61943j45149
$$ 528264313 527996559 528126526 527744598 526811981 526599655 526431847 526575737 526725311 527287254 527142105
1381E27142105r31015o72188j379738r88502j29700j44157k458077j426010J1254p79648
$$ 527142105 526211090 525538902 524159164 523170662 523040962 522896805 520438728 519012718 519023972 518244324
1390.7E18244324o90766q52890m28505j689949l039169j467438j460037r80339k493629
$$ 518244324 517553558 516700668 516272163 514582214 511543045 510075607 508615570 507635231 505141602
1399.3E05141602j675759n87044j423416j222114q01621j893882k483140r88426j416168
$$ 505141602 503465843 502878799 501455383 500233269 499431648 497537766 495054626 494066200 492650032
1408D92650032j911201j186371r55696r43718j077042m61388k75917l09715o78520
$$ 492650032 490738831 489552460 488596764 487653046 486576004 486114616 485838699 485528984 484850464
1416.7D84850464j288109k86636k525292k16827J230812M51126R09653J22528N80025
$$ 484850464 483562355 483275719 480750427 480533600 481764412 482215538 483125191 483247719 483827744
1425.4D83827744O41212J8578O52732L23182M3869K99224J304779R92775Q07991J987038
$$ 483827744 484468956 484487534 485140266 485463448 485507317 485806541 487111320 488104095 488912086 490899124
1435D90899124J825943L96881L92800J897926R85298L89443Q03680O30836J048279
$$ 490899124 492725067 493121948 493514748 495412674 496397972 496787415 497591095 498221931 499270210
1443.7D99270210P99637J109581J312943J138839k21481Q25386J516266J17264N16777
$$ 499270210 500069847 501179428 502492371 503631210 503409729 504235115 505751381 505868645 506385422
1452.4E06385422P19757J645317J871529J433181O54488o00243K115135M92440J713295
$$ 506385422 507105179 508750496 510622025 512055206 512709694 512109451 514224586 514717026 516430321
1461.1E16430321J186790P89223J964645L69683J287346J573448K233390J906090K126999
$$ 516430321 517617111 518406334 520370979 520740662 522028008 523601456 525834846 527740936 529867935
1469.7E29867935L245125J931572J477432J364365K456245K403412R48105J565247
$$ 529867935 533113060 535044632 536522064 537886429 540342674 542746086 543694191 545259438
1477.5E45259438K340316K183915J822433J666412J065979J249695Q84094N55802J311836
$$ 545259438 547599754 549783669 551606102 553272514 554338493 555588188 556472282 557028084 558339920
1486.1E58339920N08385N16128J884194M10537o75277J88255L02734n05294n73769
$$ 558339920 558848305 559364433 561248627 561659164 560983887 561172142 561474876 560969582 560395813
1494.8E60395813k63214l690453J01433r71413k013931O00395q53195r92584m98009
$$ 560395813 560132599 556442146 556543579 555572166 553558235 554158630 553305435 552312851 551814842
1503.5E51814842J027909J686172k857056m962196q06503Q82301n59692O74400n29366
$$ 551814842 552842751 554528923 551671867 546709671 545903168 546785469 546225777 546900177 546370811
1512.2E46370811j462707N70526n32570n22461j321144k939262J248665K090454n24521
$$ 546370811 544908104 545478630 544946060 544423599 543102455 540163193 541411858 543502312 542977791
1520.8E42977791k553177l37715J153946K459373k31705j18637Q49266j069717j82228
$$ 542977791 540424614 540086899 541240845 543700218 543468513 543349876 544199142 543129425 542947197
1529.5E42947197O93016P70264J127395R26018j750564J209411J399002J121102J911621
$$ 542947197 543640213 544410477 545537872 546463890 544713326 545922737 547321739 548442841 550354462
1538.2E50354462l128968k375908J955796k47002Q02498K349854J427879j209374J164513
$$ 550354462 547225494 544849586 546805382 546558380 547360878 549710732 551138611 549929237 551093750
1546.9E51093750Q36334J015854K17857j267433O72493P89872K004737j109695o96831
$$ 551093750 551930084 552945938 553163795 551896362 552568855 553358727 555363464 554253769 553556938
1555.6E53556938K266121J838837l887177m398880J747513m07562L99360o75239o08330
$$ 553556938 555823059 557661896 553774719 549375839 551123352 550715790 551115150 550439911 549831581
1564.2E49831581k092209j844024j412l79371L79524o988716j884919p68623k551575
$$ 549831581 547739372 545895348 545893936 545514565 545894089 538905373 537020454 536251831 533700256
1572.9E33700256j848526j419487q99734j0588150k2278j329536l121987k496681l753166
$$ 533700256 531851730 530432243 529532509 518944359 518922081 517592545 514470558 511973877 508220711
1581.6E08220711k661934m489021k898560l941956l559761l166008l820304k215958
$$ 508220711 505558777 501069756 498171196 494229240 490669479 487503471 483683167 481467209
1589.3D81467209m139366k301636m037056k648888k767715m067955k644348l939171
$$ 481467209 477327843 475026207 470989151 468340263 465572548 461504593 458860245 454921074
1597D54921074j751099l869476j798592k325859k806816j514511l197365j564331l290710
$$ 454921074 453169975 449300499 447501907 445176048 442369232 440854721 437657356 436093025 432802315
1605.7D32802315j046181k579460j519470j433220k830811J68152k176056q621j386032
$$ 432802315 431756134 429176674 427657204 426223984 423393173 423561325 421385269 421376648 419990616
1614.4D19990616O26564M87556o249275J929169p19338O16303j020966P99217j85317
$$ 419990616 420617180 421104736 414855461 416784630 416065292 416681595 415660629 416459846 416274529
1623.1D16274529k390976J619224k00043J672326j297074M67148P33795L34320R33075
$$ 416274529 413883553 415502777 415302734 416975060 415677986 416145134 416878929 417213249 418146324
1631.7D18146324k68326K098275J628227O40526j785775K945633P64695L72657K327156
$$ 418146324 417877998 419976273 421604500 422245026 420459251 423404884 424169579 424542236 426869392
1640.4D26869392K99187J909294N26123K254906K597771J04484J911965j941643J598015
$$ 426869392 427168579 429077873 429603996 431858902 434456673 434561157 436473122 434531479 436129494
1649.1D36129494J172409L074760L602486Q75244o236801J07612L832741J352616J421394
$$ 436129494 437301903 440376663 443979149 444854393 438617592 438725204 442557945 443910561 445331955
1657.8D45331955O37817J153527J660766K099686K343254j246719K826538K152633
$$ 445331955 445969772 447123299 448784065 450883751 453227005 451980286 454806824 456959457
1665.5D56959457K098504K713050L203316J931686n5999M065399J456909L310623M010697
$$ 456959457 459057961 461771011 464974327 466906013 466850014 470915413 472372322 475682945 479693642
1674.2D79693642K050743P39746K711601L735771K240258L323249K166138L973007
$$ 479693642 481744385 482484131 485195732 488931503 491171761 494495010 496661148 500634155
1681.9E00634155N944519L121338o24046J196365N250359L987465K996711L480416
$$ 500634155 506578674 509700012 509075966 510272331 515522690 519510155 522506866 525987282
1689.6E25987282K920074L612747L722725M272347M539490M680557l64456L621559
$$ 525987282 528907356 532520103 536242828 540515175 545054665 549735222 549370766 552992325
1697.3E52992325N325546N277557K833062l708420O397819N071946M200897K788582
$$ 552992325 558317871 563595428 566428490 562720070 569117889 574189835 578390732 581179314
1705E81179314K451973J903762J551094K811890J732445J415024J915283K323227L335876
$$ 581179314 583631287 585535049 587086143 589898033 591630478 593045502 594960785 597284012 600619888
1713.7F00619888J040497N7335L369598K743950l298835J411094K353249J419601J170349
$$ 600619888 601660385 601717720 605087318 607831268 604532433 605943527 608296776 609716377 610886726
1722.4F10886726P69005R24378J460495J524849J393966J636009K191430k95258n84068
$$ 610886726 611655731 612580109 614040604 615565453 616959419 618595428 620786858 620491600 619907532
1731.1F19907532L210373L778991p60994o348838L375015M046402K420120L234749
$$ 619907532 623117905 626896896 626135902 619787064 623162079 627208481 629628601 632863350
1738.8F32863350J081581j565475L168792K825432K44942N60188K866325L012543K861786
$$ 632863350 633944931 632379456 635548248 638373680 638618622 639178810 642045135 645057678 647919464
1747.5F47919464K942810J904068L854218J101989N65796L739319J815567K161331
$$ 647919464 650862274 652766342 656620560 657722549 658288345 662027664 663843231 666004562
1755.2F66004562K984009M19388J282349K524490K571182L842163R45359k49558K535172
$$ 666004562 668988571 669407959 670690308 673214798 675785980 679628143 680573502 680323944 682859116
1763.9F82859116J241760Q89435J646728J503754j858292J991043N017777K332611
$$ 682859116 684100876 684990311 686637039 688140793 686282501 688273544 693291321 695623932
1771.6F95623932j141434k116241L232956K215576j215363O48423K21557J315079P86133
$$ 695623932 694482498 692366257 695599213 697814789 696599426 697247849 697469406 698784485 699570618
1780.3F99570618k25296J616897K498856K134476m15497m42581O12258M10386O25076
$$ 699570618 699345322 700962219 703461075 705595551 705180054 704737473 705349731 705760117 706385193
1788.9G06385193J386719M53415O23397p72400j64642L868485J566162q80738L02735
$$ 706385193 707771912 708225327 708848724 708076324 707911682 711780167 713346329 712465591 712768326
1797.6G12768326J565857L56521j945266Q16269m73176P00684K056885J343765J648102
$$ 712768326 714334183 714690704 712745438 713561707 713088531 713789215 715846100 717189865 718837967
1806.3G18837967P32727L28827O21109R53445j477813q47168L18222J89819J513290
$$ 718837967 719570694 719899521 720520630 721474075 719996262 719149094 719467316 719657135 721170425
1815G21170425R67408J434402M25110M12369J002044j59683K02637p49130M35791O39038
$$ 721170425 722137833 723572235 723997345 724409714 725411758 725252075 725454712 724705582 725141373 725780411
1824.6G25780411j505356O32019K144470K543869R44824k767944k76337J586991r2926
$$ 725780411 724275055 724907074 727051544 729595413 730540237 727772293 727495956 729082947 728990021
1833.3G28990021m91257o1417N51911P83691M5548J126098O14014P26776M65546J104889
$$ 728990021 728498764 728437347 728989258 729772949 729818497 730944595 731558609 732285385 732750931 733855820
1842.9G33855820N03921m784393J264267J712417M41285J3122O1417Q16574N65796
$$ 733855820 734359741 729575348 730839615 732552032 732993317 733006439 733067856 733884430 734450226
1851.6G34450226R53064j40228J02996l44162o23397M31060p9193L22952L29285R49173
$$ 734450226 735403290 735263062 735366058 735021896 734398499 734829559 734750366 735073318 735402603 736351776
1861.3G36351776L78494K69242L64074j83639J72272l35770J193161p62863j778336
$$ 736351776 736730270 736999512 737363586 737179947 737352219 737016449 738209610 737446747 735668411
1869.9G35668411P86209J058045J010132j14060L65906K10190o2943l22113j90048
$$ 735668411 736454620 737512665 738522797 738408737 738774643 738984833 738921890 738599777 738409729
1878.6G38409729J75247m57763M89959L75824Q91495M20227o23627J9837J25503J038513
$$ 738409729 738584976 738127213 738617172 738992996 739884491 740304718 739681091 739700928 739826431 740864944
1888.3G40864944Q164j553345j87454O83289L29208O21414N72510n19486L29667j75553
$$ 740864944 740873108 739319763 739132309 739815598 740144806 740766220 741338730 740819244 741148911 740973358
1897.9G40973358j18713m6616k34299N0049o9427P36923J8463J85013M18015K66952
$$ 740973358 740854645 740808029 740573730 740623779 740554352 741291275 741309738 741494751 741912766 742179718
1907.6G42179718J89819k45285k15301o13861L09219k43454J96610M49981M09851J666718
$$ 742179718 742369537 742124252 741908951 741295090 741604309 741360855 741557465 742007446 742417297 744084015
1917.2G44084015j416702j008912O70395j7852J16195n97610n45807M31442R84650
$$ 744084015 742667313 741658401 742328796 742310944 742427139 741829529 741283722 741715164 742699814
1925.9G42699814r384J69983K50320k8229k38342p73621K04468k28729p0496k03170
$$ 742699814 742690430 742860413 743110733 743082504 742844162 742070541 742275009 742046280 741975784 741772614
1935.5G41772614k58103N12619K55585M18701j8768P32879K3880j268692j01013p2555
$$ 741772614 741514511 742027130 742282715 742701416 742682648 743415527 743439407 742170715 742069702 741997147
1945.2G41997147k3499l04794M32052K60926J16195M01535k66952j61896k7771j03378
$$ 741997147 741973648 741668854 742100906 742361832 742478027 742879562 742612610 742450714 742422943 742319565
1954.8G42319565q08106m15344k69852q39Q00400R9030K64053K40860L357m84619l90244
$$ 742319565 741511459 741096115 740826263 740825424 741625824 741724854 741988907 742229767 742233124 741748505 741358261
1965.4G41358261K63901l78418l64685j52893K12250K52609J47934K22778J83182K51922
$$ 741358261 741622162 741243744 740879059 740726166 740938416 741191025 741338959 741561737 741744919 741996841
1975.1G41996841q6059k91214n92728m46472m62875j83640K89612L69110O89392M31748
$$ 741996841 741910782 741619568 741026840 740580368 740117493 739933853 740223465 740592575 741281967 741713715
1984.7G41713715J55563m14429k82593n33828q07343O4545m99344r10492K8534J006165
$$ 741713715 741869278 741454849 741172256 740638428 739831085 739895630 739396286 738485794 738514328 739520493
1994.3G39520493J077575M28238m34646k75116K41928q14286n66177n74264k03019
$$ 739520493 740598068 741026306 740591660 740316544 740558472 739744186 739178009 738603745 738400726
2003G38400726L41187j46790M84848L08762M38003J92643n67246p87430o86874l90549
$$ 738400726 738741913 738595123 739079971 739388733 739826736 740019379 739452133 738664703 737977829 737587280
2012.7G37587280p43103r460M80881M28543K85339N54810N30700l23028k42615p76901
$$ 737587280 736844177 736834717 737315598 737744141 738029480 738584290 739114990 738791962 738549347 737772446
2022.3G37772446p37915o83670m69895n2795q6518O10886M78973O19660J90811j38626
$$ 737772446 737034531 736350861 735880966 735828171 735741653 736352539 736831512 737451172 737641983 737503357
2032G37503357j99280r73968r48410p81556k02560Q3694P78962O27746K46964P13196
$$ 737503357 737304077 736330109 735381699 734600143 734397583 734481277 735260239 735887985 736134949 736848145
2041.6G36848145K31857j4267r66187j205749j179428n01328K34909k13928M92096
$$ 736848145 737080002 737065735 736099548 734893799 733714371 733213043 733447952 733234024 733726120
2050.3G33726120M93546P83233O03485J00174j16501q27636n17273r10645p12662j97525
$$ 733726120 734219666 735002899 735606384 735706558 735590057 734762421 734245148 733334503 732621841 732424316
2059.9G32424316L16391N77393M17404O60172K27890J56631m56314m73862p81784j233673
$$ 732424316 732740707 733318100 733735504 734395676 734623566 734780197 734323883 733850021 733068237 731834564
2069.6G31834564m27398j98594M98352P28302Q67005N15518J221l9749m94233n61294
$$ 731834564 731407166 731208572 731706924 732435226 733302231 733817749 733818970 733779221 733284988 732723694
2079.2G32723694r19800n74036l78646J67083O76728P15026Q01011r2240l357m24957
$$ 732723694 731803894 731229858 730851212 731018295 731695023 732410049 733211060 733118820 733115463 732690506
2088.9G32690506o07529p25860q96225j13220k21558L22113M60205N72052N33905o2866
$$ 732690506 732082977 731357117 730460892 730347672 730126114 730448227 730908432 731480484 732014389 731951523
2098.5G31951523l86582n98754k36359o09436k76489l53928l44696L24325L81470N27497
$$ 731951523 731564941 730966187 730729828 730120392 729843903 729489975 729145279 729469604 729851074 730378571
2108.1G30378571J02233L31650k90832o94123n52520o92444k08817k23312M03976L09449
$$ 730378571 730480804 730812454 730521622 729827499 729274979 728582535 728373718 728150406 728554382 728863831
2117.8G28863831L07922M36096J79596r842l62778m3640q34655n10102k2735K5863
$$ 728863831 729171753 729607849 729787445 729777603 729414825 729371185 728536530 728026428 728003693 728029556
2127.4G28029556L85514R6283M43573k9374K38572K64740k93351m72183n99823k18429
$$ 728029556 728415070 728511353 728954926 728925552 729164124 729428864 729135513 728663330 728063507 727845078
2137.1G27845078m04740N05753L83300l6621K74353K26136L30658m17939k73971n28259
$$ 727845078 727440338 727946091 728329391 728292770 728567123 728793259 729123917 728705978 728432007 727903748
2146.7G27903748m41132j01929l7002N35736K69089O18896J07956L9596L84903l64608
$$ 727903748 727462616 727360687 727323685 727859421 728128510 728747406 728855362 728894958 729279861 728915253
2156.4G28915253n57480n87616l80860k72445L94287M52423K98309M29840J91269J65177
$$ 728915253 728357773 727770157 727389297 727116852 727511139 727963562 728261871 728691711 728882980 729048157
2166G29048157m02375k21633k64740n11322m81720j5412P90863P37305Q02383q1024
$$ 729048157 728645782 728424149 728159409 727648087 727166367 727150955 727941818 728679123 729481506 729400482
2175.6G29400482m26941k19574k70767J28784j20697l78418n80749m3640P15255R01490
$$ 729400482 728973541 728753967 728483200 728611984 728491287 728112869 727532120 727488480 728203735 729105225
2185.3G29105225J53808j04828L88184l46756n25894l50723O8435n0735j86539M00238
$$ 729105225 729259033 729154205 729542389 729195633 728669739 728319016 728387451 728336716 728150177 728550415
2194.9G28550415K97089M25567J05439J45874n4093k96783l42484m82406K64282K9220
$$ 728550415 728847504 729273071 729378510 729524384 729470291 729173508 728831024 728348618 728612900 728642120
2204.6G28642120J52588O8512J55640N67016J52207p858n88837j99890k42920l33099
$$ 728642120 728794708 728863220 729018860 729585876 729738083 729730225 729141388 728941498 728698578 728365479
2214.2G28365479K98309N71899K07825n27496L44467M32434K96478P4082m36707m33655
$$ 728365479 728663788 729235687 729443512 728916016 729260483 729692917 729989395 730063477 729626770 729193115
2223.9G29193115n30090K0981o04553j37635O16989M66767N30548K02942M61502m74167
$$ 729193115 728663025 728684006 728079453 727941818 728558807 729025574 729556122 729759064 730220566 729746399
2233.5G29746399q00705o05927m15115K72446l205N7679L22418N78308K48871L24020
$$ 729746399 728945694 728339767 727924652 728197098 728193893 728251572 728573990 729152298 729401169 729725189
2243.2G29725189Q3313m75311k36359m98428l38059l46450J56860L07312M80957M39911
$$ 729725189 729808502 729333191 729096832 728598404 728260345 727913895 728070755 728378067 728859024 729298935
2252.8G29298935o18820O7520K00424R9945k86712o92902l42636m02222L35999M68902
$$ 729298935 728680115 728747635 728948059 729048004 728761292 728068390 727725754 727323532 727659531 728128433
2262.4G28128433M15116J08490N4626J07727j25122P63n50613k63443j72348l4638
$$ 728128433 728543549 728652039 728706665 728814392 728689270 728690033 728139420 727875977 727703629 727668991
2272.1G27668991j16882M1733M75769j01090J81580k33231N4550P1945m71954l95737
$$ 727668991 727552109 727593842 728069611 727968521 728150101 727916870 727971420 728043365 727571411 727175674
2281.7G27175674n06515L63235k48794j54572L65296J69067L5935l46528L99170k02789
$$ 727175674 726669159 727032394 726783600 726629028 726994324 727163391 727199326 726852798 727251968 727049179
2291.4G27049179l33862j62277l15705k02713j69525O70242k7542k03933j37482R9869
$$ 727049179 726715317 726553040 726237335 726034622 725865097 726535339 726507797 726303864 726166382 726266251
2301G26266251K93579l71552P0648m95452m95072P4234L06625K02179J20774M08478
$$ 726266251 726559830 726188278 726258926 725763474 725268402 725342636 725649261 725851440 725972214 726380692
2310.7G26380692j10550r1324p39289M7913N37949m88511r6435l80859n84031M3793
$$ 726380692 726270142 726178818 725439529 725487442 726025391 725536880 725440445 725059586 724475555 724519348
2320.3G24519348J315994K00959r75571k83127j40533K82669k75498P3548k26136j99890
$$ 724519348 725835342 726036301 725060730 724777603 724637070 724919739 724644241 724717789 724491653 724291763
2329.9G24291763m36935o84281O00968l03269Q57087M94079j408996j146698k45285
$$ 724291763 723854828 723170547 723771515 723468246 724325333 724819412 723410416 722263718 722018433
2338.6G22018433Q37783L47443M63486m9744r86252q44497K69394j41831q38852J83258
$$ 722018433 722856216 723203659 723667145 723617401 722631149 721786652 722056046 721914215 721075363 721258621
2348.3G21258621R11789Q74710o04400M11529P85904m47311j15891j236648k91520
$$ 721258621 722170410 723045120 722440720 722852249 723638153 723190842 723074951 721838303 721546783
2356.9G21546783j379318k96936O76041l66440K52228n44892J063080K69318k2507
$$ 721546783 720167465 719870529 720546570 720180130 720432358 719887466 720950546 721219864 721197357
2365.6G21197357m17480j075821p48062n96238R80988L32642l89862n25742n1804n4321
$$ 721197357 720779877 719704056 718955994 718359756 719340744 719673386 719283524 718757782 718705978 718651657
2375.3G18651657k55661l17154p01980L1356j92642n9814k76566q22220n1117M85611
$$ 718651657 718395996 718078842 717376862 717408218 717215576 717155762 716879196 716056976 716005859 716491470
2384.9G16491470J86386m72641j6937j88217l30658k76718p14417l22799k37961L49884
$$ 716491470 716677856 716205215 716188278 716000061 715669403 715392685 714678268 714355469 714117508 714467392
2394.6G14467392J85013m2572k13166o32400P935j44425j22070n65338o08979l89175
$$ 714467392 714652405 714609833 714396667 713764267 713772202 713627777 713505707 712940369 712331390 711942215
2404.2G11942215l70407M66156J21689K27356K44445n4168j17417k40326m96978j133423
$$ 711942215 711571808 712037964 712159653 712387009 712631454 712577286 712459869 712219543 711722565 710589142
2413.8G10589142m60510l82386o78558j94092M33579M08783k24152j54877j66931j62506
$$ 710589142 710128632 709746246 709067688 708873596 709307175 709715958 709491806 709336929 709169998 709007492
2423.5G09007492o57654o33468m66004o15082l20434k16599M97132R918k39868J68075
$$ 709007492 708349838 707716370 707250366 706635284 706314850 706098251 706595383 706605301 706365433 706533508
2433.1G06533508R5978n3482p19528o01654r73511n02319O0043j58310P9651p6675
$$ 706533508 706629486 706576004 705856476 705254822 704281311 703778992 703839035 703680725 703760376 703683701
2442.8G03683701M72641n3406m36783k30560n54047m96979o00662k98080n05295k11792
$$ 703683701 704156342 704102936 703666153 703435593 702881546 702384567 701783905 701485825 700980530 700768738
2452.4G00768738K50244J38245Q1405l81698m22059n95245n36117k97089l10745o12488
$$ 700768738 701018982 701157227 701238632 700856934 700434875 699839630 699303513 699006424 698695679 698083191
2462.1F98083191k58560M33197K5558J38855r4223k79617k51083r82132j007767o58875
$$ 698083191 697824631 698257828 698283386 698422241 698328018 698048401 697797318 696815186 695807419 695148544
2471.7F95148544l56445k24152k19421k26059K60391L91922k45208m54941l98255l42788
$$ 695148544 694792099 694567947 694348526 694122467 694382858 694774780 694529572 694074631 693676376 693333588
2481.3F93333588p40509o76575n77011n63431l56598k5329P58056J53885l94669n55038
$$ 693333588 692593079 691916504 691339493 690776062 690419464 690394135 691152191 691306076 690911407 690356369
2491F90356369n49316k63443q01087o36291n02320n61218j41678M94690L52249j38855
$$ 690356369 689807053 689543610 688742523 688106232 687603912 687042694 686901016 687395706 687747955 687609100
2500.6F87609100O8512m88510r49859q94165m66233o83975j043549k72445J58386M79584
$$ 687609100 687677612 687189102 686239243 685345078 684878845 684194870 683151321 682878876 683037262 683516846
2510.3F83516846o5384l77884j78681m22592l33328m42123k56195l94135o81992n67245
$$ 683516846 683451462 683073578 682894897 682472305 682138977 681696854 681440659 681046524 680364532 679797287
2519.9F79797287j93863J12991J10245Tk25296k73132o41556o58570n01174o01883
$$ 679797287 679603424 679716415 679826660 679936905 679711609 679438477 678796921 678138351 677637177 677035294
2529.6F77035294k74201k89993J16196j10398j84707K35137k45590m80652n10330m61426
$$ 677035294 676761093 676471100 676587296 676476898 676292191 676527328 676281738 675801086 675290756 674829330
2539.2F74829330m37088q6975l29895p00454k14920K7847J4877m05044k92664l11356
$$ 674829330 674392242 674305267 673975372 673274918 673059998 673087845 673102722 672697678 672405014 672093658
2548.9F72093658n11932m99649n27420n5237j62430j71203j50833j77536k95792m52881
$$ 672093658 671581726 671082077 670554657 670499420 670336990 670165787 670014954 669837418 669541626 669088745
2558.5F69088745j26953k91138k88772p07321p54090r1705j25809m4708P553q8882
$$ 669088745 668961792 668670654 668381882 667674561 666920471 666828766 666702957 666658249 666665802 666576920
2568.1F66576920j069O1264m47616o02799n69763p79953m64096k04391K6703k00119
$$ 666576920 666575851 666637115 666189499 665586700 665016937 664236984 663772888 663568497 663595200 663395081
2577.8F63395081l81318l17001l5171j20469o59332j40915k25372l14560k41394m61884
$$ 663395081 663013763 662696762 662661591 662541122 661881790 661740875 661515503 661200943 660959549 660497665
2587.4F60497665l11431j80970K69242l07236n22919k63138l65829k87399p16706m97513
$$ 660497665 660186234 660005264 660274506 659967270 659444351 659181213 658815384 658527985 657811279 657313766
2597.1F57313766j05438L0899k66113n87387k31705J44119o5460q10852n10635k10571
$$ 657313766 657208328 657239227 656973114 656385727 656154022 656298141 656232681 655421829 654911194 654700623
2606.7F54700623m54560o76040m26102p9270k26364K16294k59705m67300k9831k09122
$$ 654700623 654246063 653570023 653143921 653064651 652838287 653054581 652794876 652327576 652297745 652088623
2616.4F52088623k69546p94602o47507k61840n74799o37131j08108j50528l38211j02310
$$ 652088623 651819077 651024475 650376968 650115128 649540329 648903198 648795090 648644562 648306351 648204041
2626F48204041n50309m49142o78177o55746M8522j87149k26135k82974j77536j76849
$$ 648204041 647653732 647204590 646526413 645870667 645919189 645732040 645505905 645222931 645045395 644868546
2635.6F44868546k89002l62320n87616m38080n54733o06079m25873j53427l90625l27072
$$ 644868546 644579544 644217224 643629608 643191528 642636795 642030716 641604843 641451416 641060791 640733719
2645.3F40733719J35879j01089k09274m22898l43437n33714p21474k22549j95732l11585
$$ 640733719 640869598 640768509 640559235 640136337 639792900 639259186 638537712 638315163 638119431 637807846
2654.9F37807846q4038Q4305n93452n83153k68440m01650l12996o41250k01989J44844
$$ 637807846 637723808 637808113 637214661 636631508 636363068 635961418 635648422 635007172 634805183 634950027
2664.6F34950027j43699j44081M3297k77024n03959L8948n27611n91927j51481m78402
$$ 634950027 634806328 634662247 634705544 634428520 633924561 633963509 633435898 632843971 632692490 632214088
2674.2F32214088l65982q5373Q3237p4043j51482l44124m57649n05218j75820P2212
$$ 632214088 631848106 631762733 631845970 631771927 631620445 631276321 630818672 630313454 630137634 630209846
2683.9F30209846o52427n29099l78456l80974j79710M578J25084j09177j7662l18489
$$ 630209846 629557419 629028320 628649864 628268890 628089180 628093758 628218842 628109665 628092003 627773514
2693.5F27773514k11258m38385o44608k98958m01191M2991j78680j18065K6322j60828
$$ 627773514 627562256 627123871 626479263 626180305 625779114 625822105 625643425 625525360 625551682 625390854
2703.1F25390854k44408o27289k02713l64189l17383k04696m50936k52189j04637P9345
$$ 625390854 625146446 624519157 624316444 623952255 623634872 623430176 622979240 622727051 622622414 622701759
2712.8F22701759k41470J20316p8736n84678m47541o14128k12288l18985n7907K78015
$$ 622701759 622460289 622580605 622501869 621917191 621469650 620855522 620643234 620324249 620266342 620544357
2722.4F20544357j41067j63880K28806N08766n47829j145820n00755q3886j53732l93791
$$ 620544357 620403290 620239410 620468216 620976982 620429153 619283333 618782578 618698692 618544960 618151169
2732.1F18151169l66287O7024K18620k43187j17149l34931o74667j97258K56043K80075
$$ 618151169 617784882 617851906 618070526 617827339 617710190 617375259 616700592 616503334 616759377 617039452
2741.7F17039452k66343l73840m85840j58767L78952k77024n33256J11541L50075k84385
$$ 617039452 616773109 616399269 615913429 615754662 616133614 615856590 615323334 615434875 615784950 615500565
2751.4F15500565k86713q8005m83589m51432l77769j21918K53563J8006k69967o5384
$$ 615500565 615213852 615125847 614642258 614190826 613813057 613691139 613944702 613962708 613692741 613627357
2761F13627357l90090n93796k76489k65122k15416m26330k5788P0534j16196J46218
$$ 613627357 613237267 612643471 612366982 612101860 611886444 611460114 611434326 611504860 611388664 611534882
2770.7F11534882l05520k71606l35464k50779l50952r57336j88942L4027m57115l88489
$$ 611534882 611229362 610957756 610622292 610371513 610020561 609063225 608874283 608908310 608451195 608062706
2780.3F08062706l74260k62642K04430J41182m21028m99115m73557l19824k46124m78974
$$ 608062706 607688446 607425804 607630234 607771416 607350388 606851273 606377716 606057892 605811768 605332794
2789.9F05332794o44417l86810o0959J7624o5117n80024n74074l25127k24686n16510
$$ 605332794 604688377 604301567 604240608 604258232 604193115 603613091 603039017 602713890 602489204 601972694
2799.6F01972694q08067m04549o18896l31802J54762l81241q89854p10412l1967k36053
$$ 601972694 601164627 600760078 600141182 599809380 599964142 599582901 598693047 597982635 597950668 597714615
2809.2E97714615r14841q86001l61176l16277m94842n91087n28870j15814k81983m20074
$$ 597714615 596799774 595913773 595552597 595236320 594741478 594150391 593621521 593505707 593223724 592803650
2818.9E92803650q15544q80814m17900m89769l81851o37703o70433o65436o56013k10839
$$ 592803650 591988106 591107292 590689392 590199623 589817772 589180069 588509636 587844200 587188187 586977348
2828.5E86977348k85873n41535o17599o75888j057587m99153l40004j152878j158332
$$ 586977348 586691475 586149940 585532341 584856453 583798866 583299713 582959709 581806831 580648499
2837.2E80648499j102639q22830j026726q89854p54814j527825j431923q94393o87180
$$ 580648499 579545860 578723030 577696304 576806450 576051636 574523811 573091888 572197495 571510315
2845.9E71510315j336021j481324j565246j821251j284065j202622o22520m66729r23080
$$ 571510315 570174294 568692970 567127724 565306473 564022408 562819786 562197266 561730537 560807457
2854.6E60807457m40674N07507M70353k90070l56407o06156j71279O9465m46663l29094
$$ 560807457 560366783 560874290 561344643 561054573 560698166 560092010 559920731 559990196 559543533 559214439
2864.2E59214439m23507m08173n40581r04235q59108m11492j59988l82004n33867m63219
$$ 559214439 558790932 558382759 557842178 556937943 556078835 555667343 555507355 555125351 554591484 554128265
2873.8E54128265m71649o74553l40309l02086m70009m26025m14772l73039p00379o43005
$$ 554128265 553656616 552982063 552641754 552339668 551869659 551443634 551028862 550655823 549955444 549312439
2883.5E49312439p80525o03447l65753o95687n38597m02336m12903j054115q38547
$$ 549312439 548531914 547928467 547562714 546867027 546328430 545926094 545513191 544459076 543620529
2892.2E43620529k31857n89829p50007p08885n77736j029892l31307Q5907q66546p80602
$$ 543620529 543388672 542798843 542048836 541339951 540762215 539732323 539401016 539486923 538620377 537839775
2901.8E37839775m57420j15509n96733p85027n73425n16968k53067j042480r29795
$$ 537839775 537382355 537266846 536670113 535885086 535311661 534794693 534541626 533499146 532569351
2910.5E32569351n87578p02591r17205j513558j193313q09021o73829o84776r33609
$$ 532569351 531981773 531279182 530361977 528848419 527655106 526846085 526172256 525487480 524553871
2919.2E24553871j170502j100769j098022m86679L63846m57611o71845j42403J08223
$$ 524553871 523383369 522282600 521184578 520697899 521061745 520604134 519932289 519789886 519898109
2927.8E19898109J9570k03476J793l17421O2446L96080q1710J14212O40983N37529
$$ 519898109 519917679 519714203 519715996 519398575 519461021 519857101 519775391 519889603 520530586 521068115
2937.5E21068115M08783P78160N42832O77757J135178O93512P6370M04167O50139P4158
$$ 521068115 521476898 522255058 522797890 523475647 524610825 525304337 525380707 525784874 526435013 526509171
2947.1E26509171L93867N70793M39949L96271M55627O28624q3656k16980K15721R22356
$$ 526509171 526903038 527473831 527913780 528310051 528765678 529394302 529310646 529093666 529309387 530231743
2956.8E30231743Q74748j19324l00064J63155P65571O00892O27060O91375N53780N57289
$$ 530231743 531106491 530987167 530687103 530850258 531615829 532216721 532843781 533535156 534088936 534646225
2966.4E34646225L69072O28319K65007P6408P54280J064453O68755O57387N60417j30272
$$ 534646225 535015297 535643616 535908623 535985031 536739311 537803764 538472519 539129906 539690323 539560051
2976.1E39560051K92778O22635Q29277N76897J8730M6005k84882n9166r7808L56445
$$ 539560051 539852829 540475464 541304741 541881638 541900368 541946373 541661491 541602325 541504517 541860962
2985.7E41860962O99272R5291l5019l99170Q8196M24118r9144m76379l04375L17688
$$ 541860962 542560234 542655525 542620506 542221336 542309532 542733650 542634506 542158127 541853752 542171440
2995.3E42171440L54805K54364r918l09334p01942l76129j3123o24390o96563m65393
$$ 542171440 542526245 542780609 542770691 542461357 541759415 541383286 541370163 540745773 540049210 539583817
3005E39583817N2375J18409j72730m33960p15523k96325j15471k05040l30925m07257
$$ 539583817 539636192 539754601 539581871 539147911 538432388 538136063 538020592 537815552 537484627 537077370
3014.6E37077370p94792q70133l74374J2245N7640p87392n26352m1580o26488r82017
$$ 537077370 536282578 535412445 535038071 535050316 535107956 534320564 533794212 533752632 533126144 532144127
3024.3E32144127n80711j98784j058350q21419J95999M47579j82648j039924o95115
$$ 532144127 531563416 531364632 530306282 529484863 529680862 530128441 529945793 528905869 528210754
3033E28210754n10406n19066r02824r70307m96101o01730m23356j11503k51465n30777
$$ 528210754 527700348 527181282 526278458 525308151 524812050 524210320 523786964 523675461 523423996 522893219
3042.6E22893219l99361p84225o78101m06112j008110o28014m52881l30353m83703
$$ 522893219 522493858 521709633 521031532 520625420 519617310 518989296 518536415 518206062 517722359
3051.3E17722359p85446k39296l30468o74209q04596m56085o46325q04557m10805m39415
$$ 517722359 516936913 516697617 516367149 515692940 514888344 514432259 513785934 512981377 512570572 512131157
3060.9E12131157k75955o62918j003991m74929M56733j03378j158256p26281o73599
$$ 512131157 511855202 511192284 510188293 509713364 510170097 510066719 508908463 508182182 507508583
3069.6E07508583n01709p52067p96586r2125k14920l34663l85704k24533m96407q16536
$$ 507508583 507006874 506254807 505458221 505366096 505151176 504816513 504430809 504206276 503709869 502893333
3079.2E02893333p18002n49507K6894l7690n06858p28951n21812m22135n07011m51126
$$ 502893333 502175331 501625824 501652718 501615028 501108170 500379219 499857407 499435272 498928261 498477135
3088.9D98477135m08745m06990o48613p92236j032486l21007P744p64313m84505m03023
$$ 498477135 498068390 497661400 497012787 496220551 495188065 494867058 494874802 494110489 493625984 493222961
3098.5D93222961l90701k77443m71344o66160p02210l81012m05502m73366m01192j64222
$$ 493222961 492832260 492554817 492083473 491417313 490715103 490334091 489928589 489455223 489054031 488889809
3108.2D88889809n82466p96624m05426p55844n37262j13182k10190q37593r31740k12326
$$ 488889809 488307343 487510719 487105293 486349449 485812187 485699005 485488815 484651222 483719482 483507156
3117.8D83507156k61230m36783p62558p50770n71976p28646o12716o62193n19867m37890
$$ 483507156 483245926 482809143 482046585 481295815 480723839 479995193 479382477 478720284 478200417 477762527
3127.5D77762527n02853m49257m90150o98853p80601n29671l60260l76244q33397r30595
$$ 477762527 477259674 476810417 476320267 475621414 474840813 474311142 473950882 473574638 472741241 471810646
3137.1D71810646m42772m39606o79283m77485n61219r46922o96068o22024l01361n4398
$$ 471810646 471367874 470928268 470248985 469771500 469210281 468263359 467567291 466945267 466643906 466589508
3146.8D66589508n12009o76879o00205k10075l61443q19855j094970r36051l03993
$$ 466589508 466077499 465400620 464800415 464590340 464228897 463409042 462314072 461378021 461074028
3155.4D61074028n65109p81632n81016l35846m54369r80835q62770n15137k56309l78151
$$ 461074028 460508919 459727287 459146271 458810425 458356056 457375221 456512451 455997314 455741005 455362854
3165.1D55362854o48041o64902o96716q38394p06406l66935o81687q14628j68991j1254
$$ 455362854 454714813 454049911 453353195 452514801 451808395 451441460 450759773 449945145 449776154 449764900
3174.7D49764900p95059q89435o18934n94788l23830r43603j141587p84072l81928
$$ 449764900 448969841 448080406 447461472 446866684 446542854 445599251 444457664 443673592 443291664
3183.4D43291664q9378o51169n15747o55823p99713l53851n77584p54738p41958n15556
$$ 443291664 443202286 442551117 442035370 441379547 440579834 440225983 439648399 438893661 438151703 437636147
3193D37636147l46261m96749o09360l58429p00684r99603m01535n29060l22342l78456
$$ 437636147 437289886 436793137 436183777 435825348 435124664 434125061 433723526 433194466 432872124 432493668
3202.7D32493668q81157l55835p4387m83360p33452j04408j89743p20291p13883o37169
$$ 432493668 431612511 431256676 431182289 430698929 429965477 429861069 429671326 428951035 428237152 427599983
3212.3D27599983R575l37067q27674m99306n67131l27072Q8997l43743j145363r58938
$$ 427599983 427609558 427272491 426444817 425945511 425378380 425051308 425140305 424796562 423651199 422692261
3222D22692261m42810m12598n29594k21062m7379p44018n89524J5259l18870l41721
$$ 422692261 422249451 421836853 421307259 421086197 421038818 420294800 419705276 419720535 419401665 419059944
3231.6D19059944r9907l60946n03807r83086r93919j50452l81432n16700k67754k48108
$$ 419059944 418960037 418599091 418095284 417112198 416118279 415967827 415586395 415069695 414801941 414553833
3241.3D14553833n31120o78444L4485n86739q93440o4125q8234j93596l16277n01670
$$ 414553833 414022713 413344269 413378754 412792015 411898575 411834450 411746216 411552620 411236343 410734673
3250.9D10734673r58214m65279l2120o89468l78990k31743l12195k88811o06918n09872
$$ 410734673 409776459 409311180 409279060 408589592 408210602 407978859 407666664 407377853 406770935 406261063
3260.5D06261063j25542m27666p64618k16026k48337k27127m05121p25364k7848k04353
$$ 406261063 406135521 405707855 404943237 404727211 404478874 404251747 403846626 403121262 403093414 402889061
3270.2D02889061j75171N150n99289n79872l30010k38990o63758n62019p8926m20075
$$ 402889061 402713890 402719040 402119751 401539879 401209869 400970879 400307121 399745102 399666176 399246101
3279.8C99246101k27813m8027l58925k28310k30675m41703l72124j58539k72827k50435
$$ 399246101 399018288 398970261 398611336 398383026 398152351 397710648 397338524 397179985 396907158 396656723
3289.5C96656723N7831k66342m51851l02315l21426n7373k175j89132m87175o51703
$$ 396656723 396714554 396448212 395996361 395694046 395372620 395315247 395313072 395123940 394636765 393985062
3299.1C93985062n65834n78690P9002M75808j88637k45705k00577q02459m73976J23596
$$ 393985062 393419228 392840538 392919540 393395348 393206711 392961006 392760429 391957970 391483994 391607590
3308.8C91607590k90757p07359o34765k67296l8414j90964o18057n51796k16294o15120
$$ 391607590 391316833 390609474 389974709 389707413 389668999 389478035 388859978 388308182 388091888 387476768
3318.4C87476768m23583k71721m78249j68533l97568l35236n00679q30574n35888q47664
$$ 387476768 387053185 386781464 386303215 386134682 385737114 385401878 384901199 384070625 383534737 382687073
3328.1C82687073n39246j20544n52826p07703k96135O1188m63791m47464k90718p09000
$$ 382687073 382147827 382027283 381474457 380766754 380470619 380531807 380068016 379620552 379329834 378620834
3337.7C78620834n73616p33146o49758n26237m79088k26860r23920o18629K21061m10118
$$ 378620834 378047218 377314072 376664314 376138077 375658989 375432129 374508209 373889580 374110641 373700523
3347.3C73700523o07299N5885k58598j048356n53360m9781j02616k98614n86739k08359
$$ 373700523 373093224 373149109 372890511 371842155 371288795 371239014 371136398 370837784 370251045 370042686
3357C70042686m33731p09610l8948J20697o34117j043205l52325R5024M0741j43662
$$ 370042686 369608955 368899345 368860397 368981094 368346977 367303772 366951447 367046471 367087212 366943550
3366.6C66943550k07786j42861l99818n99404o24656l46566m49485l06435J9073k75001
$$ 366943550 366735764 366592903 366193085 365593681 364969025 364622459 364172974 363866539 363885612 363610611
3376.3C63610611l14674p57676l22189L19214j51367k2927p6J01967J88522k69050
$$ 363610611 363295937 362538261 362216072 362535286 362383919 362360992 362360916 362462883 362651405 362382355
3385.9C62382355p07550m47121K07367k49672k13890L52669j05553l76701J0948o6223
$$ 362382355 361674805 361227684 361435051 361185379 360971489 361324158 361218605 360841904 360852852 360786629
3395.6C60786629m68140l50265k97432l17536k78358j4649M04663o6719l48243o0845
$$ 360786629 360318489 359968224 359670792 359353256 359074898 359060249 359464912 359398193 359049950 358989105
3405.2C58989105k97394k11944M7951k95563K08664M23546l02124J1444M31785L82271
$$ 358989105 358691711 358479767 358527718 358232155 358440819 358864365 358562241 358573685 359005470 359387741
3414.8C59387741j75056m64020j13678J35269N89066p2709j00250P07550o2294j82113
$$ 359387741 359212685 358748665 358634987 358770256 359359322 359286613 359186363 359893913 359831619 359649506
3424.5C59649506O62651P26585L08876M4899l50685l45612j907K45628L18489M69933
$$ 359649506 360312157 361038742 361347618 361392517 361041832 360696220 360694313 360939941 361258430 361728363
3434.1C61728363Q16307J06659Q6060J48277k11182L74146Q3122L15704M75388L17764
$$ 361728363 362544670 362651329 362737389 362885666 362674484 363048630 363131752 363447456 363922844 364240608
3443.8C64240608N85900P44552J098175j67885p4272N72129N04951O00777p4959P68318
$$ 364240608 364826508 365571060 366669235 366501350 366427078 366999207 367504158 368104935 368029976 368798294
3453.4C68798294Q56743m654L59650Q80966P65610J67999N95932M73060M17099P22695
$$ 368798294 369655037 369650383 370010033 370890999 371656609 371824608 372420540 372893600 373310699 374033394
3463.1C74033394M70466P81975N03845L53814N59425O56395O38046M32205L98293M58984
$$ 374033394 374503860 375285835 375789680 376143494 376702919 377359314 377997360 378429565 378827858 379286842
3472.7C79286842J116333P96891j07842M55551R42078O43425P18040J050797J190948
$$ 379286842 380403175 381200066 381092224 381547775 382489853 383133278 383851318 384902115 386093063
3481.4C86093063O08178j49842P64694R75914P16210R64393p5416K29225J580734J240807
$$ 386093063 386701241 386551399 387316093 388292007 389008217 389972610 389897194 390126419 391707153 392947960
3491C92947960K14958L50952P33261N48592Q50296O14243N19752P97463O86569O91528
$$ 392947960 393162918 393513870 394247131 394795723 395646019 396260262 396780014 397577477 398264046 398955574
3500.7C98955574J069794J549988O56471J88408P68852N34592M56619J312561J238060
$$ 398955574 400025368 401575356 402231827 402420235 403189087 403723679 404180298 405492859 406730919
3509.4D06730919O62651J038856J10894N6686J030579J123085J066169Q07305J167755
$$ 406730919 407393570 408432426 408543320 408600006 409630585 410753670 411819839 412627144 413794899
3518D13794899P54318J76506R44062J601142J095696L17078Q30116R11789Q85010O18629
$$ 413794899 414549217 414725723 415669785 417270927 418366623 418683701 419513817 420425606 421310616 421929245
3527.7D21929245P39784R56803N59196J177635J482277J202126Q82911J331253N84755
$$ 421929245 422669029 423625832 424185028 425362663 426844940 428047066 428929977 430261230 430845985
3536.4D30845985k06184J506844J491203J223755J421852J375313J031341P03545O51512
$$ 430845985 430639801 432146645 433637848 434861603 436283455 437658768 438690109 439393654 440045166
3545D40045166N51224J184692L43361J600761J916047J425514J531410o29845J016693
$$ 440045166 440596390 441781082 442124443 443725204 445641251 447066765 448598175 447968330 448985023
3553.7D48985023J104813J271515J966553R67102K305374J314468M18701R66797K536621
$$ 448985023 450089836 451361351 453327904 454295006 456600380 457914848 458333549 459300346 461836967
3562.4D61836967J743050L82729L522262K38648m46358P00874J12610L183632R98726
$$ 461836967 463580017 463962746 467485008 467723656 467277298 467978172 468090782 471274414 472273140
3571.1D72273140J078682K010307K067223J094971M63790J633530O98433K515717J933326
$$ 472273140 473351822 475362129 477429352 478524323 478988113 480621643 481320076 483835793 485769119
3579.7D85769119J095810K168656J537132J379242N17540L163185K104301o94122J853981
$$ 485769119 486864929 489033585 490570717 491949959 492467499 495630684 497734985 497040863 498894844
3588.4D98894844m95567J851043K603074K724380J602860R18083K929878k63405J853562
$$ 498894844 498399277 500250320 502853394 505577774 507180634 508098717 511028595 510765190 512618752
3597.1E12618752K838897R81903L102761J695213R25331J683121J109619J892128L104095
$$ 512618752 515457649 516439552 519542313 521237526 522162857 523845978 524955597 526847725 529951820
3605.8E29951820J796036J26648M086990j136245j280556P251625K772636j800117
$$ 529951820 531747856 531874504 535961494 534825249 533544693 540796318 543568954 541768837
3613.5E41768837L340683N26466L440132L434792m08211J523018m96368Q57544K851638
$$ 541768837 545109520 545635986 549076118 552510910 552102699 553625717 553129349 553986893 556838531
3622.2E56838531L267823L230285K862320K626152K768441O829033P91358j0850753
$$ 556838531 560106354 563336639 566198959 568825111 571593552 578422585 579213943 568363190
3629.9E68363190L213539M936485N225716J360092o00052K620659L272743K158585
$$ 568363190 571576729 576513214 581738930 583099022 582498970 585119629 588392372 590550957
3637.6E90550957N5618K235336K772713K210732J126289R32236L470955L752365N389633
$$ 590550957 590606575 592841911 595614624 597825356 598951645 599883881 603354836 607107201 612496834
3646.3F12496834L92113j726571O067582R47227k983932k090798M655304M499016M010582
$$ 612496834 612888947 611162376 617229958 618177185 615193253 613102455 617757759 622256775 626267357
3655F26267357M675445o383628J733017M864349J821251J557655O16684K324715P54928
$$ 626267357 630942802 624559174 626292191 631156540 632977791 634535446 635152130 637476845 638231773
3663.6F38231773J159821K098732J360321M096222K682419M84924p91473n936890K710876
$$ 638231773 639391594 641490326 642850647 646946869 649629288 650114212 649322739 643385849 646096725
3672.3F46096725Q088990Q154220k354583j4255753L260651P000732L660126k163773
$$ 646096725 654185715 662339935 659985352 645729599 648990250 655990982 659651108 657487335
3680F57487335O34308K610779J842651J302185P46079J016235L994904N792312j0180511
$$ 657487335 658121643 660732422 662575073 663877258 664623337 665639572 669634476 675426788 665246277
3688.7F65246277k715912R543991m326248j198807M039459N93491J221085l51334j90964
$$ 665246277 662530365 672074356 667748108 666549301 670588760 671182251 672403336 672052002 671861038
3697.4F71861038J515198Q32825K594909L361359m030380l174057L516998J359100
$$ 671861038 673376236 674209061 676803970 680165329 676134949 672960892 676477890 677836990
3705.1F77836990N20783J140671K932357L787308n884933M053268M695129j2514343
$$ 677836990 678357773 679498444 682430801 686218109 680333176 684386444 689081573 676567230
3712.8F76567230K667465L391877j61896N64880K118073J051559k844467J288529M995574
$$ 676567230 679234695 682626572 682464676 683029556 685147629 686199188 683354721 684643250 689638824
3721.5F89638824l900680l564987O476669K117920k287598l875808R19876L841476
$$ 689638824 685738144 682173157 688649826 690767746 688480148 684604340 685524216 689365692
3729.2F89365692K38953N086670j624756o503449Q081971J71890q736801k86179J613464
$$ 689365692 689604645 694691315 693066559 686563110 694645081 694816971 686080170 685793991 687407455
3737.9F87407455N01404K495880K396546l527146M281159J2396011j0174789j5993881
$$ 687407455 687908859 690404739 692801285 689274139 693555298 705951309 695776520 679782639
3745.6F79782639R981689N096970M709091l340683q511276J0332565n823517o550674
$$ 679782639 689764328 694861298 699570389 696229706 687718430 698050995 692227478 685676804
3753.3F85676804N436401L601913K630768n001526K201691N300217p177658j659928
$$ 685676804 691113205 694715118 697345886 692344360 694546051 699846268 692668610 691008682
3761F91008682L666992J279908L29666L014908j558838m305191K050247M453049K03933
$$ 691008682 694675674 695955582 696285248 699300156 697741318 693436127 695486374 699939423 700143356
3769.7G00143356q825836J622009L174591L50419P41043n40390R71145J161576L552017
$$ 700143356 691317520 692939529 696114120 696464539 697205582 696665192 697636337 698797913 702349930
3778.4G02349930J74560q511886J720352K074661J298676K874374k559051j250534
$$ 702349930 702524490 694012604 695732956 697807617 699106293 701980667 699421616 698171082
3786.1F98171082Q19091L27988N71518n81512m04130l07769P21588O50253J725617
$$ 698171082 698990173 699318161 699889679 699308167 698904037 698596268 699317856 699968109 701693726
3794.8G01693726L540725l790359m327088K085267L988723N490036p087326r333648
$$ 701693726 705234451 701444092 697117004 699202271 703190994 708681030 701593704 692260056
3802.5F92260056M085464K674789M696808M908524r607468l770447M012146J265030
$$ 692260056 696345520 699020309 703717117 708625641 699018173 695247726 699259872 700524902
3810.2G00524902N68085N40390l70026R25675N517425r2926j2736358M240036N599212
$$ 700524902 701092987 701633377 701263351 702189026 707706451 707613525 694877167 699117203 704716415
3818.9G04716415M625931J431046j6713333J331405M723358J965638J613769r10110
$$ 704716415 709342346 710773392 694060059 695391464 700114822 702080460 703694229 702784119
3826.6G02784119k501297L49121J624603K741852J298218o397171K463226O806030
$$ 702784119 700282822 700631943 702256546 704998398 706296616 699899445 702362671 709168701
3834.3G09168701n811462j246491P636566q560104m802856O639099l978577M54865
$$ 709168701 703357239 702110748 709747314 701187210 696384354 703023453 699044876 699499741
3842.1F99499741N871200k928161l781205K756348J515961M51507K117539o95801J938248
$$ 699499741 705370941 702442780 698661575 701417923 702933884 703385391 705502930 704807129 706745377
3850.7G06745377N405273m428635o92367j5373764K100296R930420j13755j751632
$$ 706745377 712150650 707722015 707029648 691655884 693756180 703686600 703572845 701821213
3858.4G01821213J428985K190857K493668m884033q98743N003128n562897m807663
$$ 701821213 703250198 705441055 707934723 703050690 702151947 707155075 701592178 696784515
3866.2F96784515L646393M488449N517121p310486q218002M371871N813141L022919
$$ 696784515 700430908 704919357 710436478 703125992 694907990 699279861 705093002 708115921
3873.9G08115921q838348M66003L069611p52945K327041M329300n008850p113190N683823
$$ 708115921 699277573 699743576 702813187 702060242 704387283 708716583 703707733 696594543 702278366
3882.6G02278366K611466J429672L049621j1957245J134034L610916R68780L894730
$$ 702278366 704889832 706319504 709369125 697411880 698545914 702156830 703125610 707020340
3890.3G07020340j316757o262589J362763K619247j026230P52335N22385J187438O93207
$$ 707020340 705703583 699440994 700803757 703423004 702396774 703149109 703671494 704858932 705552139
3898.9G05552139p415161M366226J051407m317932M604416k161179j236877L83530
$$ 705552139 698136978 702503204 703554611 699236679 703841095 701679916 700443039 700826569
3906.7G00826569O0653J543503J57776J61056m1503L12271m46549l48968J550522J224517
$$ 700826569 700887222 702430725 702588501 702749557 702708054 703020325 702573776 702224808 703775330 704999847
3916.3G04999847k740783k470246K952729l97110k825623K078552J400452O20041j473770
$$ 704999847 702259064 699788818 702741547 702344437 699518814 701597366 702997818 703617859 702144089
3925G02144089k550049P65076P80868Q65326k79312K07672J855774k452393j227340
$$ 702144089 699594040 700359116 701139984 702005310 701725998 701933670 703789444 701337051 700109711
3933.7G00109711J168441l37295N60837P44705k16217o08750k52990J637497J168747
$$ 700109711 701278152 700940857 701501694 702246399 702030182 701421432 701168442 702805939 703974686
3942.3G03974686l631363j456833J240921J195755J903000j382523O64444J221771
$$ 703974686 700343323 698886490 700127411 701323166 703226166 701843643 702508087 703729858
3950.1G03729858l188400J79825P2937n05066O15463k51693l15400m07714N99517J70136
$$ 703729858 700541458 700721283 700794220 700289154 700904617 700652924 700337524 699929810 700529327 700699463
3959.7G00699463Q57391R02405o26450R0638l78876l83835m21677l97033L57742J38321
$$ 700699463 701556854 702459259 701832809 701923447 701544571 701160736 700739059 700342026 700699768 700838089
3969.3G00838089l64456q8577M37927N74798N47028j145630m10843J044388j39694
$$ 700838089 700473633 700385056 700822983 701397781 701944809 700799179 700388336 701432724 701293030
3978G01293030m47998o89621J8310M19007J91421K10114k80381o54449n92346L73764
$$ 701293030 700845032 700155411 700173721 700592728 700784149 700994263 700713882 700059433 699467087 699840851
3987.7F99840851P08313P52106k27585l54157L50342j98441O93284M1580n50919K88849
$$ 699840851 700549164 701301270 701073685 700719528 701069870 700871429 701564713 701606293 701055374 701344223
3997.3G01344223K34833K63366p16629
$$ 701344223 701579056 701842422 701125793
4000.2G01125793
$$ 701125793
##END=$$ End of the data block
