##TITLE=$$ Begin of the data block
##JCAMP-DX=5.00 $$ ACD/SpecManager v 10.08
##SPECTROMETER/DATA SYSTEM=Varian
##DATE=07 Jan 2013 17:15:42
##DATA TYPE=INFRARED SPECTRUM
##DATA CLASS=XYDATA
##ORIGIN=
##OWNER=
##NPOINTS=3735
##FIRSTX=399.26403809
##LASTX=4000.35498047
##MAXX=4000.35498047
##MINX=399.26403809
##MAXY=74.50225830
##MINY=35.89073181
##XFACTOR=1.0000000000
##YFACTOR=0.000000100000000
##FIRSTY=52.31088638
##DELTAX=0.96440572
##XUNITS=1/CM
##YUNITS=TRANSMITTANCE
##XYDATA=(X++(Y..Y))
399.3E23108864Q790932k933274k372932L301315N115433K097626K861099p793732
407E32175331p916031l559990o23970N495873j104584p93190p47299k920418m10423
415.7E19595299N597572O974945m303017q893241L256454P828102L95317n28564L101082
424.3E33023949j291542N62133n206565j521187M085006N25628k159119k212906j35765
433E25669632k943611J10626l379097l300629N620079M433480M609871L461532Q60214
441.7E35142097n132789l401528l308067k813377O047134K478027j158599n83077l41720
450.4E26928101R74617P35817J41449P3165K840348l519974l917007L857688m17327
459.1E27696877l301735l885231M481773M286575l24592l016854m162292k084313k337188
$$ y = [523108864, 531899796, 528966522, 526593590, 529894905, 535010338, 537107964, 539969063, 532175331, 524259300, 520699310, 520075340, 525571213, 524466629, 523673439, 522926140, 520005722, 519595299, 525192871, 532167816, 527864799, 518971558, 522228012, 530056114, 530451431, 529922867, 533023949, 531732407, 532294540, 527087975, 525566788, 529651794, 530177422, 528018303, 525805397, 525669632, 522726021, 522836647, 519457550, 516156921, 521777000, 526210480, 530820351, 534281883, 535142097, 530009308, 526607780, 523299713, 520486336, 526533470, 529011497, 527852898, 527269821, 526928101, 527902718, 528638535, 528779984, 528853149, 531693497, 528173523, 524256516, 528114204, 527696877, 524395142, 520509911, 524991684, 529278259, 528953667, 525936813, 521774521, 519690208, 517353020]
467.7E17353020K583923k374000l019562P494926N529595o689492o001701j190491
475.5E13686218J241150L813400K664643m431992k205124J891098m10461J72729K80915
484.1E16702576J334800L265152l61747k226372k459717j097412R4986k96288K961617
492.8E17917595Q38928j063385l96271j159744k538223l078308r1400o295n86242m67720
502.5E09368935K730751K997131j564026j152229j240082l00865j59035k002907q54835
511.1E07822838M46396L513832K406730k540702m000130j08032L697052j02806m060288
519.8E07074890l826370L17345Q30535j268081k65961L37334l12805m28772r6817l05787
529.5E02055511n75675k16485L69492o2523R1705P43866p20977K9792J429673p43370
$$ y = [517353020, 519936943, 517562943, 514543381, 522038307, 527567902, 520878410, 514876709, 513686218, 514927368, 518740768, 521405411, 516973419, 514768295, 516659393, 516248932, 516421661, 516702576, 518037376, 521302528, 520940781, 518714409, 516254692, 515157280, 515252266, 514955978, 517917595, 518756523, 517693138, 517296867, 516137123, 513598900, 510520592, 510429192, 510422897, 509836655, 509368935, 512099686, 515096817, 513532791, 512380562, 511140480, 510839615, 510680580, 508677673, 507822838, 508269234, 511783066, 514189796, 511649094, 507648964, 507540932, 511237984, 511135178, 507074890, 503248520, 503565865, 504396400, 503128319, 502862358, 503199692, 502886887, 502458115, 502361298, 502055511, 501479836, 501263351, 501632843, 501570320, 501662025, 502405891, 501684914, 501714706, 503144379, 502401009]
539.1E02401009k879830j867180k40860R2278J036835P91168R8648j92757N65224L64609
548.7E00169144k623329j714516P2517q3618k09236l94859M4441j181183n02701R28269
558.4D94504929k73781O9237J55830m88510n0240j100502j012039J350403J779327
567.1D94934654J397171J468926P48710j105079l164521j823883n03501k21978P94564
575.8D92525063O1035K45704J044007R36813J031303k61116p94525q11691q60481m67224
585.4D92648888m76876J275063K005463M90379M23164M81835j51978l69720J97067
594.1D96523285P6866j189575n98030J170120J169090q4037K25906L31497q19130K73285
603.7D97079277k62871k200584o22864N2872P6179J83640r27887P7171L92494K88544
$$ y = [502401009, 499521179, 497653999, 497413139, 497505417, 498542252, 499333420, 499432068, 499239311, 499804535, 500169144, 497545815, 495831299, 495903816, 495820198, 495610962, 495216103, 495260544, 494079361, 493576660, 494504929, 494231148, 494300385, 494456215, 493967705, 493917465, 492816963, 491804924, 493155327, 494934654, 496331825, 497800751, 498549461, 497444382, 494279861, 492455978, 491952477, 491730499, 492525063, 492586098, 492831802, 493875809, 494812622, 495843925, 495582809, 494788284, 493976593, 493116112, 492648888, 492172012, 493447075, 495452538, 495942917, 496366081, 496847916, 496695938, 496326218, 496523285, 496600151, 495410576, 494812546, 495982666, 497151756, 497067719, 497293625, 497625122, 496805992, 497079277, 496816406, 494615822, 493992958, 494045830, 494122009, 494305649, 493377762, 493454933, 493847427, 494135971]
613.4D94135971J135101m92324q32978k38342p21893k60392J80855J018906P01790
622D94626694L18908O71044N21354R50966J91803K12555J816597J169739Q87375J262054
631.7E02629089j54609Q94165J916160L16506L64418J514015K758751J397209n00488
640.4E11135216N47714R19456J268731J327400K81105j43166J4534J162072J350708
649E17863770P18612J321984J599502O61812l35388k46086K27928k73438j425209j264992
658.7E18848495Q21000R07631J7242P58324N67894q67348j154556k47345j162682l332748
668.3E15155907L607139K030793Q18443J410141J268501Q69675J241531j91307j44691
677E26066132L12957o13021P59849J153984N14488J928101K974091J690597P85446
$$ y = [494135971, 495271072, 494778748, 493945770, 493707428, 492985535, 492725143, 492905998, 493924904, 494626694, 494945602, 495616646, 496138000, 497088966, 497280769, 497493324, 499309921, 500479660, 501367035, 502629089, 502474480, 503368645, 505284805, 505601311, 505965729, 507479744, 510238495, 511635704, 511135216, 511682930, 512602386, 513871117, 515198517, 515479622, 515336456, 515350990, 516513062, 517863770, 518582382, 519904366, 521503868, 522165680, 521830292, 521584206, 521812134, 521538696, 520113487, 518848495, 519669495, 520577126, 520594368, 521352692, 521920586, 521053238, 519898682, 519651337, 518488655, 515155907, 518763046, 520793839, 521612282, 523022423, 524290924, 525160599, 526402130, 526210823, 526066132, 526379089, 525766068, 526525917, 527679901, 528194389, 530122490, 533096581, 534787178, 535572624]
685.7E35572624J192894L37715J641m67453j202355l33442J134033J763687N60074
694.4E38559418Q79936J497765M9438j27525L43208M6043k06070n00183K19231J778641
704E42539902J019783J167068J949959K28729R34296O71120j539765j064148k09541
712.7E45697403P61795J220894M55398R61113K115250J117249n3177N2452k01798m45595
722.3E51680984m01153L63121Q72116J494637J570549J082687J970406J603355m6730
731E60189972p95555n53665o39878K48223J234550K63786J098137J373330L46450P09229
740.7E63474579O60858M3068j68266J80587Q2398J74980L0022O29387J584282J135330
750.3E67827225R85756K3040o26983J94626J077308L83454n08499P84645J829109K018814
$$ y = [535572624, 536765518, 537103233, 537104874, 536637421, 535435066, 535101624, 536235657, 537999344, 538559418, 539439354, 540937119, 540986557, 540859032, 541202240, 541248283, 541042213, 540542030, 540761261, 542539902, 543559685, 544726753, 546676712, 546905441, 547839737, 548510857, 546971092, 545906944, 545697403, 546459198, 547680092, 548135490, 549096603, 551211853, 552329102, 552275925, 552328377, 552126579, 551680984, 551279831, 551642952, 552515068, 554009705, 555580254, 556662941, 558633347, 560236702, 560189972, 559394417, 558840752, 558200874, 558449097, 559683647, 559947433, 561045570, 562418900, 562765350, 563474579, 564135437, 564178505, 564010239, 564190826, 564273224, 564448204, 564478226, 565107613, 566691895, 567827225, 568812981, 568836021, 568209038, 568403664, 569480972, 569864426, 569355927, 570140572, 571969681, 573988495]
760E73988495J314392N39665n1498j5259R55734P24335l31497o09246J371041J640701
769.6E79526863O46668K65388o10161l14407q43315J15738N87845q70400j56326Q65898
779.2E79213791J011581O83098P12814R7771r9373j79023p06635k51732L09258Q96454
788.9E81688004K17590M89883P37419M48456k50168j256675m21563j362113o27480
797.6E79663353j97716l62129J050224m89387n14412r956q35991j801949j579933j228409
807.2E73693695k461548j626167l66249L71170k2926o06270p71256q97941j2207n49050
816.9E66751251j659431k052918n53207M30679J058197K561646J954422J610222J416092
825.5E71516953J303825L96385j77345J032677R05532J830941K760124K934608L029022
$$ y = [573988495, 575302887, 575842552, 575791054, 575775795, 576731529, 577455864, 577124367, 576515121, 577886162, 579526863, 580173531, 580438919, 579828758, 579514351, 578671036, 578786774, 579374619, 578504219, 578347893, 579213791, 580225372, 580908470, 581621284, 581719055, 581619682, 581440659, 580734024, 580482292, 580791550, 581688004, 581905594, 582395477, 583132896, 583581352, 583331184, 582074509, 581652946, 580290833, 579663353, 579465637, 579103508, 580153732, 579664345, 579149933, 579139977, 578303986, 576502037, 574922104, 573693695, 571232147, 569605980, 569239731, 569610901, 569587975, 568981705, 568210449, 567312508, 567300301, 566751251, 565091820, 563038902, 562485695, 562916374, 563974571, 566536217, 568490639, 570100861, 571516953, 572820778, 573217163, 573039818, 574072495, 574978027, 576808968, 579569092, 582503700, 585532722]
834.2E85532722K491837K003937J862793J469612k36130l39775r2354Q41408J574211
842.9E95108261J941185K921410J417045R32312J583329J299095j009369q00247R98306
851.6F04391327q24356M29725K325707K281303K310448K714119K014618J91116M09889
860.3F16243896l6163l12652l77503M57726L70445J449M48494k60696J047401k5901
869.9F17556496q03070k006302l342285j853257k473144o76842O10695N92384L39012
878.6F07943687L24936Q49152q24509j04026o87523j550293j738434j572685L7193
887.3F02677498l81050L91693N42297N8136O7024K06109L51562k91252j17378n06096
896.9F02998543M3144L29132J73645j38435k07672Q30421K57568M34189O17829O71425
$$ y = [585532722, 588024559, 590028496, 591891289, 593360901, 593124771, 592784996, 592692642, 593534050, 595108261, 597049446, 599970856, 601387901, 602320213, 603903542, 605202637, 604193268, 603393021, 604391327, 603566971, 603996696, 606322403, 608603706, 610914154, 613628273, 615642891, 615834007, 616243896, 616207733, 615895081, 615517578, 615975304, 616345749, 616347198, 616795692, 616534996, 617582397, 617556496, 616753426, 614747124, 611404839, 609551582, 607078438, 606401596, 607012291, 607604675, 607943687, 608268623, 609117775, 608293266, 608189240, 607501717, 605951424, 604212990, 602640305, 602677498, 602296448, 602688141, 603230438, 603288574, 603355598, 603561707, 603913269, 603622017, 603504639, 602998543, 603041687, 603370819, 603544464, 603406029, 603198357, 604028778, 604286346, 604720535, 605338364, 606009789]
906.5F06009789J235313J437912O11229m25606N12695J30616M44488N20325j223297
915.2F09253464j678009j630440j852646j980133j315842j732368j728935j655388
922.9E95679703k295342k195968k365647k358474k464829k413902l284645l402024
930.7E74898872j848106o37817l32604n19409j67160q94432p67136o66656p45583K77481
940.3E68597450q06846r47724m10118j67465j06926o30455m0817l79181m21181M98581
949.9E65185318J73607j335678j495362r70764j086082m66042p97233j501694j941490
958.6E55764580j500855j070480j819191k061920k471199j982460j077767j034736
966.3E42745972j217194j338653j299630j020546j263923k423020k277832k139778
$$ y = [606009789, 607245102, 608683014, 609294243, 608868637, 609381332, 609511948, 609956436, 610476761, 609253464, 607575455, 605945015, 604092369, 602112236, 600796394, 599064026, 597335091, 595679703, 593384361, 591188393, 588822746, 586464272, 583999443, 581585541, 578300896, 574898872, 573050766, 572412949, 572080345, 571560936, 571393776, 570499344, 569732208, 569065552, 568319969, 568597450, 567790604, 566842880, 566432762, 566265297, 566158371, 565527916, 565487099, 565107918, 564686737, 565185318, 565358925, 564023247, 562527885, 561557121, 560471039, 560004997, 559207764, 557706070, 555764580, 554263725, 553193245, 551374054, 549312134, 546840935, 544858475, 543780708, 542745972, 541528778, 540190125, 538890495, 537869949, 536606026, 534183006, 531905174, 529765396]
974.1E29765396k216186j944466k241249k421456l104248l408165l524742l230590
981.8E07674294k905541l637009l490791k869377l190498l666726l593635l155785
989.5D81164932k493820k053223k481193l395157l026695k488137k525787k239494
997.2D60461426k263260k128334k378922k206955j371803j043167j231575j376495
1004.9D46460915k010765k874566j520385o91529q33168q36906r18999r67636j777840
1013.6D34029121j839561k108574j568871r80949j308670k204857l313331k170372
1021.3D18533936j653901j148223j144257j257248j221428j897621p31926n75485n21355
1030D08382492j317100q62847K97737l30047M30984j77231L71437J160279J104889
$$ y = [529765396, 527549210, 525604744, 523363495, 520942039, 517837791, 514429626, 510904884, 507674294, 504768753, 501131744, 497640953, 494771576, 491581078, 487914352, 484320717, 481164932, 478671112, 476617889, 474136696, 470741539, 467714844, 465226707, 462700920, 460461426, 458198166, 456069832, 453690910, 451483955, 450112152, 449068985, 447837410, 446460915, 444450150, 441575584, 440055199, 439363670, 438530502, 437693596, 436774597, 435806961, 434029121, 432189560, 430080986, 428512115, 427531166, 426222496, 424017639, 420704308, 418533936, 416880035, 415731812, 414587555, 413330307, 412108879, 410211258, 409479332, 408903847, 408382492, 407065392, 406202545, 406500282, 406170235, 406601219, 406423988, 406795425, 407955704, 409060593]
1038.7D09060593J184349J565780J924248K08931R4147Q1939O62194N28183o87104
1047.4D14623260o15348j475830j027985o33850k60277o53534j308594o67877l71170
1056D07608795j037674j804848N28679Q82492J043435J476020J604805L006363J541748
1064.7D14849815J469078J213952J240081J239968M77180J474953R75494P87316P97271
1073.4D24525108O20842j59416K25411O14395j9264M50210l01361J009369J414337
1082.1D28379631M63715l77350j18332J684914P04422J336479J328201J289558J405754
1090.7D36096992O70281J558685J055069J617356J232299Q80127J134224J117668J510544
1099.4D46873245L91655J384812J643257J060180J223031J123542Q63991L51639J408234
$$ y = [409060593, 410244942, 411810722, 413734970, 413943901, 414038048, 414119987, 414782181, 415310364, 414623260, 414007912, 412532082, 411504097, 410870247, 410609970, 409956436, 408647842, 407979965, 407608795, 406571121, 404766273, 405294952, 406177444, 407220879, 408696899, 410301704, 413308067, 414849815, 416318893, 417532845, 418772926, 420012894, 420490074, 421965027, 422940521, 423727837, 424525108, 425145950, 424986534, 425211945, 425826340, 425807076, 426257286, 425955925, 426965294, 428379631, 428843346, 428465996, 428347664, 430032578, 430737000, 432073479, 433401680, 434691238, 436096992, 436767273, 438325958, 439381027, 440998383, 442230682, 443110809, 444245033, 445362701, 446873245, 447264900, 448649712, 450292969, 451353149, 452576180, 453699722, 454563713, 454915352, 456323586]
1108.1D56323586R96208L73573N33142N33104O53992Q9340M21295Q72955J350365J109657
1117.7D63257217N51835Q4609o02798p77550m40254P36771P96280Q64334M14238J82190
1127.4D65066872Q88481L87802J183128J509438J440086J649094J819153K513618J687279
1136.1D78144951J558609K039528J432838Q39424O33469R27734R52568J006546J299591
1144.8D88835258J165543M58756Q0719K65693K7428J9455Q659l30047k68288K14004
1154.4D90477180J43929k89230L53012J61552p94792n48325l78837j135407j135368
1163.1D86853714K91748L58582M10347J862602J837806J657753J915970J718979K011147
1171.8D98918648J700210J401635J400604K087059K446899J788025K112427K091980
$$ y = [456323586, 457319794, 457693367, 458226509, 458759613, 459413605, 459502945, 459924240, 460797195, 462147560, 463257217, 463809052, 463893661, 463290863, 462513313, 462073059, 462809830, 463606110, 464470444, 464884682, 465066872, 465955353, 466343155, 467526283, 469035721, 470475807, 472124901, 473944054, 476457672, 478144951, 479703560, 481743088, 483175926, 484015350, 484648819, 485576553, 486529121, 487535667, 488835258, 490000801, 490459557, 490540276, 490805969, 490833397, 490852852, 490861511, 490531464, 490263176, 490477180, 490621109, 490331879, 490684891, 490846443, 490051651, 489503326, 489124489, 487989082, 486853714, 487145462, 487504044, 487914391, 489776993, 491614799, 493272552, 495188522, 496907501, 498918648, 500618858, 502020493, 503421097, 505508156, 507955055, 509743080, 511855507, 513947487]
1179.5E13947487J936989J783676J579933J333351O38161N29899N53170O56357L58543
1188.1E23317566L52631J218948J001892j5793k62451j602j02310j080437j883698
1196.8E22544746j381073m76417K2278o04363r00841k21824l2234m47350r44557q49228
1206.5E16709137r68361j172981p63016l05862l9330q812l1929O7406J11770k93846
1216.1E13304176p02171p02667o86875q66661p44438j99928k21329j09253L62892L79334
1225.8E09813080k24838q69408p99255q01201r87625j247254j310463m39644N11551
1234.4E03644943L55072q9493J08338K71377j85737j060333r38874m48112p44248n24063
1244.1E00388870M1924L7231j77498J82495O9886m9019K73399n11017r06067o61850
$$ y = [513947487, 515884476, 517668152, 519248085, 520581436, 521219597, 521749496, 522302666, 522959023, 523317566, 523670197, 524889145, 525891037, 525875244, 525612793, 525611191, 525508881, 524428444, 522544746, 521163673, 520687256, 520709534, 520105171, 519204330, 518982506, 518950272, 518502922, 517558365, 516709137, 515740776, 514567795, 513804779, 513498917, 513459587, 513450775, 513418846, 513486252, 513598022, 513304176, 512602005, 511899338, 511212463, 510345802, 509601364, 509401436, 509180107, 509070854, 509433746, 509813080, 509588242, 508718834, 507919579, 507118378, 506130753, 504883499, 503573036, 503133392, 503644943, 504000015, 503910522, 504018860, 504290237, 504104500, 503044167, 502105293, 501657181, 500912933, 500388870, 500430794, 500468025, 500290527, 500473022, 500542908, 500493889, 500767288, 500256271, 499350204, 498688354]
1253.7D98688354k88429J3390l99361j54457M78058O25153N44548K76069K17896O3324
1263.4E00064545k29378M1656J54076L89900J012841Q65783J123200J469345Q70094
1272E05762062M35677K50015J38206L84751Q03489J040154R61761Q27408P86629J290550
1281.7E12680702J631241J204910J104813Q37898K38991M20647J284179J361733R66377
1290.4E21731491J062546J034241J042518N58090P86858R76372n3597P9842L13187
1299E27531548L27453K39678N75256L49121j79558Q35076L89671j17951j42097j063499
1308.7E28744698j411400m30870N32112J17302J7242k51808k23961O1646J26228L37372
1318.3E27618561k87857L7765N67665O93627P14493O78100M64821O8512N34782K56539
$$ y = [498688354, 498399925, 498413315, 498013954, 497859497, 498337555, 498962708, 499507256, 499783325, 500001221, 500064545, 499835167, 499876823, 500030899, 500420799, 501433640, 502299423, 503422623, 504891968, 505762062, 506197739, 506447754, 506585960, 506970711, 507774200, 508814354, 509776115, 510603523, 511390152, 512680702, 514311943, 515516853, 516621666, 517459564, 517698555, 518119202, 519403381, 520765114, 521731491, 522794037, 523828278, 524870796, 525428886, 526215744, 527192116, 527138519, 527218361, 527531548, 527859001, 528098679, 528673935, 529023056, 528843498, 529678574, 530068245, 529950294, 529808197, 528744698, 527333298, 526902428, 527434540, 527551842, 527569084, 527317276, 527093315, 527154961, 527281189, 527618561, 527330704, 527368469, 527936134, 528629761, 529344254, 530022354, 530487175, 530555687, 531090469, 531347008]
1328E31347008J2436j77803k83432l15247q17871k79656R6627l9978j28975N21583
1337.6E29934692O13404j05210k79159k83776M57459L12500O83632J102562M63295
1346.3E32899399K94571J04179N17578J07689k403k99454o85539j62659l10936o0615
1355.9E32401810k48528J39198J73302L1204p5187n49240j19782j859360l91960L34206
1365.6E29835663l55148Q1062l56827o5422j21346l34281m39187k61573k77863q53157
1375.2E26851921j4152K708K17514j48430j81885N1461o38504p94793r87777q96607
1384.9E23461456p67097n38788j462212q07342j65749r19342r03053j011009l30773
1393.6E16556091j567650l433418j696510j157646q93174k685928j771316q27332j397781
$$ y = [531347008, 531359444, 531181641, 530898209, 530582962, 529765091, 529485435, 529582062, 529542084, 529413109, 529934692, 530548096, 530442886, 530163727, 529879951, 530337410, 530649910, 531333542, 532436104, 532899399, 533193970, 533298149, 533815727, 533923416, 533921013, 533621559, 532936020, 532773361, 532462425, 532401810, 532153282, 532292480, 532465782, 532496986, 532421799, 531872559, 531752777, 529893417, 529501457, 529835663, 529480515, 529561577, 529204750, 529139328, 529017982, 528683701, 528244514, 527982941, 527705078, 526851921, 526837769, 526840477, 527057991, 526909561, 526727676, 526779137, 526140633, 525345840, 524358063, 523461456, 522694359, 522155571, 520693359, 519886017, 519720268, 518800926, 517897873, 516886864, 516556091, 514988441, 511555023, 509858513, 508700867, 507807693, 505121765, 503350449, 502523117, 501125336]
1402.2E01125336r85985q59490j920814k360420j016846j236763j671486j330452j081505
1410.9D88661575o03790o97517m86145n10483l72009k79046r51538l64494k787094
1419.6D81609459o05354J123199N85175J075859k2126L53051N62591n8594P46651M29039
1429.2D85798950L11089L31993R09042J036797O83250J825447K290459R3651J16386
1437.9D93397064K127991J237831M27818M15650M70695J036415P91016J299477J314354
1446.6E02518311R71069k40212Q72918J742057M17328M91944M14733J210747J816025
1455.3E10214920K175026K48375j668053K558174J037140K020378J364212Q70476K018128
1464E20838776R1438J493378J792945J861153J802025K157555L202400K308311J304817
$$ y = [501125336, 500139351, 499279861, 497359047, 494998627, 493981781, 492745018, 491073532, 489743080, 488661575, 488057785, 487360268, 486874123, 486363640, 485991631, 485712585, 484761047, 484396553, 481609459, 481004105, 482127304, 482712479, 483788338, 483766212, 484119263, 484681854, 484623260, 485369911, 485798950, 486110039, 486442032, 487351074, 488387871, 489071121, 490896568, 493187027, 493280678, 493397064, 495525055, 496762886, 497190704, 497606354, 498077049, 499113464, 499904480, 501203957, 502518311, 503489380, 503249168, 504122086, 505864143, 506281471, 506773415, 507188148, 508398895, 510214920, 512389946, 512638321, 510970268, 513528442, 514565582, 516585960, 517950172, 518820648, 520838776, 520930214, 522423592, 524216537, 526077690, 527879715, 530037270, 533239670, 535547981, 536852798]
1472.6E36852798P33719K655487K818261J227569J257477K076035K129364J945877
1480.3E51696587K001724J264801J019668Q15011M40177J144639Q29544N01289J938515
1489E61651955O24084j241073J09596M53033o28700q16231K49977l359680k95677l56064
1498.7E56391220k010422J35956p64503r27811p52373N36042P67555l336144l486213
1507.3E46553307l85781J083985o73523O84547m72412k151070J70517K480J84631j799736
1517E43196945l121948J275063J592025k29721j876640n73540J375008K286949l49121
1525.7E43575020M768Q44078o81534k02102N51185Q89626J255112J446876k180824
1534.3E45502205M46625J575660J440812K167472p79266k485733J306000O13556o40946
$$ y = [536852798, 537586517, 540242004, 543060265, 544287834, 545545311, 547621346, 549750710, 551696587, 553698311, 554963112, 555982780, 556797791, 557237968, 558382607, 559212151, 559713440, 561651955, 562276039, 561034966, 561144562, 561597595, 560968895, 560152664, 560402641, 557042961, 556747284, 556391220, 554380798, 554516754, 553752251, 552824440, 552072067, 552608109, 553375664, 550039520, 546553307, 546167526, 547251511, 546577988, 547262535, 546790123, 544639053, 544809570, 544812050, 544996681, 543196945, 540074997, 541350060, 542942085, 542712364, 540835724, 540262184, 541637192, 543924141, 543575020, 543579788, 544423866, 543742332, 543540230, 544091415, 544981041, 546236153, 547683029, 545502205, 545948830, 547524490, 548965302, 551132774, 550353508, 547867775, 549173775, 549787331, 549146385]
1543E49146385J188927R14688j177864J395302J017112J462746K27318k021675N62286
1551.7E52715225P06978J649361r61304j03836K288780K239113k360725q551827J734772
1560.4E49356537J522064R79614o76880p22351k397995j841735m6540q36067j23787
1569.1E45212860o030350j068878r36012k786293j893997j396675o21796j0773544
1576.8E19705315n04761j430473k617302k433358m347305k714958m343071k823563
1584.5D98490524l900413l452950l077774l948250k131271m077187k411308m040108
1592.2D71451263k700615l184242m409675k521973l956184j606141l554763j956520
1599.9D47561150k561722k645569j633720l477021j130714k887879j243743k855835
$$ y = [549146385, 550335312, 551250000, 550072136, 551467438, 552484550, 553947296, 554174614, 552152939, 552715225, 553422203, 555071564, 554110260, 554006424, 556295204, 558534317, 556173592, 547621765, 549356537, 550878601, 551858215, 551181335, 550458984, 548060989, 546219254, 546172714, 545336647, 545212860, 539182510, 538113632, 537177620, 534391327, 532497330, 531100655, 530478859, 519705315, 519200554, 517770081, 515152779, 512719421, 508372116, 505657158, 501314087, 498490524, 494590111, 491137161, 488059387, 484111137, 481979866, 477902679, 475491371, 471451263, 468750648, 465566406, 461156731, 458634758, 454678574, 453072433, 449517670, 447561150, 444999428, 442353859, 440720139, 437243118, 436112404, 433224525, 431980782, 429124947]
1607.6D29124947j459771j077537k573204Q2474k362481m4517j312409O19927O09207
1616.3D21606636o015854J587181q91876N52635j083145J077461L2120k665100J584091
1625D15784149l26042J913223r45396n16319M30946P51495Q55866o8474K715568J858407
1634.6D22453423O71806k514267K213516J045685R73930K151146J77079K249412J74408
1643.3D29596138J760521K453499L06816J484032j428223K713852P63511K463685K998580
1652D43112411J007729l595695j410675L536109J205292J461754R17740J614914K000847
1660.7D49850426J504783J968346o48956K771606K034912K196160K536010K314835
1668.4D64528122J973305J064682M121322J133004L015022L868408J701546N25551
$$ y = [429124947, 427665176, 426587639, 424014435, 424096909, 421734428, 421689911, 420377502, 420997429, 421606636, 415590782, 417177963, 416286087, 416838722, 415755577, 416833038, 416865158, 414200058, 415784149, 415458107, 417371330, 416425934, 415909615, 416340561, 417092056, 417947922, 417879448, 420595016, 422453423, 423125229, 420610962, 422824478, 423870163, 424844093, 426995239, 427172318, 429421730, 429596138, 431356659, 433810158, 434116974, 435601006, 434172783, 436886635, 437650146, 440113831, 443112411, 444120140, 440524445, 439113770, 442649879, 443855171, 445316925, 446234665, 447849579, 449850426, 451355209, 453323555, 452674599, 455446205, 457481117, 459677277, 462213287, 464528122, 466501427, 467566109, 471687431, 472820435, 475835457, 479703865, 481405411, 481930962]
1676.1D81930962L056182M161873K730446L578186J767960L555679N371361L219719
1683.8E09372368J001739K93084N217247L807525K963028L666878K633934L598061
1691.5E32553864L576011M168854M777489M927520n9700L577805N386925N245781K410431
1700.2E66564980l330460O415977M864846M087105K969512K626267K052727J490440
1707.9E87741394L040390J808090Q01010J856842K414780L093414J258393Q67119L881149
1716.6F06762581L189010m251022N31502K318726J661109J466713P96013M59786J201973
1725.3F14136391J575927J620522J914482K302857m51241p88307L310051L574257k434693
1734F24760246n811157M385834M277077K518844L047180P54280j202163L580017K746162
$$ y = [481930962, 484987144, 489149017, 491879463, 495457649, 497225609, 500781288, 506152649, 509372368, 510374107, 510667191, 515884438, 519691963, 522654991, 526321869, 528955803, 532553864, 536129875, 540298729, 545076218, 550003738, 549944038, 553521843, 558908768, 564154549, 566564980, 563234520, 569650497, 574515343, 578602448, 581571960, 584198227, 586250954, 587741394, 590781784, 592589874, 593390884, 595247726, 597662506, 600755920, 602014313, 602881432, 606762581, 609951591, 605700569, 606232071, 608550797, 610211906, 611678619, 612474632, 612934418, 614136391, 615712318, 617332840, 619247322, 621550179, 621098938, 620310631, 623620682, 627194939, 624760246, 618949089, 623334923, 627612000, 630130844, 633178024, 633932304, 632730141, 636310158, 639056320]
1742.7F39056320k4719P68509K739639K866745K888413K854995J898575M125061J862488
1751.3F59036026J19781L495713J915207J760635K513504L51868J935119K776413K602997
1760F76507263M128494O74744l30276K655334J113205O01578J352463J549606j767807
1768.7F86484604J975632M816360J800079j296463j420517L547287K094422j132736
1776.4F96868668R01794L77884J244125N80979k32773J429825K107086J945572J57776
1785.1G05380936M11834Q23059j00097j60370J307526O90307L80554p37381l4637L728943
1794.7G11690674J823654j63422N31311J135941j66626j723175J037674o30264Q24813
1803.4G14360580K591629J486207J187744P29141M43954L94135O74057j822968l99322
$$ y = [639056320, 639031601, 639800110, 642539749, 645406494, 648294907, 651149902, 653048477, 657173538, 659036026, 659155807, 662651520, 664566727, 666327362, 668840866, 669192734, 671127853, 673904266, 676507263, 680635757, 681310501, 680980225, 683635559, 684748764, 685350342, 686702805, 688252411, 686484604, 688460236, 693276596, 695076675, 693780212, 692359695, 695906982, 698001404, 696868668, 697770462, 698148346, 699392471, 699973450, 699740677, 701170502, 703277588, 705223160, 705380936, 705792770, 706615829, 706515732, 706355362, 707662888, 708353195, 708733749, 707996368, 707961731, 711690674, 713514328, 713350906, 713882217, 715018158, 714851532, 713128357, 714166031, 713535767, 714360580, 716952209, 718438416, 719626160, 720355301, 720799255, 721193390, 721867447, 720044479, 719645157]
1812.1G19645157N71899j24893J611862J040116J472854N22080J18332P67669J22147
1820.8G25747223N02167j083374K98156J017380j342087M48532K178727K812957M28009
1829.4G31007690l180389K94800J386795j56784j04523J221N65033P45926j08185J139068
1839.1G31590652O41251N84641L82843J382904R15222n130997J118012J968154L81852
1847.8G33834534j39313K45972R22775J68686N56488K3117J77765l70178n62058Q0795
1857.4G34938583l40042P44324Q31909R60694K87551L98713K07290m69208N09415j06735
1867.1G37962494Q68530m89654j774521N18112R79462Q22982J36185N57098R9030J29776
1876.7G39809494j48773j77765K26288m33274J73645n1574O34231N22309j01166j91727
$$ y = [719645157, 720217056, 720092163, 721704025, 722744141, 724216995, 724739075, 724857407, 725625076, 725747223, 726249390, 725166016, 725464172, 726481552, 725139465, 725587997, 727766724, 730579681, 731007690, 727827301, 728122101, 729508896, 729352112, 729247589, 729248810, 729813843, 730559769, 730451584, 731590652, 732231903, 732816544, 733199387, 734582291, 735497513, 730366516, 731484528, 733452682, 733834534, 733695221, 733941193, 734863968, 735032654, 735589142, 735612259, 735790024, 735419846, 734857788, 734938583, 734598541, 735342865, 736174774, 737135468, 737423019, 737821732, 738029022, 737559814, 738069229, 737962494, 738831024, 738341370, 736566849, 737084961, 738064423, 738887405, 739023590, 739580688, 739679718, 739809494, 739660721, 739482956, 739709244, 739275970, 739449615, 739398041, 740032272, 740554581, 740453415, 740261688]
1886.3G40261688l86886J240463K44064j507187J7166Q27179Q6594M80347P30133o09589
1896G41383972N46265Q6822l47061k50091j71585K77099k31247N25208J93252J26190
1905.6G42138824M45252L81622j24740m50058M196m59595L45841j21689K04467M71421
1915.3G42835541M38537J748505j224518j481857L47137K88620J90125q59146k27509
1923.9G42055435M87900N88455J30615K75574J4954o2409K1515l02658J50910n82810
1933.6G42777481j71432j28556j5106M39148j1063L99323J38321R16214k2736j585312
1943.2G42736282j68228n9814k43531m34722M71038M20533K07290K21253j02463m120
1952.9G43043518m53720j27640k76031j01853k29r4833K21710r2544M38156N35126
$$ y = [740261688, 739874802, 741115265, 741359329, 739852142, 739869308, 740696487, 740783081, 741263428, 741993561, 741383972, 741930237, 742017059, 741669998, 741419907, 741248322, 741525421, 741294174, 741819382, 742012634, 742138824, 742584076, 742965698, 742840958, 742390900, 742395096, 741935501, 742281342, 742159653, 742364120, 742835541, 743274078, 745022583, 743798065, 742316208, 742663345, 742951965, 743142090, 742282944, 742055435, 742543335, 743131790, 743262405, 743537979, 743552933, 743490524, 743512039, 743209381, 743360291, 742777481, 742606049, 742477493, 742462387, 742901535, 742890472, 743289795, 743428116, 744344330, 744321594, 742736282, 742568054, 742508240, 742264709, 741829987, 742301025, 742721558, 742928848, 743150101, 743047638, 743043518, 742589798, 742462158, 742186127, 742084274, 742084045, 741989212, 742210922, 742118378, 742556534, 743091660]
1962.5G43091660P3165n81970l78341j71204o20270j90506j11694L38058J60752K79464
1972.2G41889114O44837K56576k3117m97360l13797m23126l89099l92380j63727N55344
1981.8G41143265N77469M05044k060P5455Q4991j33133r30328q95386J06659j46179
1991.5G40285797n72204j79520P56454N88761L79104O7978k49252j27945r18808j60599
2001.1G39869766l31726m23508J54496j69220M52347K35977M01840J47858l95356n41381
2010.7G39401093o11802l16009o67343M1885L16620K89612K65884L14942M35180j39847
2020.4G39330215n6228o87332q31223q98666m72107R1553j76774L71323M83322R89762
2030G38143845N27649k36359o84967q70896l02124q88748n35965j06125L96119N48095
$$ y = [743091660, 743164825, 742582855, 742204514, 742033310, 741413040, 741222534, 741110840, 741448898, 741609650, 741889114, 742533951, 742790527, 742767410, 742270050, 741956253, 741533127, 741144028, 740751648, 740587921, 741143265, 741720734, 742125778, 742123718, 742199173, 742284164, 742151031, 741220703, 740325317, 740431976, 740285797, 739713593, 739534073, 740290527, 740879288, 741258392, 741326370, 741077118, 740949173, 740030365, 739869766, 739538040, 739114532, 739269028, 739099808, 739552155, 739788132, 740189972, 740337830, 739942474, 739401093, 738789291, 738473282, 737805939, 737847824, 738164444, 738454056, 738719940, 739034882, 739470062, 739330215, 739273987, 738586655, 737755432, 736856766, 736384659, 736476212, 736299438, 736670761, 737154083, 738143845, 738671494, 738435135, 737750168, 736879272, 736577148, 735688400, 735152435, 735046310, 735442429, 735990524]
2039.7G35990524M55094P83920J32294j48316j024933p57293p85141p67670J3580j05896
2049.3G33786163O96640K63749O94808R13773j61743n03006r10721j98364l92990l71628
2059G33816681p9117p9956L71170N01404N42602J26343J34964l88946n72968o91604
2068.6G33680573p14493m44947n12466N49545P27158J045380N97381j89209J52435
2077.3G34891357n09643r03778j318588o42243L1891J25809L63769M93469J060868
2086G33592911L92456o409l07464n73884j062011j282730l3951L38211J85776j1826
2095.6G31231079Q09097Q27866k33078l97415l94898J71814m12750r03778p71027j50070
2105.2G29776840O88629N13764N09338K2049j56402k54441l57437m98199o47049m43039
$$ y = [735990524, 736445618, 737229538, 737361832, 737213516, 736188583, 735431290, 734646149, 733878479, 733892059, 733786163, 734482803, 734746552, 735441360, 736355133, 736193390, 735690384, 734779663, 734581299, 734188309, 733816681, 733737564, 733657608, 734028778, 734530182, 735072784, 735199127, 735334091, 734945145, 734372177, 733680573, 732966080, 732521133, 732008667, 732558212, 733285370, 734330750, 734928131, 734738922, 734891357, 734381714, 733477936, 732159348, 731517105, 731548996, 731674805, 732038574, 732532043, 733592911, 733985367, 733978958, 733671494, 733097610, 732035599, 730752869, 730718918, 731057129, 731242905, 731231079, 732040176, 732868042, 732634964, 732237549, 731842651, 732014465, 731601715, 730697937, 729926910, 729776840, 730465469, 730979233, 731488571, 731510620, 731354218, 731099777, 730742340, 730244141, 729597092, 729154053]
2114.9G29154053l61100M27094M04053N09872M92935j01852k15912m1733J40991r46197
2124.5G29462204p45621k38571p8201N32608N87539M91486k08816P7056l9138l30201
2134.2G29510345j86767k85721j48621m16107M9591n6839L25318O31866J84708K12784
2143.8G29820557l62473m81949o82525q4839j9074j96991N69992O49262P53708j0453
2153.5G29955215r2010k47345m82483j36566m36020k78625j62888N98602M14963j4725
2163.1G29118118K32544K02942K64893l77503l58581m06952k91138l42941n8212P52410
2172.8G28735580M28467N62973j9760l32641q3848L3799l9597m37088J41449J71509
2182.4G29160843J97296J77612M50821L39966j59225J70135j35879k53830r26361m36326
$$ y = [729154053, 728792953, 729220047, 729624100, 730133972, 730626907, 730525055, 730309143, 730267410, 730408401, 729462204, 728716583, 728478012, 728399811, 728932419, 729519958, 730011444, 729802628, 729879684, 729840546, 729510345, 729323578, 729037857, 728889236, 728473129, 728522720, 728465881, 728791199, 729423065, 729607773, 729820557, 729458084, 728976135, 728293610, 728208771, 728189697, 727992706, 728562698, 729211960, 729965668, 729955215, 729863205, 729615860, 729133377, 728996811, 728560791, 728282166, 728119278, 728717880, 729132843, 729118118, 729350662, 729553604, 729818497, 729440994, 729082413, 728675461, 728384323, 728041382, 727983170, 728735580, 729164047, 729727020, 729707260, 729374619, 729290771, 729324570, 729284973, 728847885, 728989334, 729160843, 729358139, 729535751, 729986572, 730326538, 730167313, 730337448, 730201569, 729947739, 729021378, 728585052]
2192G28585052L93296N5847J09405J16425O49261J35956K55661L15857n60989m60281
2201.7G29595490l21198J58157j18408k8763J42365K44064M92172K20108K18811k37121
2211.3G30365677J7853m82331o11190L7231K6627M56466J54343L04489L47443K89383
2221G30905991r8420n50155l76587o80008l82P4540N5847K04696K25754L09220M1046
2231.6G30111542N38559P934m85458q08411m86374K15073k06070M3945K19422N22232
2241.2G29672394L97262M04053K31934o01807l97110m53186m85382j67313K57569r0485
2250.9G28767929K84042O47126k03934J84402L128M9134p7515n34973l39127k16980
2260.5G28563232J20621l60947L80707O92673m3564r6206j51291q4763l45688R995
$$ y = [728585052, 728978348, 729034195, 729143600, 729260025, 729909286, 730045242, 730300903, 730616760, 730055771, 729595490, 729274292, 729432449, 729314041, 729285278, 729427643, 729671707, 730163879, 730383987, 730602798, 730365677, 730383530, 729901199, 729290009, 729327240, 729353867, 729810333, 729964676, 730269165, 730616608, 730905991, 730807571, 730257416, 729880829, 729200821, 729200439, 729274979, 729330826, 729535522, 729761276, 730070496, 730111542, 730650101, 730658035, 730172577, 729364166, 728877792, 729092865, 728886795, 728930740, 729150162, 729672394, 730069656, 730473709, 730705643, 730103836, 729706726, 729253540, 728768158, 728600845, 728858414, 728767929, 729051971, 729699097, 729495163, 729679565, 729682693, 729731827, 729654312, 729119339, 728780212, 728563232, 728683853, 728322906, 728703613, 729396286, 729352722, 729256516, 729105225, 729020462, 728674774, 728684769]
2270.2G28684769r6894j62887j8006L2959K02027R3384K53067j77689J43433k95029
2279.8G28659134n23834m4861n21012j58996m9973L92914n0659J1978N60990j70899
2289.4G28104782J02997j73416j43128l33404j19629J17798k66571J55639m76989q4839
2299.1G26883240o8589J16501L03955n89447l18985n03540j29623l80707M6311R41925
2308.7G26301041L46374l58276l86048Q79899k16218n60531j59378l76892N31540J03225
2318.4G26104736l59192o05316O86798J87378q37784J1445l434O27900j18790l00369
2328G25393372p58286j64413N5465q89816K97623m11759J030503Q17489j289902j177368
2337.7G22902908l99856J030655M53567J07422l40195l19214k90298o3171l67279j212693
$$ y = [728684769, 728587875, 728424988, 728406982, 728439941, 728641968, 728735352, 728988419, 728810730, 728954163, 728659134, 728135300, 728090439, 727569427, 727410431, 727360458, 727753372, 727702713, 727714691, 728275681, 728104782, 728207779, 728034363, 727891235, 727557831, 727438202, 727556000, 727289429, 727445068, 726968079, 726883240, 726814651, 726931152, 727235107, 726645660, 726326675, 725823135, 725693512, 725312805, 725359116, 726301041, 726647415, 726289139, 725903091, 726782990, 726566772, 726006241, 725846863, 725469971, 726001511, 726104736, 725745544, 725140228, 725827026, 726014404, 725176620, 725188065, 725184631, 725812531, 725693741, 725393372, 724635086, 724470673, 724526138, 723636322, 723933945, 723522186, 724552689, 725370178, 724080276, 722902908, 722503052, 723533707, 723987274, 724094696, 723754501, 723435287, 723144989, 723081818, 722714539, 721501846]
2347.3G21501846N04914J288604M45099q13904N67399Q30764l12271O1798k084655
2356G21989594q17872L05024k15607j257324j168824J161499Q21229R86480K03705
2364.7G22007904R53293M00772o43692q65173j646576p84149k67563O73599K11334
2373.3G20039749J46179p63702j319962R9793j27030Q1330k19574j75324k060m70275
2383G17289124k31934l1815L50800k31552l13797k30332l62472l0365n77850n89753
2392.6G15040054l46222R0561J62812O7901l7384l73077R4757j28403l32489n66330
2402.3G13672180n97992k27966j35880j20697k36129M40750J65024N6152K38190o38657
2411.9G12614975q31680n03693j88522o42853o13861k3117M58526M75922o0577j2589
$$ y = [721501846, 722006760, 723295364, 723740463, 722926559, 723493958, 724324722, 724012451, 724074249, 721989594, 721171722, 721476746, 721261139, 720003815, 718834991, 719996490, 720817719, 721804199, 722007904, 722961197, 723361969, 722718277, 721853104, 720206528, 719422379, 719154816, 719828415, 720039749, 720185928, 719422226, 718102264, 718202057, 718075027, 718156357, 717936783, 717761459, 717759399, 717289124, 717057190, 717025375, 717376175, 717144623, 716830826, 716600494, 716238022, 716207657, 715629807, 715040054, 714693832, 714784393, 714947205, 715015106, 714977722, 714604645, 714699402, 714570999, 714238510, 713672180, 713074188, 712846222, 712710342, 712589645, 712353516, 712794266, 712959290, 713015442, 713253632, 712614975, 711783295, 711279602, 711091080, 710448227, 709834366, 709811249, 710269775, 710745697, 710685120, 710672531]
2421.6G10672531l22189l79563o77795q62808m59366l36456j06049j83639P7362J678
2431.2G07423706K34833K10953o39267n08271l49960m84009r37195n64727q4153j00174
2440.8G04201736L69339K80304R1629j93862l78876m41971m69742q41446r37652m425
2450.5G01675034R5901p2021j23139J61972J05896n54733l93677k63672l54004o71463
2460.1F99606094n14450l17001k91519N0430J00021K38495L9749k9068k61840o97174
2469.8F97923737j017151j107941o76575m22134J38550J07727J41067M85688L9672
2478.5F95612640l54766m65241n39551q59527p17850o81305q9722K56119l69873L5248
2488.1F91826172j31989k52990k16523n29403n38941n91736m41360o75659m64859k09656
$$ y = [710672531, 710350342, 709970779, 709292984, 708430176, 707970810, 707634354, 707528305, 707344666, 707422028, 707423706, 707658539, 707869492, 707230225, 706721954, 706371994, 705887985, 704950790, 704386063, 704301910, 704201736, 704571075, 704851379, 704943008, 704749146, 704370270, 703928299, 703458557, 702617111, 701679459, 701675034, 701770935, 701698914, 701575775, 701737747, 701843643, 701288910, 700895233, 700631561, 700277557, 699606094, 699091644, 698774643, 698483124, 698533554, 698633575, 698872070, 698911819, 698882751, 698620911, 697923737, 696906586, 695798645, 695122070, 694699936, 694838486, 694946213, 695087280, 695572968, 695612640, 695257874, 694792633, 694253082, 693393555, 692675705, 691994400, 691904678, 692160797, 691790924, 691826172, 691694183, 691441193, 691224670, 690695267, 690156326, 689564590, 689123230, 688447571, 687982712, 687773056]
2497.7F87773056J54953K86636r1705r9869l60031n16968j087722o77643l74680q73489
2507.4F84132538k50473j5106P5607q9035j00861j40075m22211l55377o47507l92532
2517F81794968j42212k38114n67779l75443p6675k43988J72958m4250l76511k89612
2526.7F79613342m21676j042862q59909j48545j23977J57776j35575J75781J21079
2535.4F77335434n48706l39203n53284m80652l32794j60064o46058n65338Q316j75323
2545F73542328K59781m23203n15365k19117m32052j98517p02362l80325q6670k54441
2554.6F70590057l80096n2109N09567j72348n31463m04816l60412m15421o41022p58819
2564.3F67383118l85361J81732L39966L7384l99475k30637m50821l70941l84140p12814
$$ y = [687773056, 687928009, 688214645, 688122940, 688023071, 687663040, 687146072, 686058350, 685380707, 685006027, 684132538, 683882065, 683866959, 683942566, 683853531, 683752670, 683612595, 683190384, 682835007, 682187500, 681794968, 681652756, 681414642, 680846863, 680471420, 680394745, 680150757, 680323715, 680279465, 679902954, 679613342, 679191666, 678148804, 677288895, 677140350, 677016373, 677174149, 677038574, 677214355, 677335434, 676786728, 676447525, 675894241, 675413589, 675080795, 674920731, 674274673, 673709335, 673717651, 673542328, 673802109, 673378906, 672863541, 672644424, 672212372, 672013855, 671311493, 670931168, 670844498, 670590057, 670209961, 670157852, 670667419, 670495071, 669963608, 669558792, 669198380, 668782959, 668141937, 667383118, 666997757, 667179489, 667519455, 667556839, 667157364, 666926727, 666475906, 666104965, 665720825, 665008011]
2573.9F65008011k39258k15149r4833k82669k25067j61515n42145j66549l7155k59323
2583.6F62784348r12095l62167J95465l57590k86026k03323J80435j29852n33829m80499
2593.2F59894867m90952l09982k52228k74200n63126k51541l91769k61383R4833j72501
2602.9F57022018k3727n31387n28183n09949n44128m07944j42670M21982m50211n75409
2612.5F53730392k78091k29721l66516n95398o4774n34973o75659m30450k87857l24555
2622.1F49942398n07584j89819l05939k29034n34744n13153j66703k79007j49917l50876
2631.8F46715622l31039j90583j44043j64108j55258n84564q32749m36935o32172l54080
2641.4F42890091j47247k54364l37296k54898j03989n42602k82288k39486l24707m41247
$$ y = [665008011, 664768753, 664553604, 664458771, 664176102, 663951035, 663789520, 663247375, 663080826, 663043671, 662784348, 661872253, 661510086, 661705551, 661347961, 661061935, 660858612, 661039047, 660909195, 660375366, 659894867, 659403915, 659093933, 658841705, 658567505, 658004379, 657752838, 657361069, 657099686, 657194519, 657022018, 656998291, 656466904, 655938721, 655428772, 654884644, 654476700, 654334030, 654756012, 654305801, 653730392, 653452301, 653222580, 652856064, 652260666, 652195892, 651660919, 650985260, 650554810, 650266953, 649942398, 649434814, 649244995, 648939056, 648710022, 648175278, 647662125, 647495422, 647216415, 647066498, 646715622, 646384583, 646194000, 646049957, 645885849, 645730591, 645146027, 644313278, 643876343, 643244171, 642890091, 642742844, 642488480, 642151184, 641896286, 641792297, 641249695, 640967407, 640727921, 640403214, 639961967]
2651.1F39961967p62443l72620j12381K6818j44539l14980m26941l11851k33078l99208
2660.7F36910744j98860k32239j39656m58565m39339j19552k16980p9422m03366k05918
2670.4F34416847j85737m68903j75705j04675k59133l97300m7531o3820k93885j04103
2680F32316055o3019n47752n82695j87950o36177n28603j39427k2049p6637m14047
2689.6F29117699k82860l4180J8006m53949m57726l03574j49574q6212p94220k72789
2699.3F26300621L42674L0747l18413l67126j11619k57339m79279m80079n0621j54076
2708.9F24455490m02946k97585k11410j6327j33896J79214k88238r29909l63350j18942
2718.6F21872101j93939k40746n8098M5510j07460j36338J12076r499l29933l15551
$$ y = [639961967, 639199524, 638826904, 638714523, 638741341, 638596802, 638281822, 637854881, 637543030, 637309952, 636910744, 636711884, 636479645, 636339989, 635881424, 635442085, 635322533, 635105553, 635026131, 634622765, 634416847, 634231110, 633762207, 633586502, 633481827, 633222694, 632825394, 632777863, 632714043, 632420158, 632316055, 632253036, 631705284, 631122589, 630934639, 630298462, 629769859, 629630432, 629608383, 629531746, 629117699, 628834839, 628800659, 628818665, 628364716, 627906990, 627603416, 627453842, 627367630, 626573410, 626300621, 626643295, 626674042, 626355629, 625988503, 625876884, 625619545, 625140266, 624660187, 624609566, 624455490, 624052544, 623754959, 623543549, 623527222, 623393326, 623572540, 623284302, 622354393, 621991043, 621872101, 621678162, 621437416, 621379318, 621424828, 621317368, 621181030, 621293106, 621283607, 620953674, 620638123]
2728.2F20638123n05982l88794l71322l05100k34985r9755J95580j83983k77328l99971
2737.9F18066483j81466j7395l5705O5193o29349l46565r4376k14920J78566J50261
2747.5F16940727j78108l63960p3738l27225m75388k33421j37596r3308j35650O0768
2757.2F14983101j09673l34396m23470q5907K3270j86844k86903n89790j21956j04905
2766.8F12762527j78604n1422k57873l90625m08478L04794Q3733k81372n42603r87358
2776.4F10052719m19655j47018k40860l01857L6468k85759m42619J97945j74752m20646
2786.1F07853966n69420l88908j46256m39529o38886p81135k98157K74315J77612m84161
2795.7F04559441n43671m47044l56980k31247p73010n36842o04248n80826o11n63087
$$ y = [620638123, 620132141, 619743347, 619372025, 619066925, 618831940, 618732185, 618927765, 618743782, 618466454, 618066483, 617885017, 617867622, 617831917, 617897110, 617267761, 616921196, 616826820, 616611900, 616790466, 616940727, 616762619, 616398659, 616324921, 615997696, 615522308, 615288887, 615151291, 615057983, 614922333, 614983101, 614873428, 614539032, 614115562, 614029655, 614052925, 613866081, 613579178, 612989388, 612867432, 612762527, 612583923, 612532501, 612274628, 611884003, 611475525, 611780319, 611864052, 611582680, 611040077, 610052719, 609633064, 609486046, 609245186, 608943329, 608979797, 608694038, 608251419, 608449364, 608274612, 607853966, 607284546, 606895638, 606749382, 606309853, 605670967, 604889832, 604591675, 604865990, 605043602, 604559441, 604015770, 603568726, 603211746, 602980499, 602207489, 601670647, 601066399, 600485573, 600484962, 599921875]
2805.4E99921875p24983j35079l16238o76842j83143l74718q46520o28547n84336m80041
2815E94971428l74565k98615n35469n33867m43267p34559o89621l23410j35803n43289
2824.7E90358963p18765p11823k76565k81563r77593q19892o30494k30827m99725j026917
2834.3E84184799j007919q82492o97899j236420p14454o57616j244507r76829j348343
2843E75418320j411591j184425r20563j073036j656571k017555j739616j054611r35173
2851.7E63425179n98259q31986o43349j3122l03917J4000L64418m6806m80423n8670
2861.3E60827065J60484j62735o70433r20639m31595o49872o22520l64685k67830k90413
2870.9E56606827o09970l88184p09305r67750o14853l19100j26609J27563k36702p30820
$$ y = [599921875, 599196892, 599061813, 598745575, 598068733, 597885590, 597510872, 596664352, 596035805, 595451469, 594971428, 594596863, 594298248, 593762779, 593228912, 592785645, 592051086, 591361465, 591038055, 590902252, 590358963, 589640198, 588928375, 588651810, 588370247, 587392654, 586572762, 585942268, 585711441, 585211716, 584184799, 583176880, 582294388, 581596489, 580360069, 579645615, 578987999, 577743492, 576766663, 575418320, 574006729, 572822304, 571901741, 570828705, 569172134, 567154579, 565414963, 564360352, 563425179, 562826920, 561994934, 561351585, 561338463, 561034546, 561048546, 561412964, 561366158, 560885735, 560827065, 560987549, 560824814, 560154381, 559233742, 558802147, 558152275, 557529755, 557165070, 556897240, 556606827, 555996857, 555608673, 554899368, 553931618, 553316765, 552997665, 552871056, 552998619, 552761917, 552031097]
2880.6E52031097l32412n63584p26700r12284p77092m17061o33240k27013q34083j105423
2890.2E45502205n95627j76239j80931j265564p59201q2207n87425j142883o49834
2898.9E40062294j39236q63266o24619k04353j46981o95190q44994j46675n86967r77745
2908.6E34832268j010170p93915p74956p12700o79550r85107q82263j335602j105004
2917.2E26553001p93800j059647j053505j069641p02743p78656n02167m20265p34100
2925.9E19438477P9841P62825O55899J16310l04336q5259L94783J8311m56734J03150
2935.6E20723267O91375N76897N12466R13277P73621L82385K00920L58162M79050M31518
2945.2E26042938O65245N24102P73582P00836n6763R9106P68853O89277j91726k32163
$$ y = [552031097, 551698685, 551135101, 550408401, 549496117, 548719025, 548301964, 547668724, 547441711, 546607628, 545502205, 544906578, 544730339, 544549408, 543283844, 542524643, 542442436, 541855011, 540712128, 540062294, 539923058, 539059792, 538435173, 538230820, 538083839, 537388649, 536543655, 536396980, 535810013, 534832268, 533822098, 533028183, 532253227, 531540527, 530860977, 529875870, 528993607, 527658005, 526553001, 525759201, 524699554, 523646049, 522576408, 521873665, 521095009, 520592842, 520172577, 519438477, 519518318, 520281143, 520937042, 521053352, 520749016, 520663757, 521058540, 521076851, 520620117, 520723267, 521414642, 521991539, 522504005, 523417282, 524190903, 524573288, 524774208, 525132370, 525611420, 526042938, 526708183, 527232285, 528005867, 528706703, 528649940, 528749046, 529517899, 530207176, 530015450, 529783287]
2954.8E29783287N45921P76673K060R9792O62613J90468N64461P25746N08117O21377
2964.5E34480515O10160N26390L5019K19689O65016P75642O67229O25305N49774O42281
2974.1E39797020Q40073N8097N3101L36075J80549N30472N59159k1668m00543J94893
2983.8E42127228L42254L09258N22003K48337j59569j69525N38521L36189k12860k09999
2993.4E43671837p7820l10516m35791K68325k04772m03367j6059k49520j27144k88200
3003.1E41826973m07524o61240p36046j65214J93443R0676j14785K823l2387n64041
3012.7E39432678j073112p02400l94669l77808m79431m54483j30577p34787p22580
3021.4E34362831k87475l45040n59730p23191j82876o46706r24492k92816j66588j99661
$$ y = [529783287, 530329208, 531105881, 531107941, 531207733, 531870346, 532060814, 532625275, 533351021, 533859138, 534480515, 535090675, 535617065, 535652084, 535871773, 536536789, 537312431, 537979660, 538604965, 539154739, 539797020, 540637093, 540695190, 540748291, 541084366, 541264915, 541795387, 542354546, 542332878, 541932335, 542127228, 542469482, 542778740, 543300743, 543549080, 543389511, 543219986, 543758507, 544094696, 543881836, 543671837, 543594017, 543283501, 542847710, 543116035, 542911263, 542507896, 542491837, 542242317, 542115173, 541826973, 541419449, 540758209, 540022163, 539856949, 540050392, 540141068, 540026283, 540029106, 539996719, 539432678, 538359566, 537657166, 537262497, 536884689, 536405258, 535950775, 535820198, 535085411, 534362831, 534075356, 533730316, 533170586, 532447395, 532264519, 531617813, 530693321, 530400505, 530233917, 530034256]
3031E30034256m18472m04854j87111m91905j219483r15298l37906m94461o28319o32515
3040.7E24303932o15043o62194k84652n42832o51932k65197l91083l12500r47647q41980
3050.3E18788872k07672l52898o48003o02340m58n49774r62754r68704q50410j74942
3060E13470917l25585n53474o91757n19142l97683j67923J31073p73964j224021o39725
3069.6E08308716l09448o13022n52483l97529n55993m46930K48719N67322p46842j166992
3079.2E04335518p74498o24161m61693n25703j53999k79160m31595q11729p49016k77634
3088.9D99246330n26352k91252n01404o41975p21741n19790l29361p05223N3100l05405
3098.5D94756927q09898j97792k98233o95953r11332p54699k80380n8861q85315p65801
$$ y = [530034256, 529615784, 529210930, 529023819, 528531914, 527312431, 526397133, 526059227, 525564766, 524936447, 524303932, 523688889, 523026695, 522742043, 522199211, 521547279, 521282082, 520890999, 520578499, 519630852, 518788872, 518581200, 518228302, 517580299, 516977959, 516977501, 516427727, 515464973, 514496269, 513645859, 513470917, 513145332, 512591858, 511900101, 511380959, 510983276, 510815353, 510946426, 510172462, 508948441, 508308716, 507999268, 507386246, 506833763, 506436234, 505880241, 505433311, 505682030, 506249352, 505502510, 504335518, 503561020, 502936859, 502475166, 501949463, 501795464, 501516304, 501084709, 500272980, 499523964, 499246330, 498719978, 498428726, 497927322, 497285347, 496563606, 496043816, 495714455, 495009232, 495062332, 494756927, 493947029, 493749237, 493451004, 492755051, 491843719, 491089020, 490808640, 490749779, 489864464, 489098663]
3108.2D89098663q5182k36587l74527r88007o63910l14293m98085m99344o64596j67732
3117.8D84606400p7820m52767q74176r69581q18863p82814m24919n66292p47185n37224
3127.5D78354759k88429n60989q50296k85988j41068m95109p30973p65304n65605m54522
3137.1D73216476m75502l53546o31828r37538n68314n16701o17446q83179q40721l33824
3146.8D67057877k75231k74887m10576l79371o34728o58760l48587q35304p76520m05884
3156.4D62058029p49016j457328r21097k7580m49181m78973o00205o97975k31400l62854
3166D56082420q77266j118125q64983o63605k57454l94058j047363n15976o5613j66931
3175.7D50111046l17459r54247j061973q66356q13942l98865o24046n86815j77498
$$ y = [489098663, 489013481, 488776894, 488402367, 487414360, 486750450, 486436157, 485938072, 485438728, 484774132, 484606400, 484528580, 484075813, 483201637, 482232056, 481413193, 480630379, 480205460, 479639168, 478891983, 478354759, 478066330, 477505341, 476655045, 476369057, 476227989, 475732880, 475001907, 474236603, 473670998, 473216476, 472740974, 472387428, 471755600, 470818062, 470249748, 469733047, 469115601, 468232422, 467391701, 467057877, 466782646, 466507759, 466097183, 465717812, 465083084, 464424324, 464075737, 463240433, 462463913, 462058029, 461309013, 459851685, 458930588, 458903008, 458453827, 457974854, 457374649, 456676674, 456445274, 456082420, 455205154, 454087029, 453222046, 452558441, 452300987, 451906929, 450859566, 450343590, 450277977, 450111046, 449793587, 448839340, 447777367, 446911011, 446097069, 445698204, 445074158, 444487343, 444309845]
3184.4D44309845o67114p06177l46260l91045o92405q85735p01561m86259o66466o74935
3194D38091888o5116m74091r05533n57442n08003m66385p19642l67318k06222o89278
3203.6D33132858p65762o09856L0976p1259l99246o48689j202622n64194J10245r6206
3213.3D28916245p03660r21516l58505o8474l93066q97294r84153m75502q5869l02887
3222.9D23725319p17239o39306k01110j92872m99992n33028m33692l76168j58310m59442
3232.6D19514160r94682m04053n83687q36334j01662l15399j86767k68402m00086j85471
3242.2D15237617n30090n59807r00879j26533K7885j010322m61922l06854n78957n59273
3251.9D10230865j42784J76278n23186o57997j76430l07694r91859n60379N3978k00081
$$ y = [444309845, 443642731, 442936554, 442590294, 442199249, 441506844, 440621109, 439919548, 439433289, 438766823, 438091888, 438026772, 437552681, 436647148, 436089706, 435581703, 435115318, 434395676, 434028358, 433822136, 433132858, 432367096, 431757240, 431788216, 431716957, 431317711, 430669022, 429466400, 428902206, 429012451, 428916245, 428212585, 427291069, 426932564, 426864090, 426471024, 425573730, 424589577, 424114075, 424028206, 423725319, 423008080, 422368774, 422167664, 421974792, 421474800, 420941772, 420508080, 420131912, 419973602, 419514160, 418519478, 418115425, 417531738, 416695404, 416593742, 416278343, 416091576, 415823174, 415423088, 415237617, 414707527, 414147720, 413246841, 413120308, 413148193, 412137871, 411675949, 411369095, 410790138, 410230865, 410088081, 410264359, 409741173, 409083176, 408906746, 408599052, 407607193, 407046814, 407100792, 406900711]
3261.5D06900711k82364n35927n94787n32418l36341j27907l24440j36986J10512m06151
3271.2D03733902q72574l03955l00255n14755l9063l69262k53144K71264k90375r21364
3280.8D00140419p36923j35269k26250m98314j14174m959j02196m37088n97992j8501
3290.4C97268753j17722k49710n9204r1705o0883o16378o64063j08566k98386p98797
3300.1C94203339o49109k54441k16255J33095M768n69458m93927j88636l35579l48931
3309.7C91284866j45530m26865r8801p6408k61574j82419p29332o90117p02323m49715
3319.4C87521782m36440m35447L05023k53487o54106p32231m23470j58691p81212o37092
3329C83314629n67131k78206n09339q27560l46146n34210k21138l10554j028214p86362
$$ y = [406900711, 406618347, 406082420, 405487633, 404955215, 404618874, 404490967, 404166527, 404029541, 404140053, 403733902, 402861328, 402557373, 402257118, 401742363, 401703300, 401334038, 401080894, 401352158, 401061783, 400140419, 399403496, 399268227, 399041977, 398543663, 398429489, 398424530, 398322334, 397885246, 397287254, 397268753, 397151031, 396901321, 396842117, 396750412, 396689529, 396073151, 395409088, 395300522, 395002136, 394203339, 393554230, 393299789, 393083534, 393216629, 393221397, 392651939, 392158012, 391969376, 391633797, 391284866, 391139336, 390712471, 390613670, 390537262, 390275688, 390093269, 389363937, 388673820, 387971497, 387521782, 387085342, 386649895, 386954918, 386701431, 386047325, 385315094, 384891624, 384732933, 383951721, 383314629, 382747498, 382469292, 381959953, 381132393, 380786247, 380252037, 380030899, 379720345, 378692131, 377905769]
3338.7C77905769j34353k08321o51817m51164m07334l58543l91274m83360n44395n94979
3348.3C73680229j82266j95046n05027o62117j70021m0093n13382o04706q44688j84479
3357.9C69778404K42462O4240l80936j072197j71356J00174l91808m06456l50074r2125
3367.6C67320328l87612k62794l67890l14941j45187j166153o23627J38283l13530
3376.3C63876877l01514k53334j70364o01578o94199J50719N21507L61138o0921k60353
3385.9C62567978l40119j16348R2774m34571l08265P1220j63307k48032k43034l3074
3395.6C60845222L7194l98674n19943l11165J01509J55525n26009l64685J89896m921
3405.2C59203949j83945N1842L58315N7373j49041j6632j28669j49079q4343N9624
$$ y = [377905769, 377771416, 377563095, 376911278, 376460114, 376052780, 375694237, 375302963, 374819603, 374275208, 373680229, 373497963, 373302917, 372797890, 372135773, 371965752, 371925659, 371412277, 370807571, 369962883, 369778404, 370020866, 370085106, 369704170, 368631973, 368460617, 368560791, 368168983, 367762527, 367412453, 367320328, 366932716, 366669922, 366302032, 365987091, 365841904, 364675751, 364052124, 364190407, 363876877, 363575363, 363322029, 363151665, 362550087, 361855888, 362006607, 362528114, 362889252, 362828331, 362567978, 362227859, 362111511, 362204285, 361769714, 361461449, 361532669, 361369362, 361121330, 360878296, 360845222, 360882416, 360483742, 359963799, 359652634, 359754143, 359909668, 359383659, 359018974, 359208870, 359203949, 359020004, 359071846, 359430161, 359487534, 359338493, 359321861, 359193192, 359044113, 358959770, 359019394]
3414.8C59019394l4332p7744K44980L60832P0877O8779L80631q4572m05884p8201N64346
3425.5C60029106Q69599N44586K41661k74964k24723l434M71192O77490J1787L87116
3435.1C62729416M88243O9046k84843m7303M32129L0213M80728O57692N42869L33939
3444.7C65432129L86009O40030o54373M66041J358414M13475Q5678O1760O51398M34227
3454.4C69274788N87578R03511N03845P26814N29938Q01582P34482j94015M15954J178322
3464C75462799O66466K46315J63116N06821P41997P09266R45626J37787K70080J131859
3473.7C80982132M72069K65922O29616J075211Q80508M10957N93186Q33702O77490
3482.3C86820793M30794J146278P11060L29437Q09059J64833M89922J097450Q99048
$$ y = [359019394, 358985062, 358907318, 359152298, 359513130, 359584007, 359652786, 360033417, 359948845, 359542961, 359464760, 360029106, 360898705, 361443291, 361684952, 361409988, 361185265, 361181831, 361653023, 362330513, 362342300, 362729416, 363217659, 363286705, 363001862, 362954559, 363386688, 363416901, 363897629, 364555321, 365098190, 365432129, 365818138, 366458168, 365803795, 366269836, 367628250, 368041725, 368127403, 368189163, 368840561, 369274788, 369862366, 370765877, 371269722, 371996536, 372526474, 373328056, 374062538, 373868523, 374284477, 375462799, 376129265, 376375580, 376538696, 377045517, 377787514, 378496780, 379442406, 379580193, 379850273, 380982132, 381454201, 381720123, 382349739, 383424950, 384305458, 384716415, 385309601, 386143303, 386820793, 387251587, 388397865, 389108925, 389438362, 390247421, 390412254, 390902176, 391999626, 392898674]
3491C92898674P17087O52656M86946P34864J124191Q74901J006965M86184k82479J07994
3500.7C98807983J429139J787185M01497j4686M37622R64508J123352J758117J147728
3509.4D07842445l02353J164437P69577Q8653Q13790J271248J679535O48002N92995
3518D14568329J043358N50003R50508J497421Q46138J08261L62549Q22449J097755
3526.7D21846771J77346N35240J158943R86938J256752J218300J513901R51843J410790
3535.4D31056824J201324J908J347465J324997P66182J115494J898765J274185O16875
3544.1D40604019Q91991M41818J039658M196J182518K080459J840783J257286j051331
3552.7D48291397J633377J362496J011886K359772J301117J784553J096573Q23136
$$ y = [392898674, 393615761, 394268417, 394755363, 395490227, 396614418, 397489319, 398496284, 398982468, 398699989, 398807983, 400237122, 402024307, 402425804, 402411118, 402848740, 403813248, 404936600, 406694717, 407842445, 407540092, 408704529, 409474106, 409562759, 410376549, 411647797, 413327332, 413975334, 414568329, 415611687, 416161690, 417112198, 418609619, 419455757, 419564018, 419926567, 420749016, 421846771, 422024117, 422559357, 423718300, 424705238, 425961990, 427180290, 428694191, 429646034, 431056824, 432258148, 432260056, 433607521, 434932518, 435698700, 436814194, 438712959, 439987144, 440604019, 441496010, 441937828, 442977486, 442981682, 444164200, 446244659, 448085442, 449342728, 448291397, 449924774, 451287270, 452299156, 454658928, 455960045, 457744598, 458841171, 459664307]
3560.5D59664307O84509J835442J688842O43196L526307N18302K45820J075363n41458
3569.1D69340630K904014J411362R98840J502114J674537J510086R60922J637230Q97675
3577.8D82837410K128906J908303J454429J805458J933594K211761M68636K646103
3585.5D97394600J557541n25093K445945n12580J879005K647362K574234J506271P71103
3594.2E09738388L243980m28810J612358L081551O39877L037644J356201J45035J714897
3602.9E24141121J561012K150078L608208K573662j020012K824401m64096o15577P089729
3611.6E41848526K437630j768189L321076R83314L693505M019241P19337J004868j831703
3620.3E54427605P53135M017868L139573K202644L040962K955704K802238N976868
$$ y = [459664307, 460348816, 462184258, 463873100, 464516296, 468042603, 468560905, 468806725, 469882088, 469340630, 472244644, 473656006, 474654846, 476156960, 477831497, 479341583, 480302505, 481939735, 482837410, 484966316, 486874619, 488329048, 490134506, 492068100, 494279861, 494748497, 497394600, 498952141, 498427048, 500872993, 500360413, 502239418, 504886780, 507461014, 508967285, 509738388, 512982368, 512553558, 514165916, 517247467, 517887344, 520924988, 522281189, 522426224, 524141121, 525702133, 527852211, 531460419, 534034081, 533014069, 535838470, 535374374, 534758797, 541848526, 544286156, 542517967, 545839043, 546822357, 550515862, 554535103, 555254440, 556259308, 554427605, 555180740, 559198608, 562338181, 564540825, 567581787, 570537491, 573339729, 579316597]
3628E79316597K5482q956184L235245M709434N642624J538277j484299K763100K943878
3636.6E89734154J964683J202698K127419K822990K582245J513290O81839K005730
3644.4F04635048L615608N695458j6327k075463M654236P8354k217789o87065N327797
3653F19009857M874153M358902M859047o901665J026955M565659J808815K019005R91745
3661.7F36612473K303733O93131J341591K331848J338730M452438K677689p2785j178894
3670.4F50499954o330337L704605Q747177R108200j313324j6430969K469482O163712
3678.1F56618500M141388j635361R3765K940521J639634J051483Q21838R42307M450378
3686.8F71064453O530686q716584l061065Q492202n502319j395493M560547P54547
$$ y = [579316597, 579342079, 570385895, 573621140, 578330574, 583973198, 585511475, 584027176, 586790276, 589734154, 591698837, 592901535, 595028954, 597851944, 600434189, 601947479, 602629318, 604635048, 608250656, 613946114, 613929787, 611854324, 616508560, 616586914, 614369125, 613682060, 619009857, 623884010, 628242912, 633101959, 626200294, 627227249, 631792908, 633601723, 635620728, 636612473, 638916206, 639609337, 640950928, 643282776, 644621506, 649073944, 651751633, 651678848, 650499954, 644169617, 647874222, 656621399, 665729599, 664416275, 647985306, 650454788, 656618500, 660759888, 659124527, 659218292, 662158813, 663798447, 664849930, 665671768, 666614075, 671064453, 677595139, 668878555, 665817490, 674309692, 668807373, 667411880, 671972427, 672726974]
3694.5F72726974J187516q1101N28183J525650L1510K586593K780533m942779k746659
3703.2F73596420L955841K339554L82538M35257L220291L619766o065216M409714M421082
3711.9F90315247j3498612K677307M200058R4300J86920K408752J714554k833710P99790
3720.5F86064606M805755l136825l526917M984284J221847j079864k436753P93457
3728.3F87689590L455201L64151M046783l208160m287110J0417939J937484j1744232
3736F88671646k216797L167877J030884J687927J682282l792496L722916J0900497
3743.7G04854736j0676422j3683319R707108N657501O385422k860642r223709J0709839
3751.4G00870514o328507p048568N398559L280411K108154n077743K427215M884568
$$ y = [672726974, 673914490, 673833389, 674361572, 675887222, 675918732, 678505325, 681285858, 676343079, 673596420, 677552261, 679891815, 680274353, 680709610, 683929901, 687549667, 681484451, 685894165, 690315247, 676816635, 679493942, 683694000, 683788300, 683975220, 686383972, 688098526, 685264816, 686064606, 690870361, 687733536, 684206619, 689190903, 690412750, 689332886, 686896133, 687689590, 691144791, 691508942, 695555725, 692347565, 688060455, 698478394, 700415878, 688671646, 686454849, 689622726, 690653610, 692341537, 694023819, 690231323, 693954239, 704854736, 694178314, 680494995, 690202103, 695859604, 702245026, 699384384, 690160675, 700870514, 694542007, 687493439, 692891998, 696172409, 698280563, 693202820, 695630035, 700514603]
3759.1G00514603p790375q00476M518280J016922J77612K782746k786637l818741L060761
3767.8F96874695M730835N62362p691192J385116K194825Q7280R28879j48087J424866
3776.5G00349579J005783K308426p07474p387772J969071K096634J099701K424927
3784.2G03158875k403718j478576R35821P13196O83823r1095j50528r00498J90583
3792.9G00657883N24215J287079L210373l731460l858719K525329L641205N178681
3800.6G09434586o467972r059372L596039K486267M996109M584274r617996k595520
3808.3F97356415M202804J013260L16239K08740m69742J636887N833816j548996j3391189
3817F95158234M982147O544571M832382J34506j7220001K126694N285873J783219J600952
$$ y = [700514603, 692724228, 691923752, 696442032, 697458954, 697636566, 700419312, 697632675, 693813934, 696874695, 701605530, 702167892, 694476700, 695861816, 698056641, 698143921, 699072800, 698924713, 700349579, 701355362, 703663788, 702956314, 695568542, 697537613, 699634247, 700733948, 703158875, 700755157, 699276581, 700212402, 700925598, 701609421, 701518326, 701367798, 700467300, 700657883, 701182098, 702469177, 705679550, 701948090, 698089371, 700614700, 704255905, 709434586, 702966614, 693907242, 697503281, 699989548, 704985657, 709569931, 699951935, 697356415, 701559219, 702572479, 702888718, 703097458, 702627716, 704264603, 710098419, 708549423, 695158234, 700140381, 706684952, 711517334, 711651840, 694431839, 696558533, 701844406, 703627625, 705228577]
3825.7G05228577o46210k634430M02603J370468K767563P41959p036972L281784P311630
3834.3G10786972m812622j351852O778106r074859m215012P673874m756699n7296O205368
3843G07175980k350922l599319K075424J678924K96250J349945J39694K785797M241486
3851.7G13793259n804139R98536j5681916J401673R762268j150894k211380K145691
3859.4G03253098K735824K436829l860092k24762M723358n952912m765853M383926
3867.1G02729416M695740N036468o877746q191758L226624N201797L242188q728790
3874.8G00333939J74636K995148m6387K954712L739853n762481o080399O453781K270279
3883.5G07033081R56574L628692j1816330P79953L461075L69034L654404r98459o920472
$$ y = [705228577, 704582367, 701947937, 702350540, 703721008, 706488571, 707230530, 700193558, 703475342, 710786972, 705974350, 704622498, 711400604, 702325745, 698110733, 705784607, 701027908, 700970612, 707175980, 704825058, 701225739, 703301163, 704980087, 705276337, 706626282, 706765976, 709551773, 713793259, 707989120, 708987656, 693305740, 694707413, 704469681, 703318787, 701107407, 703253098, 705988922, 708425751, 704565659, 704340897, 709064255, 703111343, 698345490, 702729416, 707425156, 712461624, 705583878, 697392120, 700618744, 705820541, 709062729, 700333939, 700508575, 703503723, 703457336, 706412048, 710151901, 704389420, 698309021, 704762802, 707033081, 707989655, 711618347, 699802017, 700581970, 704043045, 704412079, 708066483, 707068024, 700147552]
3892.2G00147552J266709K737884q29239J711503R62905J499100J278076q170700M259491
3900.9G04863281J512757m444733M686508j822662k229767r08890K18430J594238j57623
3909.6G03311539M19540j24054J47324k44675k41699J614380J687317j969605k408752
3918.2G02191315K304001j340409k434997K583694J518555J404953k175751l214416
3926G00836945J971969J561737P37305j750565q49914K700577k011414j677017J325302
3934.6G02844925N0354L01590r5978m99420k34222k25373J908646J341019m133454
3943.3G01258087j489639J165314J281204J712951j261138J282806M89731l097000
3951G01342316J040954O73065n9280k64511q55560K21634j95771M04053r384M78821
$$ y = [700147552, 701414261, 704152145, 703322906, 705034409, 705997314, 707496414, 708774490, 700603790, 704863281, 706376038, 701931305, 706617813, 704795151, 702565384, 701656494, 701874924, 703469162, 703311539, 703731079, 703607025, 703754349, 703509674, 703267975, 704882355, 706569672, 704600067, 702191315, 704495316, 703154907, 700719910, 703303604, 704822159, 706227112, 704051361, 700836945, 702808914, 704370651, 705107956, 703357391, 702507477, 705208054, 703196640, 701519623, 702844925, 702895279, 703196869, 703100891, 702601471, 702367249, 702141876, 704050522, 705391541, 701258087, 699768448, 700933762, 702214966, 703927917, 702666779, 703949585, 704439316, 701342316, 702383270, 703056335, 702997055, 702732544, 701876984, 702098618, 701902847, 702306900, 702297516, 702776337]
3960.7G02776337N98297m09851N01938p4845o63605p00225k96555N1422p8048K71224
3970.3G01976089N35203K79922j04065K81067j02997J77994J28021p36770j72196P0267
3980G02332535J32446k13699j21994R0484n61752p9346K79312n22003k07367P66220
3989.6G01894836o6146k69776P93534J218490J71661j311187l17383N80749M81873
3998.3G03176651J45569l33481
4000.2G02988739
$$ y = [702776337, 703374634, 702964783, 703466721, 703391876, 702728271, 702028046, 701731491, 701782913, 701704865, 701976089, 702511292, 702791214, 702687149, 702968216, 702865219, 703043213, 703171234, 702434464, 702262268, 702332535, 702464981, 702251282, 702129288, 702219772, 701658020, 701578674, 701857986, 701335983, 701128616, 701894836, 701828690, 701558914, 702352448, 703570938, 703742599, 702431412, 702114029, 702694778, 703176651, 703322220, 702988739]
##END=$$ End of the data block
