##TITLE=$$ Begin of the data block
##JCAMP-DX=5.00 $$ ACD/SpecManager v 10.08
##SPECTROMETER/DATA SYSTEM=Varian
##DATE=08 Jan 2013 15:20:40
##DATA TYPE=INFRARED SPECTRUM
##DATA CLASS=XYDATA
##ORIGIN=
##OWNER=
##NPOINTS=3735
##FIRSTX=399.26403809
##LASTX=4000.35498047
##MAXX=4000.35498047
##MINX=399.26403809
##MAXY=70.82647705
##MINY=29.03148270
##XFACTOR=1.0000000000
##YFACTOR=0.000000100000000
##FIRSTY=46.09524155
##DELTAX=0.96440572
##XUNITS=1/CM
##YUNITS=TRANSMITTANCE
##XYDATA=(X++(Y..Y))
399.3D60952415R598580J0590172M540214q435592k828026L252029L84255k619858
407D75434189L885994N315170o485062k576942L897820Q296813Q98438j2230606n54390
415.7D75881424O521187m907112j5193673J4492798O059838m003182l157234n889740
423.4D69804306P70531J577301M31442J506882q41484k932854k285652K120476K251281
432.1D72402229K833023M281311K871705R24339p470093l026810L094216r58786j22185
440.7D74828949j519508k308312O365509N298767j794166k415276k260246q82988K529297
449.4D77842026L52058j550484J506310N23796r95560P477R53102O3706m930115j968269
459.1D71804047j424065j205101P48367K049370L166390n85900j367111j087341k248345
$$ plain form
399.3 460952415 470550995 481141167 485681381 477245789 474417763 477669792 478054047 475434189
407 475434189 479320183 484635353 478150291 475573349 479471169 487767982 488666420 476435814 475881424
415.7 475881424 482402611 477495499 462301826 476794624 482854462 478851280 475694046 469804306
423.4 469804306 470574837 472152138 472583580 474090462 473248978 470316124 468030472 470150948 472402229
432.1 472402229 475235252 479516563 482388268 483312607 475842514 472815704 475909920 474951134 474828949
440.7 474828949 473309441 471001129 477366638 482665405 480871239 478455963 476195717 475312729 477842026
449.4 477842026 478194084 476643600 478149910 478673706 477678146 477685623 478638725 478702431 473772316 471804047
459.1 471804047 470379982 469174881 469923248 471972618 475139008 474553108 473185997 472098656 469850311
467.7D69850311m76989j172295l06206m522667o848640N755577K62222l703956K433013
476.4D61270370M141236K798691o48041k171440j74561o17103J41754O9885j361198
485.1D63449593R15145M55246j380996J234359K84119k341690j529961j605072Q27866
493.8D60308609q26683r12514L599320j264954n9166K060242k996864k422181k303085
502.5D55182724Q13179K265396l16086k591285j320839J571769j19934J576538R47915
511.1D58009377k803956j751594Q03833K108879q27293j743699J392937Q68797j873779
519.8D54183502k441673j60637L95966n455l6927j777954k630615P03468K026825J177826
529.5D51434326p65076n43823J110649j870231j534767O55517q92906N55038q8462
$$ plain form
467.7 469850311 469373322 468201027 467894821 463372154 456523514 462279091 462541313 458837357 461270370
476.4 461270370 465411606 468210297 467562256 465390816 465216255 464599152 464740906 464810791 463449593
485.1 463449593 464364738 464819984 463438988 464673347 464957466 462615776 461085815 459480743 460308609
493.8 460308609 459481926 458569412 462168732 460903778 460844612 462904854 459907990 457485809 455182724
502.5 455182724 455995903 458261299 457945213 455353928 454033089 455604858 455484924 457061462 458009377
511.1 458009377 455205421 453453827 454257660 456366539 455539246 453795547 455188484 456057281 454183502
519.8 454183502 451741829 451581192 451977158 451971703 451934776 450156822 447526207 448229675 450256500 451434326
529.5 451434326 450669250 450125427 451236076 449365845 447831078 448486595 447593689 448148727 448060265
538.1D48060265j176224J116943J333885O9352j618081j743469m75197j032943o45142
546.8D43889389K78320p79037j259308l65181J846085R33113r31359Q67424k54554
555.5D44224892j740761o94313p8888M35409r4642p39975o39191O38695J385765J60637
565.1D42857628j833687p20673K128449J240578o17867k107849j284523R041P9384
573.8D39750481J267013n1727p03392J23291p51572r23424j11351M12484n5008j69907
583.5D38786888J73454J521645P49626q9416J110916n05715q98170J206169J501350
592.1D43556747K72217j39427n18379r64050N40962J317787M37736o790l05099j166764
601.8D43024940j235198O07528K13967j153145r52568j733780j132508J119957K112427
$$ plain form
538.1 448060265 446884041 448000984 449334869 449404221 447786140 446042671 445567474 444534531 443889389
546.8 443889389 444167709 443388672 442129364 441764183 443610268 444543381 443612022 444479446 444224892
555.5 444224892 442484131 441789818 441710930 442146339 442051697 441311722 440672531 441311226 442696991 442857628
565.1 442857628 441023941 440303268 442431717 443672295 443054428 440946579 439662056 439671097 439750481
573.8 439750481 441017494 440965767 440262375 440385666 439634094 438710670 438599319 439011803 438956795 438786888
583.5 438786888 438960342 440481987 441231613 441142197 442253113 441747398 440849228 442055397 443556747
592.1 443556747 443828964 443689537 443171158 442207108 442748070 444065857 444503593 444496803 444191704 443024940
601.8 443024940 441789742 442397270 442611237 441458092 440505524 438771744 437639236 438759193 440871620
610.5D40871620R92699j010170j220093n03158j73989p74650j345215m7531m51012
619.2D36338501Q0414K536239J685486P37229n74494p99522J162453P87391J03302
627.8D42056999k2354J019058K322159J627197Q59604J704254J813050O88362J008530
636.5D53076859P98225k58217q71353n59731J317635K404938J899795J313401J339950
645.2D60461502O02608K1133n44281j055641L70903J451454R90677P19338J435966
653.9D64453659Q21915j75972J016044O79360j861763j696320L03269M9247K50283
662.5D63839722J550674R18350M94347L90739m929580j7396279J0085450Q252067K118721
671.2D65324211n67207N25055J900749J514130J737327J292229M3449L14217K24571
$$ plain form
610.5 440871620 441864319 440854149 439634056 439130898 438956909 438182259 436837044 436789513 436338501
619.2 436338501 436418915 438955154 440640640 441377869 440803375 440003853 441166306 441953697 442056999
627.8 442056999 442034645 443053703 445375862 447003059 447862663 449566917 451379967 452068329 453076859
636.5 453076859 453875084 453616867 452745514 452185783 453503418 455908356 457808151 459121552 460461502
645.2 460461502 461064110 461085243 460540962 459485321 459856224 461307678 462298355 463017693 464453659
653.9 464453659 465275574 465099602 466115646 466795006 464933243 463236923 463540192 463589439 463839722
662.5 463839722 465390396 466308746 466803093 467193832 462264252 444867973 454953423 463205490 465324211
671.2 465324211 464757004 465282059 467182808 468696938 470434265 471726494 471769943 472084160 472308731
679.9D72308731J145897R16824j86729J070290J556892J840935J519241K93121K37503
688.6D80702705O47126J299591J243171M42620l55606n92423Q34770J924553J239281
697.3D87385788R98001J343002L06397r37729q0299J605987R55010k81868M96711P31659
706.9D92522659J296082K230568R03168k07596q28858r95712P51839J690292J031189
715.6D98393631Q83026P01790j39275n03463Q0452J502876J049118n14107J86386J228905
725.2E02869339J118546R90257K023010K111778j33857r43718L69758Q90732L50151
733.9E09645996O36444L18070R73587J500740J91421O80390l66211L86619J641121
742.6E15608177M5319J285858J144295R13238J304016P9689o45179j67275J280594
$$ plain form
679.9 472308731 473454628 474371452 474184723 475255013 476811905 478652840 480172081 480465202 480702705
688.6 480702705 481349831 482649422 483892593 484335213 483979607 483387184 484221954 486146507 487385788
697.3 487385788 488383789 489726791 490033188 489095459 489015160 490621147 491576157 491294289 491791000 492522659
706.9 492522659 493818741 496049309 496952477 496744881 495916023 494920311 495672150 497362442 498393631
715.6 498393631 499276657 499978447 499839172 499335709 499416161 500919037 501968155 501454048 501640434 502869339
725.2 502869339 503987885 504978142 507001152 509112930 508979073 508035355 508405113 509295845 509645996
733.9 509645996 510282440 510600510 511574097 513074837 513266258 513946648 513580437 513967056 515608177
742.6 515608177 515653496 516939354 518083649 518996887 520300903 520380592 519735413 519568138 520848732
751.3E20848732O01654N57861Q39081Q49076K24609J2398K103462P01141M47121J156502
760.9E28341637K44598O38351L90282P84874N04456P2441K56843J301194K035904O32247
770.6E35202827l58161q79288r77364r59778R47915J097793p00874M14200P18803L83644
780.2E34889717j59302L9063M60205o36635m89159K08779Q21838J125412P59430P98950
789.9E37818298J554222P06521k58523m7378q62198j162605q09250j30882r89647k10610
799.5E35607948J429329K40746j1482j417237j993789j945687k185859j136857j576957
808.2E27010155j048889m52080o29883q22258j479111j114883o78177j505280j971473
816.9E17308121q95386O9885Q30193J341629J445656O63604M73977R93194O84013J687470
$$ plain form
751.3 520848732 521450386 522008247 522847328 523696404 523921013 523933411 526036873 526738014 527185135 528341637
760.9 528341637 528586235 529224586 529614868 530399742 530904198 530976639 531233482 532534676 534570580 535202827
770.6 535202827 534844666 533965378 532988014 532028236 532976151 534073944 533373070 533787270 534506073 534889717
780.2 534889717 534730415 534769478 535229683 534593048 534103889 534312668 535134506 536259918 537019348 537818298
789.9 537818298 539372520 540079041 539820518 539773140 538910942 537748337 536939087 536808205 535818558 535607948
799.5 535607948 537037277 537278023 537266541 535849304 533855515 531909828 529723969 528587112 527010155
808.2 527010155 525961266 525509186 524879303 524057045 522577934 521463051 520784874 519279594 517308121
816.9 517308121 516412735 516482620 517312813 518654442 520100098 520763702 521237679 522230873 522914886 524602356
826.5E24602356J573372J562157J752281J308403K862434K947121K598533K062722
834.2E41269379K187614J965942J204949K040596P71637J374016J268921L47824J935730
842.9E54366608K512664K331238J397667R37348m62227M1885J137619Q32749J285171
851.6E64380722J225166J995316J187019J371422J719017J651421K193184Q74900M06800
860.3E77004967m79431O31103R53026l87955o4239L44085M45443L04832P59239j524467
869.9E77986603j756935j567955k125244o41099j386947n8518N05829L7079q53157
878.6E70139656j909943j49269r0828o01921r41047n36385o86531l07198K0562q97026
888.2E64040070p3510o87332j36337J53084k80190K50359K01072O50635j53885M38767
$$ plain form
826.5 524602356 526175728 527737885 529490166 530798569 533661003 536608124 539206657 541269379
834.2 541269379 543456993 545422935 546627884 548668480 549440117 550814133 552083054 552430878 554366608
842.9 554366608 556879272 559210510 560608177 561545525 561083298 561125183 562262802 563095551 564380722
851.6 564380722 565605888 567601204 568788223 570159645 571878662 573530083 575723267 576598167 577004967
860.3 577004967 576525536 577156639 578109665 577721710 577657471 578001556 578446999 578751831 579511070 577986603
869.9 577986603 576229668 574661713 572536469 571895370 570508423 570449905 570955734 570992813 570139656
878.6 570139656 568229713 568080444 567989616 567387695 566446648 565910263 565223732 564916534 564937096 564040070
888.2 564040070 563966560 563279228 563142891 563295975 563015785 563266144 563467216 564117851 563963966 564402733
897.9E64402733M99534j93557N4054o05736j110649l52211J486206J283569J556550
906.5E67020493J629715J241531J652641R39522R68208K15187J35727k41775j219025
915.2E72342224j555786j601067j035156j641121k456474l488770k059402j851616
922.9E56652832l386879k373657j876526j792183l147621m005547l317413k718124
930.7E34034882k516175j773185o51436r43299J641R6359l05634k12020q05588o21949
940.3E26303596j200981j073608j053505j12839O43540m77562J72424J46751j6746
949E23331070K14729l08990n42221k59133j50680p74460r35593r06410k61040q90579
958.6E18516693k560425l474998l190727j918602j680909j380424j430779j185646
$$ plain form
897.9 564402733 564902267 564708710 564762764 564157028 563046379 562694168 564180374 565463943 567020493
906.5 567020493 568650208 569891739 571544380 572483902 573452110 573667297 573803024 573561249 572342224
915.2 572342224 570786438 569185371 568150215 566509094 564052620 560563850 558504448 556652832
922.9 556652832 553265953 550892296 549015770 547223587 544075966 540070419 536753006 534034882
930.7 534034882 531518707 529745522 529094086 528150787 528152428 528248787 527943153 527731133 526925545 526303596
940.3 526303596 525102615 524029007 522975502 522862663 523506203 523028641 523201065 523347816 523331070
949 523331070 523545799 523236809 522694588 522435455 522284775 521510315 520574722 519668312 519407272 518516693
958.6 518516693 515956268 512481270 509290543 507371941 505691032 504310608 502879829 501694183
966.3E01694183j171035j690026j469230j380158o87485j612320k649879k516251k571907
975D85945892j941604k258148k982827k911682k702102l154297l408165l825455m352379
983.7D58409233l950882l961105l975678m053764l856392k968674l030204l717003
991.4D28895531l788147l389893k997703l249360l091392k538528k518311k246285
999.1D05075912k373008k417145k355804k037659j962509j778870j197281j783981
1006.8C89169655j043854j284180k075042j173249j567649j920090j655541j496887
1014.6C76953163j801262j648025j645813k235832k530823l069535k974319k185898
1022.3C58861656j063614j959343k291412j226349p35893m86679j819191j232262n35393
$$ plain form
966.3 501694183 500523148 498833122 497363892 495983734 495296249 493683929 491034050 488517799 485945892
975 485945892 484004288 481746140 478763313 475851631 473149529 469995232 466587067 462761612 458409233
983.7 458409233 454458351 450497246 446521568 442467804 438611412 435642738 432612534 428895531
991.4 428895531 425107384 421717491 418719788 415470428 412379036 409840508 407322197 405075912
999.1 405075912 402702904 400285759 397929955 395892296 393929787 392150917 390953636 389169655
1006.8 389169655 388125801 386841621 384766579 383593330 382025681 380105591 378450050 376953163
1014.6 376953163 375151901 373503876 371858063 369622231 367091408 364021873 361047554 358861656
1022.3 358861656 357798042 355838699 353547287 352320938 351585045 351098366 349279175 348046913 347511520
1031C47511520o79245j079979p93037M80118M36096J762390J204567O11878J381530
1039.6C50835838J956406J398048K13395J161537J32827j45759m12827n85479p5188
1048.3C54478798j185303n36384p80373p91359j448975j928749j071624q80585o94657
1057C45160789l74183J932945J032486R58633J649132J237793K324944J003761J048241
1065.7C55974541J456413J970444J888351J951103J881943R4986M62532k0752M27628
1074.4C66087189L76053l64037m4250k01798K11449Q6021J475678R92126L22800M86526
1084C69427757O29273J327324J7967K36244O22101K285156K448769R43069J080666
1092.7C79018326P87201J747703J254692R50127Q83179J128616J415138J207733K418595
$$ plain form
1031 347511520 346832275 345752296 344959259 345439377 345875473 347637863 348842430 349454308 350835838
1039.6 350835838 352792244 354190292 354403687 355565224 355698051 355552292 355139465 354553986 354478798
1048.3 354478798 353293495 352757111 351976738 351185379 349736404 347807655 346736031 345855446 345160789
1057 345160789 344786606 346719551 347752037 348710670 350359802 351597595 353922539 354926300 355974541
1065.7 355974541 357430954 359401398 361289749 363240852 365122795 365217781 365680313 365659561 366087189
1074.4 366087189 366463242 366099205 366054955 365853157 366064606 366150627 367626305 368618431 368941231 369427757
1084 369427757 370057030 371384354 371402321 371638565 372260666 374545822 376994591 377937660 379018326
1092.7 379018326 379805527 381553230 382807922 383758049 384641228 385769844 387184982 388392715 390811310
1101.4C90811310J583252K138557K389565J279793Q09593l6507L88069N92194N39017
1110D00494843q6098N42526J483727J393013J239891O25496R13238k55890p68928l32642
1119.7D05249176k29835K64968k71492N22576Q46748J17989P32307J380539L99895
1128.4D09012871P45392K071037J345940J368560J782647K178993J999550J902961
1136.1D22407951K274247K134895J823578K60200L69492J467361J740456J576042Q04558
1144.8D34858780P67860P85408Q11501M36478K04277K29492k06604k80991k83127p1640
1154.4D37251434l662l8452j06888l55720r37500j113625l33595l74718k56386M6196
1164D33777084O41671J566009J480599J717758K110939K144470J820488K139015K382965
$$ plain form
1101.4 390811310 392394562 394533119 396922684 398202477 399012070 398975563 399363632 399955826 400494843
1110 400494843 400408745 400951271 402434998 403828011 405067902 405693398 406606636 406350746 405581818 405249176
1119.7 405249176 405019341 405284309 405012817 405535393 406382141 406500130 407232437 408612976 409012871
1128.4 409012871 409758263 411829300 413175240 414543800 416326447 418505440 420504990 422407951
1136.1 422407951 424682198 426817093 428640671 428900871 429270363 430737724 432478180 434054222 434858780
1144.8 434858780 435626640 436412048 437223549 437660027 437864304 438093796 437887192 437606201 437323074 437251434
1154.4 437251434 437247772 437209320 437102432 436746712 435809212 434695587 434361992 433987274 433730888 433777084
1164 433777084 434418755 435984764 437465363 439183121 441294060 443438530 445259018 447398033 449780998
1172.7D49780998K170143K359772K721100K791443K579040K469368J623497J632157
1180.4D68127518J832237J575584J711617J676369J399879N89905P74345J320000Q47282
1189.1D79854736K54631P1869l51143m06456n7220k09389j57661n72167o41822m94233
1198.8D77291145p81898q02460j209221j254005j128159j146698r43985m80957k2430
1207.4D69521332j80817J37520K43340m52004o82602n83229n02777m66690l98331k66723
1217.1D66369019J71203K02141k81792n08537o39954j61247k86560j201553r89418
1225.8D62673302o34423q00018m74243j67923m64821m69131l77961q54759r58710o79664
1235.4D56791649o15502l57894J63574J4953r5138M56161L16964l15438j019172j041337
$$ plain form
1172.7 449780998 451951141 454310913 457032013 459823456 462402496 464871864 466495361 468127518
1180.4 468127518 469959755 471535339 473246956 474923325 476323204 476913109 477687454 479007454 479854736
1189.1 479854736 480109367 480181236 479830093 479423637 479366417 479157028 478999367 478427200 477785378 477291145
1198.8 477291145 476509247 475706787 474497566 473243561 472115402 470968704 470024719 469543762 469521332
1207.4 469521332 469340515 469478035 469721375 469269371 468586769 468003540 467500763 467034073 466635742 466369019
1217.1 466369019 466540222 466742363 466460571 465952034 465312080 465150833 464864273 463662720 462673302
1225.8 462673302 462038879 461238861 460764618 460596695 460131874 459662743 459284782 458430023 457471313 456791649
1235.4 456791649 456176147 455818253 455981827 455996780 455901642 456357803 456674767 456359329 455340157 454298820
1245D54298820o75315p62673l93677k9945j5831M8447J62468j03531j7967J82304m51889
1255.7D52241211m64363k33269k08664k61154k24686K60544N24635P93953N22728L37792
1265.3D53288727L28712K4758O6070P34062J233674N86280N84488J287422J222992
1274D59357185R54628J146660R70154N18990M17022N91851J290817J458549J492234
1282.7D68198090J431274J382751J212006M12254M75617Q68988J038742Q87718J010437
1291.3D76917877J024780Q75588J015167M65737L89099M70047N00068M14124J80015
1300D82252502J16578J2207K18010J59187O6910k71912j85966l0709n17997n52369
1309.7D81266441k81295q2970o24313n00794J08948j01624j83029j72882n0354l5667
$$ plain form
1245 454298820 453623505 452860832 452467155 452437210 452421379 452469826 452632294 452528763 452510796 452693100 452241211
1255.7 452241211 451776848 451543579 451334915 451073761 450849075 451109619 451634254 452428207 452950935 453288727
1265.3 453288727 453617439 453642197 453708267 454442329 455676003 456262283 456846771 458134193 459357185
1274 459357185 460311813 461458473 462428627 462947617 463364639 463956490 465247307 466705856 468198090
1282.7 468198090 469629364 471012115 472224121 472636375 473111992 473980980 475019722 475907440 476917877
1291.3 476917877 477942657 478818245 479833412 480299149 480688248 481158295 481658363 482072487 482252502
1300 482252502 482369080 482381287 482599297 482758484 482825394 482553482 482367516 482336807 481818810 481266441
1309.7 481266441 480985146 480902176 480277863 479777069 479886017 479784393 479601364 479428482 479378128 479342461
1319.3D79342461L89213O70319Q47931J106987P89261Q33129P16172M20570r3040l75557
1328.9D84647446k22664l94821n20325m48341j61171K13317K60315l76815m03366j80359
1338.6D82413216l64571M05273P84111R62105Q66928P89986Q35915O96602R93690M55246
1348.2D88838501k8610m96903o96068m29992j19591k05040l41568M34609L74183L79868
1357.9D87709389l72277j156883j081886r96132q90350p36924J127701L24555m37622
1366.6D83489571J30195o02264n56984k94609j11656q20809j438522q92220j87492
1375.2D78715210Q23708M05616L86887M05540K38228m64821j517028j289559j200142
1383.9D76503639j107216j113090q61206j017075k56386k28424j514473j518325j800194
$$ plain form
1319.3 479342461 479731674 480401993 481249924 482356911 483146172 483979301 484695473 485116043 485023003 484647446
1328.9 484647446 484424782 484029961 483509636 483061295 482900124 483113441 483373756 482996941 482593575 482413216
1338.6 482413216 482048645 482453918 483238029 484200134 485067062 485857048 486692963 487389565 488383255 488838501
1348.2 488838501 488809891 488312988 487616920 487186928 487067337 486862297 486520729 486955338 487329521 487709389
1357.9 487709389 487337112 486180229 485098343 484102211 483211861 482474937 483602638 483927193 483489571
1366.6 483489571 483619766 483017502 482460518 482165909 482054253 481233444 479794922 478902702 478715210
1375.2 478715210 479538918 479944534 480331421 480736961 480975189 480510368 478993340 477703781 476503639
1383.9 476503639 475396423 474283333 473422127 472405052 472148666 471920242 470405769 468887444 467087250
1392.6D67087250j669541k926826l529053j047439j061745j225357k714310j515999
1400.3D51396980m55436j451493j462288j812744l064461k019233j020737j324005
1408D38786583j483231j212234p41768p65724j268883r86061r56116j033668j443062
1416.7D28895836j752892n17959j689644R95026J928787M14428p1601l11470J040878
1425.4D28931389J001930J86882N05142q125M58679J415863J793442J070137J343613
1434.1D36698952J943435L39623q02117J737519K571106J414032J129303J381683J202927
1442.7D47616463J504097N63926J262474R69010K61612m0322Q48046J719932O63605
1451.4D55368843J029663J222229J515618N16548m3831k1858k69356M616241J530457
$$ plain form
1392.6 467087250 465417709 462490883 458961830 457914391 456852646 455627289 452912979 451396980
1400.3 451396980 450941544 449490051 448027763 446215019 443150558 441131325 440110588 438786583
1408 438786583 437303352 436091118 435349350 434583626 433314743 432328682 431372566 430338898 428895836
1416.7 428895836 427142944 426624985 424935341 425930367 427859154 428273582 428201981 427890511 428931389
1425.4 428931389 429933319 430120201 430625343 430617218 431075897 432491760 434285202 435355339 436698952
1434.1 436698952 438642387 438982010 438179893 439917412 442488518 443902550 445031853 446413536 447616463
1442.7 447616463 449120560 449684486 450946960 451915970 452177582 452137260 452985306 454705238 455368843
1451.4 455368843 456398506 457620735 459136353 459652901 459609070 459587212 459317856 463934097 465464554
1460.1D65464554J858139J740379J342888J537514J34888L204078J978035J971588
1467.8D79232063J972885K132836K690544J083145J150704K245674M460258K844353
1475.5D97812462J355553K704277K557029K126465J231842J258927J532821J691742
1483.2E12271118J752014J254654J021118J86234L13492P48863j038475P23305K054062
1491.9E19286385J233215j02081m93164o42014m236679J76811r86595k000122M60167
1500.6E12695923r15146q07304l80211Q1711k036973r843597j126518L583946K655602
1509.3E03907433p63J83487j273270n05791Q44002j647339j821518k436371p20215
1518D96529655J845398N75066l605156m236107J897927L051185K168694n82085J029205
$$ plain form
1460.1 465464554 467322693 469063072 470405960 471943474 472078362 475282440 477260475 479232063
1467.8 479232063 481204948 483337784 486028328 487111473 488262177 490507851 494968109 497812462
1475.5 497812462 499168015 501872292 504429321 506555786 507787628 509046555 510579376 512271118
1483.2 512271118 514023132 515277786 516298904 516485138 516798630 517547493 516509018 517232323 519286385
1491.9 519286385 520519600 520417519 519924355 519282341 515045662 515222473 514235878 512235756 512695923
1500.6 512695923 511780777 510973473 510593262 510674973 508638000 498794403 497667885 501251831 503907433
1509.3 503907433 503906670 504090157 502816887 502311096 503155098 501507759 499686241 497249870 496529655
1518 496529655 498375053 498950119 495344963 491108856 493006783 496057968 498226662 497644577 498673782
1526.6D98673782J368828M02069J190834R16443R575j080437j599693K41776K793159
1535.3E02916336J749687R46961Q61778m818573l358917K923240J292916M66194J828194
1544E04807816R22775L08151K258415R92203R71909q14896j158829J450691L54500
1552.7E10092735M20685k709122k5100J216583j123505q713150m718208P941589J215973
1561.4E03598480J416130j093406j596032k226486j866112o49490j722488j346321
1569.1D94514275p331772J77841m54598k978553k490502k537956j595650j1888961
1576.8D65414124m2458j085053k853813k878723m361572k823830m506225k873993m182701
1585.5D39805756l760567l587990m546776l070297m682922k399445m158249k646980
$$ plain form
1526.6 498673782 500042610 500444679 501635513 502551956 502561531 501481094 499881401 500123177 502916336
1535.3 502916336 504666023 505612984 506474762 501656189 498297272 501220512 502513428 502979622 504807816
1544 504807816 505730591 506038742 508297157 509289360 510261269 509446373 508287544 509738235 510092735
1552.7 510092735 510513420 507804298 507779198 508995781 507872276 499159126 494440918 502382507 503598480
1561.4 503598480 505014610 503921204 502325172 500098686 498232574 497583084 495860596 494514275
1569.1 494514275 487182503 487360344 486905746 483927193 481436691 478898735 477303085 465414124
1576.8 465414124 465371666 464286613 461432800 458554077 454192505 451368675 446862450 443988457 439805756
1585.5 439805756 436045189 432457199 427910423 424840126 420157204 417757759 413599510 410952530
1593.2D10952530l596916m569435k538987m146270j858216l993950k053222l077584
1600.9C85117950l086509k193680l776016q63877k953682j202659k892418j445732
1608.6C66703377j814804l029976J98479k408333q3886j794967L6621j194115n232849
1617.3C51379547L132134o74973O50673j701813N29213r12437k056694K362137M23088
1626C53130875J775932k447701J012497Q35877O13823R81445k61001K204208M28734
1634.6C58274689J263771k610131K324601K047119J639633K999954L96805J852875
1642.4C68189316J04713K266312K012062p15027J375275j375885M044952J373711K834472
1651C80109901K029267l640824k356910K226066N293846J424523J812897J067810J789207
$$ plain form
1593.2 410952530 407355614 402786179 400247192 396100922 394242706 390248756 388195534 385117950
1600.9 385117950 382031441 379837761 376061745 375197868 372244186 371041527 368149109 366703377
1608.6 366703377 364888573 361858597 362057076 359648743 359564857 357769890 357806511 356612396 351379547
1617.3 351379547 354511681 353836708 354487381 352785568 353314781 352402344 350345650 352707787 353130875
1626 353130875 354906807 352459106 353471603 354307480 354921303 355902748 355641747 357845955 358274689
1634.6 358274689 359538460 356928329 359252930 361300049 362939682 365939636 366336441 368189316
1642.4 368189316 368294029 370560341 372572403 371857376 373232651 371856766 375901718 377275429 380109901
1651 380109901 382139168 378498344 376141434 378367500 383661346 385085869 386898766 387966576 389755783
1659.7C89755783J961594J463813J847878k30751L990326K561645K800255K517777
1667.4D06668320J576194J792717J533471M685440K567939L985787L252067K290078
1675.1D28352013K953338L479119M296417K287712L293343K690925M785576M907379
1682.9D57045822p58705K263947M864540O445121L853264L543244M165764L082237
1690.6D84505234M174385M168625M538078M058151L811035N5733N122261O122246M671135
1699.3E21226883R98917J38473P050095M491691L323746L098183L064003K524871L187943
1707.9E49104805L674698J644287J326065K269554K471123K308998j70975M26674L072396
1716.6E66127625J328125j546631M014129K986985J744422J442299P80831R69314J662140
$$ plain form
1659.7 389755783 391717377 393181190 395029068 394798317 398788643 401350288 404150543 406668320
1667.4 406668320 408244514 410037231 411570702 416256142 418824081 422809868 426061935 428352013
1675.1 428352013 431305351 434784470 439080887 441368599 444661942 447352867 452138443 457045822
1682.9 457045822 456287117 458551064 463415604 469860725 473713989 477257233 481422997 484505234
1690.6 484505234 488679619 492848244 497386322 501444473 505255508 505311241 510433502 516555748 521226883
1699.3 521226883 522225800 522364273 529414368 533906059 537229805 540327988 543391991 545916862 549104805
1707.9 549104805 552779503 554423790 555749855 558019409 560490532 562799530 562628555 563055229 566127625
1716.6 566127625 567455750 565909119 569923248 572910233 574654655 576096954 576877785 577847099 579509239
1725.3E79509239J592827J175804J080017J156502k66304Q91533L215294K134628l552818
1734E86936722j840058N299340L628998J680488K317810J97029M23889M163666J998978
1742.7F04806862N15213K088508L022347K296486J333542J476364J943741M436149
1750.4F21919212J104851J403465M856987K973862K831688K454834k24800J836929
1758.1F39157028K853317K038193K231446j153336R40094L919601J753006J301117
1765.8F53040466J558914Q12836j393356K436828L112336j547547j474304K01798L854827
1774.5F60602798K214356l8147K229614P51572J099777K52380p59277J290512J526947
1783.2F69170532R95407m04281Q02231J527938Q89206M33579P47528l87573L0517o51474
$$ plain form
1725.3 579509239 581102066 582277870 583357887 584514389 584248085 585139618 588354912 590489540 586936722
1734 586936722 585096664 590396004 594025002 595705490 598023300 598220329 598644218 602807884 604806862
1742.7 604806862 605322075 607410583 610432930 612729416 614062958 615539322 617483063 621919212
1750.4 621919212 623024063 624427528 629284515 632258377 635090065 637544899 637320099 639157028
1758.1 639157028 642010345 644048538 646279984 645126648 646066742 649986343 651739349 653040466
1765.8 653040466 654599380 655412216 654018860 656455688 659568024 658020477 656546173 656747971 660602798
1774.5 660602798 662817154 662779007 665008621 665760193 666859970 667112350 666353073 667643585 669170532
1783.2 669170532 670165939 669761658 670563889 672091827 672981033 673414612 674162140 673774567 673805084 673153610
1792.8F73153610n68084L164291J182785P4387J564483J311798m48303j275711J747589
1801.5F79906845P9880O48956J460266O00586R04389K04849O08902J013489P26928
1810.2F86155090j088104O53687J385116J35193P53174K29263Q43888q774M20303R27506
1819.8F90406342j85700Q84171J4648N44357O72989j726150L33786J752166J023942
1828.5F93720551j279755k274323J925736K793197M80652q011J89972J75553o7368
1837.2F95656204o67648J148834N66864L26996M9133R21250N25207m357910K343140
1845.8F96512070K224350o714r6283P45697P41577m26178M18015p2937O62307P67899
1855.5G01469803j05515J26801k85950J04523k88773K37580K41394N60226N47409J27335
$$ plain form
1792.8 673153610 672585526 675749817 676932602 677006989 678571472 679883270 679434967 678159256 679906845
1801.5 679906845 679986725 680635681 682095947 682696533 683600922 683805771 684414673 685428162 686155090
1810.2 686155090 685066986 685720673 687105789 687240982 687994156 688223419 689067307 689058533 689478836 690406342
1819.8 690406342 690220642 691104813 691119461 691663818 692336807 690610657 690944443 692696609 693720551
1828.5 693720551 692440796 690166473 692092209 694885406 695366058 695358047 695548019 695723572 695656204
1837.2 695656204 694988556 696137390 696704254 697031250 697080383 698001633 698526840 694168930 696512070
1845.8 696512070 698736420 698729706 698633423 699379120 700120697 699694519 700112534 700039597 700701904 701469803
1855.5 701469803 701364288 701491089 701205139 701309662 701020889 701258469 701499863 702060089 702607498 702734833
1865.1G02734833L80401r64889K06528m98047n40619J166992O78940M43878K94495
1873.8G03902512N28793l57742M48913M43192o8054K29568k76718J34354m18244K90680
1883.4G04857254m6844j86387M76456J96610J058731p07550j284714O73828P01828
1892.1G05739212L8528J17341r5444q29010Q36181N41153M07105L02200l280K03552
1901.8G07257538m57382J23214l62320Q4687L29818j37939J6632o5994L98178J91421
1911.4G07377853O84433k62451k87475r6970l67508N21469j528625j96076J224671
1920.1G07069321P34863K42996r59701n0812P38983M89121m80195l25012m9057K15912
1929.7G07626419K57111j86997J95084j15586L92991K6779m36630k72980K03934M48913
$$ plain form
1865.1 702734833 703115234 702150345 702356873 701858826 701318207 702485199 703164139 703608017 703902512
1873.8 703902512 704431305 704073563 704522476 704965668 704897614 705127182 704850464 704984818 704566574 704857254
1883.4 704857254 704810410 704624023 705100479 705297089 706355820 705648270 704363556 705037384 705739212
1892.1 705739212 705777740 705895081 705799637 704970627 705806808 706347961 706755066 707057266 707053986 707257538
1901.8 707257538 706800156 706923370 706561050 706645737 706975555 706837616 706854248 706788254 707186432 707377853
1911.4 707377853 708062286 707799835 707512360 707415390 707047882 707569351 706040726 705844650 707069321
1920.1 707069321 707804184 708047180 707087479 707036667 707775650 708264771 707784576 707459564 707410507 707626419
1929.7 707626419 707883530 707696533 707891617 707776031 708169022 708195801 707759171 707486191 707690125 708139038
1939.4G08139038n70602M13742p63626j267701J096116N21850r3002k25907K84348
1948.1G07534256j90735j87378K07291j21536j37253J59454J52512p13120J02921J31149
1957.7G06937561r5596J22986k81754n1041j24511K90298j78680k4414o8894p44400
1967.3G05781555J57242L01666K75574l56674R3078P2480k59400K46887k11792M349
1977G06104965k16141J1750K7466J05438J65100l33557J09787l82920l37753l77350
1986.6G04876785l7231K09198l80554J27105k45742l84064K26517O07910q0948l53623
1996.3G04565353j91803n35659n34j39237L23715o3400k14004J53350l67126K60849
2005.9G03791504j90430n42068m81415K17438K88086m15497Q1939k13012L02048J64489
$$ plain form
1939.4 708139038 707568436 707982178 707218552 705950851 707046967 707568817 707475815 707249908 707534256
1948.1 707534256 707343521 707156143 707363434 707241898 707104645 707264099 707416611 706703491 706806412 706937561
1957.7 706937561 706841965 706964951 706683197 706632156 706507645 706797943 706619263 706594849 706525955 705781555
1967.3 705781555 705938797 706240463 706516037 706159363 706252441 706324921 706065521 706312408 706100616 706104965
1977 706104965 705888824 705900574 705928040 706033478 706198578 705865021 705974808 705591888 705254135 704876785
1986.6 704876785 704839554 705048752 704668198 704795303 704549561 704165497 704392014 704999924 704918976 704565353
1996.3 704565353 704373550 703837891 703837357 703698120 704021835 703958435 703744431 703897781 703530655 703791504
2005.9 703791504 703601074 703059006 702577591 702795029 703083115 702667618 702749557 702536545 702838593 703003082
2015.6G03003082l43322k18201l93677m48608n23606J83716J13678J29013j54648j23062
2025.2G01224365J39313l75061j18866j93787J69526n68543q38318R92K75421P00150
2034.9G00415192M3411q4534k73361j51901m84085r05609k21024j3046N05371r4528
2044.5F98735886J52053J87150k72522O1416n99441k46201m5700k2888m04968j69068
2054.1F97375717L39661j602M29687m4861M349l05939m11682j12762m31061j04828
2063.8F96736679n13763J98822N91659K45209L1815j22757J77383K4414M6845p22733
2073.4F96693573n48325j34887j57547R2697n0430M38156K40249j70898l60184J08414
2083.1F96150818n4016m71039k44064n59159J95084J10245J52130J63193n0126K02637
$$ plain form
2015.6 703003082 702659760 702441559 702047882 701599274 701075668 701259384 701373062 701502075 701347427 701224365
2025.2 701224365 701363678 700988617 700869751 700675964 700845490 700276947 699438629 699439621 699715042 700415192
2034.9 700415192 700458603 700374069 700100708 699948807 699464722 698559113 698338089 698325043 698830414 698735886
2044.5 698735886 698887939 699075089 698802567 698863983 698264542 698018341 697972641 697949753 697544785 697375717
2054.1 697375717 697715378 697713776 698143463 698098602 698102951 697797012 697385330 697272568 696841507 696736679
2063.8 696736679 696222916 696421738 697013397 697258606 697290421 697167664 697345047 697369461 697416306 696693573
2073.4 696693573 696145248 696010361 695852814 695945511 695895081 696333237 696573486 696402588 696042404 696150818
2083.1 696150818 696096802 695625763 695381699 694822540 695017624 695127869 695279999 695443192 695393066 695595703
2092.7F95595703n49164k12784j88293j5106j34049l62777l8452k68937L98178K87934
2102.4F94512253O7444n83039p12738k9373J95542N55343k59704p0496O1340p8735
2112F93657837j46103m84695l43781l61252L54920l09296l62320R8724M4098M95682
2121.6F92643814j08185k00500k86865J71203J2665l46832K15301p1029n6305m2496
2131.3F91930771L05710k25983l82996q392k81448O0577N6305L75748r2774J06736
2140.9F91844254K45285m20914l3417j81579J297k02713l2349Q8730J16348L60794
2150.6F91785736k01950J85471J1901J00022l7766l38516M7989k29263j23597n798
2160.2F91194229K46887R4681N62515N37491j52817k06069p21131r3460O8436J25122
$$ plain form
2092.7 695595703 695046539 694833755 694645462 694630356 694496307 694133530 694095078 693826141 694224319 694512253
2102.4 694512253 694579697 693996658 693283920 693254547 693450089 694005432 693745728 693675232 693736572 693657837
2112 693657837 693511734 693027039 692683258 692322006 692676926 692367630 692005310 692104034 692148132 692643814
2121.6 692643814 692535629 692335129 692048264 692219467 692232132 691885300 692100601 692029572 691973267 691930771
2131.3 691930771 692236481 692010498 691627502 691619110 691337662 691398239 691454544 691830292 691737518 691844254
2140.9 691844254 692089539 691668625 691635208 691453629 691454926 691252213 691219864 691308594 691424942 691785736
2150.6 691785736 691583786 691769257 691781158 691881180 691843414 691504898 691552887 691323624 691200027 691194229
2160.2 691194229 691441116 691535797 692098312 692635803 692482986 692276917 691555786 691462326 691530762 691655884
2169.9F91655884l3798j85852L50112J17722L45535m7073J71127J7853m48380j83715
2179.5F91759415l68500N8975Q9188Q11767N00946j51062J09558k88772k73972n61218
2189.1F91686325j13754j9760K15759K60162n722P51953M2725j39618p8201j22605
2198.8F92477264j09863m92477j11695J32828L25699R1171L91388M73557L95355L38287
2208.4F93911514l17001k98920o67190k69165J21307p782K3193Q2169N48019L23945
2218.1F93450089O8054k87247j12228j56708m51508r2010N188K23922J59607N03998
2227.7F93311157L63159k1820r7656l82156m05197k18735K79465l59803j07498L78571
2237.4F92739487J28174J42440j95160K66037J02082k7314m79736n06973J77460j7701
$$ plain form
2169.9 691655884 691622086 691436234 691786346 691904068 692249603 692202530 692373657 692391510 691943130 691759415
2179.5 691759415 691390915 691449890 691539078 692350845 692851791 692700729 692810287 692521515 692247543 691686325
2189.1 691686325 691572571 691552811 691768570 692028732 692023010 692774963 692817688 692678070 692599869 692477264
2198.8 692477264 692367401 691874924 691763229 691896057 692221756 692312927 692704315 693177872 693573227 693911514
2208.4 693911514 693594513 693295593 692628403 692359238 692480545 692472763 692495956 692578125 693126144 693450089
2218.1 693450089 693518143 693230896 693118668 692961960 692510452 692418442 692423630 692647552 692807159 693311157
2227.7 693311157 693674316 693652496 693554840 693172684 692767487 692548752 692828217 692468414 692360916 692739487
2237.4 692739487 692867661 693010101 692814941 693080978 693183060 693155746 692676010 692169037 692346497 692328796
2247F92328796K73438j5640J43356p6981r4757K6093m35028n4169n94406r5139J7853
2257.6F91423416J3275K98081k58713J90887J45951K22397k89383k68021j80588o34994
2267.3F90662308k05155j96991N65033M33121J22986j00784k32850J86081k51770j66473
2276.9F90815506k43988K78168L96270N6611j79368l69644j3122j71128n9585p24030
2286.5F89785690j72500K8763l06473P3089p05261m05960q31833l10364m36096p51953
2296.2F85967102p9575o79702K90680m99039k44904m24728j128082j68152j083756
2304.9F81949844l10058r08737j186600j096268p31735q9645r67255K47803j381455
2313.5F75525894p82623l63159j392746j133042k247696J00403r54056j299285j029206
$$ plain form
2247 692328796 692602234 692586594 692729950 692652969 692558212 692584305 692149277 692095108 691500702 691405563 691423416
2257.6 691423416 691436691 691734772 691476059 691666946 691812897 692035294 691745911 691477890 691297302 690662308
2267.3 690662308 690457153 690260162 690825195 691258316 691381302 691280518 691047668 691233749 690981979 690815506
2276.9 690815506 690571518 690849686 691245956 691302567 691123199 690753555 690740433 690569305 690509720 689785690
2286.5 689785690 689613190 689641953 689335480 689408569 688703308 688297348 687465515 687155151 686719055 685967102
2296.2 685967102 685887527 685207825 685498505 684999466 684754562 684329834 683201752 683033600 681949844
2304.9 681949844 681639786 680731049 679544449 678448181 677716446 677626801 676659546 676907349 675525894
2313.5 675525894 674743271 674380112 672987366 671854324 669606628 669707031 668752975 667453690 666424484
2322.2F66424484k090149o85730j009903o42089j415940m61960j445236p96966M15649
2330.9F58292160j084747N75027r71298n1270p89718j436310m31366o59561J098862
2339.6F54541779m11988m52652j222686N21698J466293J378021K432785J933289M318084
2348.3F64504623J123734l152466l841324l367996k462082k582626k637253l214035
2356F44370575k205124k056503j078644q64182j199493J902618J145707J743087M34494
2364.7F42192535J092530K563400J596527K243195J733703K514115J635055K012100
2372.4F57583160K366333K156449K860336K175369J699295J143570J656571J408462
2380.1F73049545J274414J651612J071167J081772J087265P11212L75900O63147M8218
$$ plain form
2322.2 666424484 664334335 663648605 662638702 661996613 660580673 660118713 658673477 657876511 658292160
2330.9 658292160 657207413 657782440 656811142 656759872 655970154 654533844 654102478 653442917 654541779
2339.6 654541779 654129791 653677139 652454453 652976151 654442444 655820465 658253250 660186539 664504623
2348.3 664504623 665628357 662475891 658634567 655266571 652804489 650221863 647584610 644370575
2356 644370575 642165451 640108948 639030304 638166122 636966629 638869247 640014954 641758041 642192535
2364.7 642192535 643285065 645848465 647444992 649688187 651421890 653936005 655571060 657583160
2372.4 657583160 659949493 662105942 664966278 667141647 668840942 669984512 671641083 673049545
2380.1 673049545 674323959 675975571 677046738 678128510 679215775 679926987 680302887 680966034 681014252
2388.8F81014252l65677l87421p90176k72675l62167j27258m8371N02167P28378j84097
2398.4F79706955l6697n32456n82886p37762p54776m17328k67334N18189L80325M71268
2408.1F77747498q40l41262m25950o84509l91464l82691K03400k91672k61306J02081
2417.7F75273285m33426m60663k89993M00848P2937k32620o30341p35168k28271k05613
2427.3F72530975L02506k18659n21698m58679j09482K31858l37143k62604k91519k67182
2437F70598373m90646j84021M3106m53110l44390l53699K2583m9210l21884m05655
2446.6F68061447k28195q1787m99725k07215j58920l92532m96521j58921r3689j49917
2456.3F65594025r4147m15955R8038l62015o49795l28217j62582n9815p09076l22113
$$ plain form
2388.8 681014252 680648575 680261154 679470978 679198303 678836136 678708878 678660507 679162674 679891052 679706955
2398.4 679706955 679670258 679137802 678554916 677817154 677062378 676645050 676377716 676895905 677276230 677747498
2408.1 677747498 677746658 677405396 676979446 676294937 675903473 675520782 675724182 675432510 675171204 675273285
2417.7 675273285 674839859 674379196 674089203 674490051 674562988 674330368 673700027 672964859 672736588 672530975
2427.3 672530975 672833481 672614822 672093124 671634445 671524963 671756821 671419678 671157074 670865555 670598373
2437 670598373 670107727 669923706 669966812 669513702 669169312 668815613 668838196 668788986 668467102 668061447
2446.6 668061447 667833252 667751465 667251740 667044525 666885605 666493073 665996552 665837631 665743942 665594025
2456.3 665594025 665499878 665083923 665181961 664819946 664170151 663841934 663679352 663619537 662910461 662588348
2465.9F62588348k79617p4768J7242l73306k67258q27865k65045J20392l17688m31672
2475.6F59888763l45993k22015j18103M6692n26962m11454m89807o35834m1503l9826
2485.2F57103958m17328q68683k78320Q9417N6381L0975m02603l58429o15387q97980
2494.8F53442001o50406k52609l00827k02102j62278m76913j78223l0441k12936m83780
2504.5F50491486m57459p68204o33392n417m80499m40827r4909m0741j97296j45340
2514.1F47227402j32141m17862m45633q50296l75290j51520l94287j50147J03608J82037
2523.8F44595871n30014l87116l28674n69000l66058k49482k41775o69251m38995L6850
2533.4F40852356L88870l00598o30341j70059n80902k89078m98542o24085l72619k53754
$$ plain form
2465.9 662588348 662308731 662233963 662251205 661877899 661610641 660782776 660517731 660638123 660320435 659888763
2475.6 659888763 659542770 659320755 659202652 659249344 658722382 658310928 657821121 657185287 657143784 657103958
2485.2 657103958 656686630 655817947 655539627 655629044 655685425 655716400 655313797 654955368 654339981 653442001
2494.8 653442001 652791595 652538986 652238159 652036057 651873779 651396866 651218643 651188202 650975266 650491486
2504.5 650491486 650034027 649265823 648632431 648627014 648146515 647705688 647610779 647570038 647372742 647227402
2514.1 647227402 647095261 646677399 646231766 645381470 645006180 644854660 644460373 644310226 644413834 644595871
2523.8 644595871 644065857 643678741 643350067 642781067 642415009 642165527 641923752 641254501 640815506 640852356
2533.4 640852356 641241226 640940628 640310287 640140228 639559326 639270248 638771706 638147621 637775002 637521248
2543.1F37521248J08375p3547o523m34761o70014k16217L07770j96686q84246l58620
2552.7F35096779n42565m24423p1525L16963K84576n00641o28013r56421q04138m00505
2562.4F31370087j62735k37007j8464L84674k66151m61388m34913k19422l89251p01142
2572F28864288l19709j73264l61176n69686J2817n6114j52207r7084k53753k4796o19812
2582.6F26249504n03807n00679o29959p0381J12495j03454n61524m02260m23698j53542
2592.2F23012695j15699m92249m28200m97703l32489k21367o5384l87802o5689j14785
2601.9F20291328p84530k71569l57093l41454q20885p00683N9814l10287l16773j92909
2611.5F16254959J16272n76973m43992J35307n37720k84653k68478l80516q13828p95669
$$ plain form
2543.1 637521248 637629623 637556076 637549553 637114792 636444778 636228561 636536331 636339645 635455399 635096779
2552.7 635096779 634554214 634129791 634058266 634375229 634659805 634159164 633531151 632574730 631770592 631370087
2562.4 631370087 631207352 630970345 630951881 631336555 631070404 630609016 630174103 629954681 629565430 628864288
2572 628864288 628544579 628371315 628010139 627440453 627453270 627397156 627244949 627147865 626894112 626869316 626249504
2582.6 626249504 625745697 625245018 624615059 624544678 624657173 624553719 623992195 623589935 623166237 623012695
2592.2 623012695 622896996 622404747 621976547 621478844 621146355 620924988 620859604 620471802 620406113 620291328
2601.9 620291328 619506798 619235229 618878136 618536682 617715797 617015114 617074928 616764641 616447868 616254959
2611.5 616254959 616371231 615794258 615350266 615485573 614947853 614663200 614394722 614014206 613200378 612404709
2621.2F12404709n32761o30226J43433J7700k31171j84021l05137o94390r95216m83666
2630.8F08509254j39045k3155l89863n02471j43433k7275n94025o43844M3411n69458
2640.5F05520096r42383o37283l26157k61116m20227k54097N7983K78893n26543o65169
2650.1F01823997l14788l01552j42059m45290m66271n30052k92015k49443l77846j0719
2659.8E98693962j17721m17443p88612p56264m19235l6545k65846n70793j62964o5460
2669.4E95093079R498k03857n3215m5891n35545l82538k23313j83754m09278k95105
2679E92770081k33307l65525l58543l62587m7226k43301m80309m78401k54326l61137
2688.7E89585419m62609N5352q3847j71624o0501q4953n09491p35588l97301k51236
$$ plain form
2621.2 612404709 611871948 611241722 611385155 611402855 611171684 610987663 610682526 609988136 608992920 608509254
2630.8 608509254 608370209 608347054 607957191 607454720 607311287 607284012 606689987 606046143 606089554 605520096
2640.5 605520096 604577713 603940430 603614273 603353157 602932930 602678833 602736816 603015709 602489166 601823997
2650.1 601823997 601509209 601207657 601065598 600620308 600154037 599623985 599331970 599082527 598704681 598693962
2659.8 598693962 598576241 598158798 597370186 596613922 596194687 596158142 595892296 595321503 595158539 595093079
2669.4 595093079 595102577 594898720 594845505 594799614 594264069 593881531 593658218 593474464 593065186 592770081
2679 592770081 592536774 592171249 591812706 591450119 591402893 591159592 590679283 590200882 589946556 589585419
2688.7 589585419 589122810 589178162 589094315 588922691 588862190 588777237 588267746 587532158 587134857 586883621
2698.3E86883621m8980l13302k79693r0752n2452n0888k65312m29650p60345l19099
2708E84273148k41166l34930j52893j10092k6741o20690k11601m9171o82946o08863
2717.6E81234055q0681L69758k98233k33879J13869m55017l73421O828k07176m50287
2727.3E79625816k99987j12496J76315j48468n46112n05790k06261L6392k36931O5613
2736.9E77848091j144k39792m22287m51737K43454l14102n79109J14822J7929k83317
2746.5E75932808l01590l29742j70517M0550l84751n34286l16048r3727J01128j28746
2756.2E73815079m07105k70958j68266j08147L12424j01852l91426m35715l29933J831
2765.8E71915932o32401l80440m71649m34494J01395j88332J63765p4844k02179m15917
$$ plain form
2698.3 586883621 586834641 586521339 586241646 586150894 586098442 586047554 585782242 585352592 584592247 584273148
2708 584273148 584031982 583697052 583544159 583434067 583407326 582786636 582575035 582525864 581842918 581234055
2717.6 581234055 581153374 581523132 581224899 580991020 581104889 580649872 580276451 580283279 580076103 579625816
2727.3 579625816 579325829 579213333 579389648 579241180 578695068 578189278 577983017 578019409 577782478 577848091
2736.9 577848091 577846947 577607155 577184868 576733131 576976585 576662483 576083374 576198196 576216125 575932808
2746.5 575932808 575631218 575301476 575130959 575171509 574786758 574252472 573936424 573842697 573943825 573815079
2756.2 573815079 573407974 573137016 572968750 572860603 573173027 573071175 572679749 572244034 571914101 571915932
2765.8 571915932 571283531 570903091 570431442 569996948 570098343 569910011 570073776 569998932 569796753 569380836
2775.5E69380836m42237j96686n16968l61366p79610k02026K07214j57509j60293n56565
2785.1E66214790m74548o29120k40478r1019o79131j091117o07224M40979j21651l19328
2794.8E62402153l21121k66304j10245q92982r36509o17408l81165p13921p80639l62854
2804.4E57019005j21193J38855l84598p85446n34744j40610o95839j154251p59735
2813.1E52581444n37605l63465p20634p18232m22287l52630n28488n02816l00483p63245
2822.7E47371559q04367q73527o61660l34701n45273p16362o10924m09698r96895r07631
2832.4E40510521r71680j088562q15811j214218o18210p09495j501694j550293j277962
2841.1E30762596j344795j760445j452026j626396j708222j517524j818009j996002
$$ plain form
2775.5 569380836 568938599 568741913 568224945 567863579 567083969 566881943 567089157 566931648 566771355 566214790
2785.1 566214790 565740242 565111122 564870644 564779625 564100494 563009377 562402153 562843132 562721481 562402153
2794.8 562402153 562081032 561814728 561704483 560811501 559874992 559257584 558876419 558162498 557381859 557019005
2804.4 557019005 556897812 557036667 556652069 555866623 555331879 555191269 554495430 553341179 552581444
2813.1 552581444 552043839 551680374 550959740 550241508 549819221 549466591 548938103 548435287 548134804 547371559
2822.7 547371559 546567192 545693665 545032005 544697304 544152031 543435669 542824745 542415047 541418152 540510521
2832.4 540510521 539538841 538450279 537634468 536420250 535802040 535092545 533590851 532040558 530762596
2841.1 530762596 529417801 527657356 526205330 524578934 522870712 521353188 519535179 517539177
2848.8E17539177j820755j773758j795883q34770n00985n72319m16870k46315J69449
2857.4E09746971J91345N11437K35328j34391k68822j48430J97106n27115n72052n32303
2867.1E08699074r32007q26340o29577n41115p92504m53834L4256j37558l45383m27475
2876.7E03647537n97381n36499m72107k41013j77536q11958o19202q67996j161270
2885.4D98162575m24919o47240j233673r66377k11487n70641r39827j031875j250725
2894.1D90885811n91927o21071n41801o72798j013870n35775n41382m20532m46701
2902.8D85499954r24186j035309o61698r56917j300926r14650q44688n71556p77359
2911.4D77512665j115875j444703j868858j727943j523629j351509k153587j984711
$$ plain form
2848.8 517539177 515718422 513944664 512148781 511314011 510813026 510240707 509823837 509577522 509746971
2857.4 509746971 509938316 510449753 510685081 510550690 510281868 510133438 510330544 509803429 509231377 508699074
2867.1 508699074 507767067 506940727 506311150 505770035 504977531 504523697 504557953 504420395 504075012 503647537
2876.7 503647537 503050156 502513657 502041550 501800537 501623001 500811043 500191841 499323845 498162575
2885.4 498162575 497737656 497090416 495856743 494890366 494678879 494108238 493168411 492136536 490885811
2894.1 490885811 490293884 489672813 489131012 488458214 487444344 486908569 486367187 485946655 485499954
2902.8 485499954 484575768 483540459 482878761 481921844 480620918 479706268 478861580 478290024 477512665
2911.4 477512665 476396790 474952087 473083229 471355286 469831657 468480148 466326561 464341850
2919.2D64341850p30858o91299j111755j201592o38962l47976Q7394L85476J30996
2927.8D60223274L18413K67944K22664M69780L77960Q9302P34864J048012M60968L98445
2937.5D64611626N84259J259269J327134R03892J055908O26030L1395L53775Q28743
2946.2D71582031M82826M3946K51655P27692O90689O37360N36003R8762P0916J98249
2955.8D75320129M17786K74811M57687L23220Q3847Q07342O89468R92394Q88596M05769
2965.5D80661049O10618M36593J025695J045189O96640O50215N32723O25572P85179
2974.1D87069473Q31757K83470M15993N98564P56531P44171K03781O828k20909K20108
2983.8D90909767K46849K28195L01438K85988N63583p2212k0256j13068k55775Q8310
$$ plain form
2919.2 464341850 463610992 462919693 461807938 460606346 459967384 459619408 459706802 460092278 460223274
2927.8 460223274 460541687 460809631 461032295 461502075 461880035 461969337 462704201 463752213 464213181 464611626
2937.5 464611626 465195885 466455154 467782288 468686180 469742088 470368118 470399513 470753288 471582031
2946.2 471582031 472064857 472108803 472360458 473088150 473778839 474416199 474952202 475050964 475121880 475320129
2955.8 475320129 475737915 476012726 476470413 476793633 476877480 477684822 478374290 479366684 480255280 480661049
2965.5 480661049 481271667 481708260 482733955 483779144 484475784 485125999 485658722 486284294 487069473
2974.1 487069473 487901230 488184700 488600693 489199257 489955788 490699959 490903740 490910568 490689659 490909767
2983.8 490909767 491156616 491384811 491686249 491972237 492535820 492463608 492443352 492330284 492074509 492162819
2993.4D92162819m0436J32713Q7777J44577l60260p51572q2779K11525l44353o70509
3003.1D90489502l75557q01773n74646o3210k76489l90434n66063k72255k04239n14107
3012.7D86450729n65986k74086l60756l99742k08664p31621p09953p27005o97518l41377
3022.4D81434021j87340j75743r26742q33817k23618j80282m96559q50106q15238q22907
3032D75921669j95236P2593o10198r58405p68662n63430o98090p15980l11242m72374
3041.6D70700645j117096o33049m02908n51910j06468n30777r66912q06770o58951
3050.3D64925804p03316o42242o23894p92618m42085n47829q52165n69648m42276o83709
3060D58626022r50889p40814k13395l63159q04024k74391l34549n99899l45001o19888
$$ plain form
2993.4 492162819 492122383 492255096 492342873 492487450 492127190 491375618 491292839 491504364 491160011 490489502
3003.1 490489502 490113945 489312172 488737526 488674316 488397827 488007393 487441330 487169075 486964836 486450729
3012.7 486450729 485884743 485610657 485249901 484850159 484641495 483909874 483199921 482472916 481775398 481434021
3022.4 481434021 481246681 481070938 480144196 479310379 479086761 478906479 478409920 477559814 476744576 475921669
3032 475921669 475726433 475799026 475188828 474230423 473461761 472898331 472200241 471484261 471173019 470700645
3041.6 470700645 469583549 468950500 468547592 467995682 467889214 467358437 466391525 465584755 464925804
3050.3 464925804 464222488 463580246 462956352 462163734 461721649 461173820 460321655 459752007 459309731 458626022
3060 458626022 457675133 456934319 456720924 456357765 455553741 455279350 454944801 454344902 453999901 453380013
3069.6D53380013q53463j051788p01790n49087l81012j19706p07206n34363o06232
3078.3D47875366o73713q0719k39602n77087p37648q49571q77762n32799k54211k39373
3087.9D42812881m24118l80363m09813p36809m42848o33202o10351o70128j056900
3096.6D37448349p80907o59179K61192j19171j309509n89791m2229n26046r61685n61104
3106.2D32159920n76477q18596o39305n18761l88641n06935l15133k71759n51452q68073
3115.9D26704788p22122o86836j057816n17425l72582o06460r71108j002846l85322
3124.6D20382271m37622m77219r20753p32460q1597p93762q73299l85627o52924q39004
3134.2D14188004o84319n81245m38538o30302q89283n92727m95644n92613o66199p80258
$$ plain form
3069.6 453380013 452526550 451474762 450772972 450223885 449842873 449723167 449015961 448481598 447875366
3078.3 447875366 447201653 447120934 446881332 446304245 445566597 444717026 443839264 443306465 443052254 442812881
3087.9 442812881 442388763 442008400 441598587 440861778 440418930 439785728 439175377 438505249 437448349
3096.6 437448349 436667442 436008263 436269455 436150284 434840775 434250984 434208755 433682709 432721024 432159920
3106.2 432159920 431583443 430764847 430125542 429606781 429218140 428711205 428396072 428124313 427572861 426704788
3115.9 426704788 425982666 425295830 424238014 423720589 423348007 422741547 421770439 420767593 420382271
3124.6 420382271 419944649 419467430 418546677 417814217 417732620 416938858 416065559 415679932 415027008 414188004
3134.2 414188004 413503685 412922440 412483902 411853600 410964317 410371590 409875946 409283333 408617134 407836876
3143.9D07836876p52373n65109k31438l94974q89053o99615o65741q84323n13230r06639
3153.5D01334381j228866q09937n56908j32370p31544j382256o93817k7313k77748
3162.2C95493622r06067r06296p82585n25284m50058r58099r54209n77964m78630n51644
3171.8C88402786r26780j078110m40521m52271m78439k38991r77974j172371r62410
3180.5C81674919o43577j30043j14861o61316j299515q52089l12423o31142r99565
3189.2C76030388n72777n75294r62105m26178l96881n43709p21016m69666j41029r08928
3198.8C70312805o76956m03099m40483l94821q73146p38869m26369m41971o84356p24144
3208.5C64508591m88892m87938o30989l76663l44010r25827m11033n112m08440m99076
$$ plain form
3143.9 407836876 407084503 406519394 406287956 405892982 405003929 404304314 403638573 402754250 402241020 401334381
3153.5 401334381 400105515 399295578 398738670 398606300 397874756 396492500 395798683 395771370 395493622
3162.2 395493622 394587555 393681259 392898674 392373390 391923332 390965233 390011024 389433060 388954430 388402786
3171.8 388402786 387476006 386397896 385957375 385505104 385026665 384787674 383809700 382637329 381674919
3180.5 381674919 381031342 380901299 380786438 380125122 378825607 377973518 377661095 377029953 376030388
3189.2 376030388 375457611 374882317 373920212 373494034 373097153 372553444 371832428 371362762 371221733 370312805
3198.8 370312805 369635849 369232750 368792267 368397446 367524300 366785431 366359062 365917091 365232735 364508591
3208.5 364508591 364019699 363531761 362900772 362524109 362180099 361254272 360843239 360838127 360429687 359930611
3218.1C59930611o16074n91507o13518n34629m96331p15294n71975l35389m44335n53399
3227.8C54458160m85229l82118j07422m63600q27599n09071o03180m70658k49252m67377
3237.4C49892654j46904k12287q47664p69730o62079l31955m05693j025352l00789
3246.1C45190201J97944j76353j108360r88198J86730j84708j95083m15268r79424
3254.8C41527481o01883m02374l80097r76715n37147N4207j12076n38597j116448j18293
3264.4C36798058R15n04951l69072m89617M2801J04256k88506m17251n71823q76084
3274C33428726l78761K29301m97627n80444l61939m62684p2098j75591l38440j32370
3283.7C30658073m94117o68259J20430L14789m19998o41632j40114k07711n86509l34473
$$ plain form
3218.1 359930611 359314537 358723030 358109512 357574883 357078552 356363258 355791283 355455894 355011559 354458160
3227.8 354458160 353972931 353590813 353483391 353019791 352192192 351683121 351079941 350609283 350360031 349892654
3237.4 349892654 349745750 349533463 348685799 347916069 347253990 346922035 346516342 345490990 345190201
3246.1 345190201 345388145 345211792 344103432 343115234 343301964 343117256 342922173 342506905 341527481
3254.8 341527481 340925598 340523224 340143127 339166412 338629265 338683472 338571396 338032799 336916351 336798058
3264.4 336798058 336798973 336294022 335924950 335435333 335478134 335582390 335293884 334876633 334304810 333428726
3274 333428726 333049965 333279266 332781639 332201195 331839256 331376572 331304474 331128883 330790443 330658073
3283.7 330658073 330163956 329495697 329616127 329930916 329510918 328869286 328729172 328521461 327934952 327600479
3293.3C27600479k12631j84288l88985o29425m59556k81334o3095k37809l62510k15569
3303C24565277k86484k82097k44178j44005j5526m97131o58379o8893l90129m91562
3312.6C21486893k82708p68013n18817R9506J56174n43290o52408k09313o29768p69062
3322.3C17369194o36692p40814o31428j00727j15528o12602l78342j74542l14083r18579
3331.9C12745857r45701k21577n17502q84914n47295k19517j72748k52438o73561q30498
3341.6C07480106j93901j55906o12584n81054o04706m29630j48163r78279n26276N84774
3351.2C03834381n57632q90942n16605n53856j74237j27506L7899m6196n09224p70034
3360.8B99726048l28675l9959k90680j99012m37851m14601j84536k46887l15285l04222
$$ plain form
3293.3 327600479 327387848 327203560 326814575 326185150 325725594 325444260 325381165 325143356 324780846 324565277
3303 324565277 324278793 323996696 323752518 323608513 323592987 323095856 322437477 322368584 321978455 321486893
3312.6 321486893 321204185 320436172 319917355 320016861 320173035 319629745 318977337 318768024 318138256 317369194
3322.3 317369194 316732502 315991688 315360260 315259533 315144005 314531403 314153061 313978519 313664436 312745857
3331.9 312745857 311800156 311578579 311061077 310176163 309628868 309409351 309236603 308984165 308310604 307480106
3341.6 307480106 307286205 307130299 306517715 305936661 305331955 304902325 304754162 303775883 303249607 303834381
3351.2 303834381 303276749 302385807 301869202 301315346 301141109 301013603 301051502 301005306 300496082 299726048
3360.8 299726048 299397373 299357414 299066734 298867722 298429871 298015270 297830734 297583847 297268562 296964340
3370.5B96964340q1959l5362l75061q52909k77328J61342j92718j67275j38283j06258
3380.1B94898529m40845l48874r8552m35829k54994r5901j55144J01814K99511l06511
3389.8B93163204n55649Q7281J46312j03683k12803l35865m34589j66760J53389j66263
3399.4B91574574j15052J61686o11439m95510O56338J61362j29853M7646j41869m1389
3409.1B91066494k81429K67048J88179o32649k92816K98729O01463K65637q4782j86348
3418.7B91209526p9288J37081N21393M29554j49975M11377L64322k12860j94740J8635
3428.3B92455025K76432J53179L82690L18871J5716j72042L48949Q81996K68784J72100
3438B95101700P2326L96100P40509K60849m788Q6079Q14419R07707K40555j60313O21529
$$ plain form
3370.5 296964340 296882381 296847019 296471958 295619049 295341721 295503063 295310345 295143070 295004787 294898529
3380.1 294898529 294457684 294108810 294010258 293574429 293319435 293223534 293068390 293170204 293469715 293163204
3389.8 293163204 292607555 292694836 292841148 292737465 292524662 292188797 291754208 291587448 291740837 291574574
3399.4 291574574 291459522 291621208 291009769 290514259 291170597 291331959 291202106 291249752 291107883 291066494
3409.1 291066494 290785065 291052113 291240292 290607643 290314827 290613556 291215019 291480656 291395874 291209526
3418.7 291209526 291130238 291267319 291788712 292218266 292068291 292479668 292843990 292631130 292436390 292455025
3428.3 292455025 292731457 292884636 293267326 293586197 293601913 293429871 293778820 294660816 294929600 295101700
3438 295101700 295174026 295570126 296310635 296571484 296566696 296652775 297467194 298374901 298615456 298455143 299076672
3448.6B99076672P55901J73473N91927L79257K18296L59097N82599P17068L04165Q22735
3458.2C03981190N44567Q945K67525M35066R35993Q96836O04534O40926P89738J082058
3467.9C10187378P59411J68590O84853M61960q0738O17218N00908M81491O01959Q91895
3477.5C15274925J144352O22482Q88730N13572J26801O44398Q95099R17359P88688
3486.2C21816406R06487O28509M91333O04668P90901J019859P75948N65949O48269
3494.9C28248329O69098M76685Q59718J080322J238976R83505L85437N97916M86030
3503.6C35026016P49474P53898M48647Q01926J492118J199189N4588R95865J349602
3512.2C42871323J102600Q67157M60243N72891N10941J312980J036454N44738J008988
$$ plain form
3448.6 299076672 299832573 300006046 300597973 300977230 301195526 301554623 302137222 302854290 303158455 303981190
3458.2 303981190 304525757 304534702 304802227 305237293 306173286 307070122 307674656 308315582 309105320 310187378
3467.9 310187378 310946789 311115379 311800232 312262192 312181454 312798672 313299580 313781071 314383030 315274925
3477.5 315274925 316419277 317041759 317930489 318444061 318570862 319215260 320110359 321027718 321816406
3486.2 321816406 322722893 323351402 323842735 324447403 325238304 326258163 327034111 327600060 328248329
3494.9 328248329 328917427 329394112 330253830 331334152 332573128 333556633 333942070 334539986 335026016
3503.6 335026016 335775490 336529388 336978035 337779961 339272079 340471268 340525856 341521721 342871323
3512.2 342871323 343973923 344841080 345301323 345874214 346385155 347698135 348734589 349279327 350288315
3520.9C50288315J173553J043816M00734J293793J596908Q96912L14102O53114J161690
3529.6C58822937O37283N76020R32769J775475J436615J281242N97878l58811J415444
3538.3C67116852J544037J440735Q40148O06423J779289J516380J030884N54772O73408
3547C77102928O55327K004738J469116R12666J476479p08084J913605K479820J638908
3555.6C88945503K017479M28925J330795R06601P46040J258355J642761J201782R32350
3564.3C99410591L465920J89895k09236R95712Q47435L354683J474991J619110J944390
3573D13093491J763115P82737O96450K526779J412773K173729J467018Q76465K112159
3581.7D26904716J733857J070976Q71658L509941P69577j391906K091446J028328L860321
$$ plain form
3520.9 350288315 351461868 352505684 352906418 354200211 355797119 356694031 357008133 357661247 358822937
3529.6 358822937 359460220 360036240 360969009 362744484 364181099 365462341 366060219 365701408 367116852
3538.3 367116852 368660889 370101624 370941772 371548195 373327484 374843864 375874748 376429520 377102928
3547 377102928 377758255 379762993 381232109 382144775 383621254 382913170 384826775 387306595 388945503
3555.6 388945503 390962982 391391907 392722702 393629303 394375343 395633698 397276459 398478241 399410591
3564.3 399410591 402876511 403066406 402857170 403852882 404700317 408055000 409529991 411149101 413093491
3573 413093491 414856606 415639343 416335793 418862572 420275345 422449074 423916092 424792557 426904716
3581.7 426904716 428638573 429709549 430581207 434091148 434860725 433468819 435560265 436588593 440448914
3590.4D40448914K628097J736221J399956R43108K569923Q5793K303543K804489J428032
3599D56348076K734451O47965J547660K340737J357841K334519L317756J704102j295853
3607.7D71037254L710862J578140K88238O061211J023903j022225L867836L91083L530731
3616.4D90467033L063507J86577K757950j0605J173516L271560K744484K559319K549820
3625.1E08763161J735763K055893N506592O32210o592789M474945M904175M577293
3632.8E26057243J099663m87022L480606L934135L050804J328545J396675K820435
3640.5E42681084L091621J469002N04646K201119L269157M161415q67386n06096O007271
3649.2E62011833p72743j837463J919975N722771N153274L930092L582420o020240
$$ plain form
3590.4 440448914 443077011 444813232 446213188 447156296 449726219 449812012 452115555 454920044 456348076
3599 456348076 459082527 459730492 461278152 463618889 464976730 467311249 470629005 472333107 471037254
3607.7 471037254 474748116 476326256 476614494 482675705 483699608 482677383 486545219 486936302 490467033
3616.4 490467033 493530540 493717117 496475067 496464462 497637978 500909538 503654022 506213341 508763161
3625.1 508763161 510498924 512554817 518061409 518693619 512100830 516575775 521479950 526057243
3632.8 526057243 527156906 526669884 530150490 534084625 537135429 538463974 539860649 542681084
3640.5 542681084 545772705 547241707 547746353 549947472 553216629 557378044 556510658 556004562 562011833
3649.2 562011833 561239090 559401627 561321602 567044373 572197647 576127739 579710159 573689919
3656.9E73689919J990051N018959K041931K014122P96700K019615J180801J392059
3664.6E90144157J757050J038628M144401J480179n26085N34515o028213L376350P445259
3673.3F03366241O912842l966713j5744362O560021Q470306M689598j979408O29692
3681F08938217L442116K050285Q82721j54457N74532L403549N072327q205872l823013
3689.7F12180405P447166m318619K05727N592918J553269J591644K17934j49117J412697
3698.4F25734024L92838J918830J943207m432792r78775L990249O39725k53449J111679
3707F30065536L141785L038750p705574K164841K787628r721718N983848N200463Q13064
3715.7F35768623L60947J234665L94974l146592J056824M482308l750344m010391M532433
$$ plain form
3656.9 573689919 575679970 580698929 582740860 584754982 585551682 587571297 588752098 590144157
3664.6 590144157 591901207 592939835 597084236 598564415 598038330 598572845 592544632 595920982 603366241
3673.3 603366241 610279083 606312370 590568008 597128029 605598335 610287933 608308525 608938217
3681 608938217 612380333 614430618 615313339 615158882 615733414 619136963 624209290 616003418 612180405
3689.7 612180405 619627571 615308952 615514679 621107597 622660866 624252510 624470444 624321327 625734024
3698.4 625734024 626126862 628045692 629988899 625556107 624577332 628567581 629207306 628953857 630065536
3707 630065536 633207321 636246071 628540497 630705338 633492966 623771248 629755096 634955559 635768623
3715.7 635768623 636129570 637364235 637759209 634612617 635669441 640151749 636401405 632391014 636923447
3724.4F36923447R19990j491089j604881J083832K824783K91329M431953j800842n857964
3733.1F35720558P334862j507492r465714K180291L076896J741410L234252K549897
3740.8F44864960l206024L031845R003448j1635208j0777245R960518N139084M363327
3748.5F50744705m023666q520622R639167o112442n614204O283989M561996L368531
3756.2F50327454m859620K057572N271759q511658j150665M872589J891327J52512
3763.9F50051270K068176k252274l383331L071899L630982j001053p533035K087783
3771.7F46740417L417435P74689N13306q22678J012878R40323K451782l96957p054367
3780.3F47576828K374878J931686J013794K131272k768021j472015N67169J140289
$$ plain form
3724.4 636923447 637843437 636352348 634747467 635831299 638656082 638947411 643379364 641578522 635720558
3733.1 635720558 643055420 641547928 632082214 634262505 637339401 639080811 642315063 644864960
3740.8 644864960 641658936 644690781 653694229 642059021 631281776 641242294 646381378 650744705
3748.5 650744705 646721039 638200417 647839584 641727142 636112938 642396927 646958923 650327454
3756.2 650327454 645467834 647525406 652797165 644285507 643134842 648007431 649898758 650051270
3763.9 650051270 652119446 649867172 646483841 649555740 653186722 652185669 644652634 646740417
3771.7 646740417 650157852 650932541 651445847 650623169 651636047 652576370 655028152 654631195 647576828
3780.3 647576828 649951706 651883392 652897186 655028458 652260437 650788422 651355591 652495880
3788F52495880R76486k01263L80249L64761O80008o85119O46972K746659m773941l917618
3797.7F48713074L045959M462891N211258p251816r943695L687057L640137M759293
3805.4F56324158M228439q697586l892136M866867K682190J07499K6626q00705N16586
3814.1F55361938M601288j882705j1355439M411316N354462L962479n52521j4681320
3821.8F45219498L623352M910812J128998J926193j32446l667145O48041K286224K587509
3830.5F58531036K52839p821656K802429P787857m262847k168656N008850j0004730
3838.2F50125122k713318Q054886k883224L97338M900437k647553k401428K832871
3845.9F55665131J350860L99552J415557j653671J890412N144500q487014j205521
$$ plain form
3788 652495880 653472366 653271103 653651352 654016113 654696121 654011002 654657974 657404633 652630692 648713074
3797.7 648713074 651759033 656221924 661433182 654181366 644237671 647924728 651564865 656324158
3805.4 656324158 660552597 651855011 647962875 652829742 655511932 655619431 655646057 654845352 655361938
3814.1 655361938 659963226 658080521 646725082 651136398 656490860 660453339 659900818 645219498
3821.8 645219498 648842850 653753662 654882660 656808853 656676407 653009262 653657303 655943527 658531036
3830.5 658531036 658783875 650962219 653764648 661552505 657289658 655121002 660129852 650125122
3838.2 650125122 647411804 655466690 652583466 652980804 657881241 655233688 652832260 655665131
3845.9 655665131 657015991 657415543 658831100 657177429 659067841 664212341 655725327 654519806
3853.6F54519806r718781K016297R199524n28412j488800J585007J865081K398529
3861.3F59848251m682617L5019N784531m836960m914551K607193L715973M407654p393952
3870F54570541o855621M713745N913086K264328q786774J120911L724518J70288J930466
3878.7F58765488L870544m892731p295227N025635J580048J172027M050980j0593414
3886.4F51683350R66186L503571N63354L262100k430267p727127L085937L768693j346131
3895.1F55329666J127548R22165J495972O34308q549347N483246K470321n626983L287353
3903.8F56574249l408584j729813J490250J463470J843567R5444K15759J82114M66766
3912.5F57193222m89120n78843J056595J651688k835846k814865M003601p59506l687210
$$ plain form
3853.6 654519806 644801025 646817322 656016846 655488434 653999634 655584641 657449722 659848251
3861.3 659848251 655165634 655200653 660985184 656148224 651233673 653840866 657556839 661964493 654570541
3870 654570541 647714920 652428665 658341751 660606079 651819305 652940216 656664734 656835022 658765488
3878.7 658765488 662636032 657743301 650448074 655473709 657053757 658225784 662276764 651683350
3886.4 651683350 652649536 656153107 656716461 659978561 657548294 649821167 652907104 656675797 655329666
3895.1 655329666 656457214 657379379 658875351 659509659 650960312 656443558 658913879 653286896 656574249
3903.8 656574249 653165665 651435852 652926102 654389572 656233139 656328583 656544342 656726456 657193222
3912.5 657193222 656704102 656125259 657181854 658833542 655997696 653182831 657186432 656426926 652739716
3921.1F52739716K356872J977768J277771k121124k761078J788864J747665M26026
3928.8F57432480j293717o1492J006851k980957j018677K063293N98069K07061L04871
3937.5F56257782n60074k28500J40457Q27484L42484l355179n93796Q78830J83792
3946.2F53893280J280594j311798M43725M25415j916656J929398J117706k42233p7973
3954.9F55541458J33896l45078j919860N87844M80423M14353P15103j185532K41166
3963.6F54663773N94253L57819J04446l31573O5155o13175n19790M99038L72925j29242
3973.2F55063629n0278o89392o21643M06189P10221K20489J2741N65415J47323m19769
3982.8F55344925o79550M0207M96673R8572N1422l84216L02276k71453r16901k42920
$$ plain form
3921.1 652739716 655096588 657074356 658352127 656231003 653469925 655258789 657006454 657432480
3928.8 657432480 656138763 656077271 657084122 654103165 653084488 655147781 655745850 655952911 656257782
3937.5 656257782 655697708 655469208 655609665 656437149 656779633 653424454 652830658 653709488 653893280
3946.2 653893280 655173874 653862076 654305801 654731216 652814560 654743958 655861664 655619431 655541458
3954.9 655541458 655675354 655330276 653410416 653998260 654478683 654893036 655608139 654422607 654663773
3963.6 654663773 655258026 655615845 655720291 655388718 655453873 654840698 654320908 654819946 655192871 655063629
3973.2 655063629 655013351 654323959 653702316 654108505 654818726 655039215 655051956 655617371 655764694 655344925
3982.8 655344925 654665375 654705582 655202255 655300827 655352249 654968033 655270309 654998856 654081955 653839035
3992.5F53839035n8365M43878l21808K93503P42722l84293J98670R55352
4000.2F55708694
$$ plain form
3992.5 653839035 653780670 654224548 653902740 654196243 654938965 654554672 654753342 655708694
4000.2 655708694
##END=$$ End of the data block
