##TITLE=$$ Begin of the data block
##JCAMP-DX=5.00 $$ ACD/SpecManager v 10.08
##SPECTROMETER/DATA SYSTEM=Varian
##DATE=08 Jan 2013 15:20:36
##DATA TYPE=INFRARED SPECTRUM
##DATA CLASS=XYDATA
##ORIGIN=
##OWNER=
##NPOINTS=3735
##FIRSTX=399.26403809
##LASTX=4000.35498047
##MAXX=4000.35498047
##MINX=399.26403809
##MAXY=71.01110077
##MINY=29.10914230
##XFACTOR=1.0000000000
##YFACTOR=0.000000100000000
##FIRSTY=45.75173569
##DELTAX=0.96440572
##XUNITS=1/CM
##YUNITS=TRANSMITTANCE
##XYDATA=(X++(Y..Y))
399.3 457517357 459564514 469336777 475089607 479386253 486470566 489014854 482108688 475896492
407 475896492 483120918 479907684 470880966 472526131 473465004 476298332 472984505 469916954 474825821
415.7 474825821 479388237 482772102 468438683 451634941 468934288 478817520 479579391 476357880
423.4 476357880 475420685 478106041 480037041 474934425 471510506 470296822 468280869 470703583 475745697
432.1 475745697 477273064 478023796 479376793 476689491 474955063 476027031 475638733 474984169 474117203
440.7 474117203 473700523 473498688 475646172 480712166 481524620 474882126 470304604 469868088 466827278
449.4 466827278 468303261 471893196 473746490 475102310 472539711 470500298 470260811 468709259 467266922
458.1 467266922 465702515 463555260 465966949 467261276 468359337 473223152 473693924 471433792 467832985
466.8 467832985 467752037 470446701 466860924 464870758 460946121 455649643 462196617 466222801 466246681
475.5 466246681 465334587 462961159 461142616 460727386 459355621 456917496 455770493 456372643 456372032
484.1 456372032 457373581 459037476 461614761 464444351 463880005 461947212 460388260 460854836 461326904
492.8 461326904 460832558 460354538 455606232 453319397 454723015 456953239 459024277 457906418 458983536
501.5 458983536 459732094 456277466 455177956 455689850 454268150 454133224 456307526 457745934 460431824
510.2 460431824 459304352 455872498 455283852 453519592 450340424 449599762 451145668 450356598 451216888
518.9 451216888 452153931 450072708 449861069 451547928 453253746 451284904 447636375 446301727 447392616
527.5 447392616 449699860 449641724 448041458 447174225 447423859 448125648 448749352 449461365 449709892 448670464
537.2 448670464 446724396 446577072 447283401 447817650 448530350 448154984 447561874 447271042 446434517 445181503
546.8 445181503 443677254 441716766 441373444 442828255 444486618 445228539 444403725 443519859 442253723
555.5 442253723 441203613 439867210 439395103 440498390 440020447 439698029 439503975 439175072 439870949
564.2 439870949 441809082 442877693 441519051 441192589 441919479 442569504 441828156 440724869 440889015
572.9 440889015 440999451 440809669 439565201 440123291 440979919 441285744 442611313 442193031 441064835
581.5 441064835 440294456 439375191 438618088 439204102 439833603 440774536 442187843 440723572 440687981 441859627
591.2 441859627 442063751 442784157 442665367 443207321 443371658 443750763 444648705 443940277 442071075 440910988
600.8 440910988 442390518 443511238 442911224 441367302 440454292 440293236 438543968 438147583 439528313
609.5 439528313 440597992 441115837 440460930 439798279 439260712 438779068 438452721 437179337 436600189
618.2 436600189 437129478 437419090 438705330 439830742 440218315 440856667 441647186 442309532 442358398 443480377
627.8 443480377 444454536 444468307 445951538 447763748 449247017 450942383 452903099 454094925 453278923
636.5 453278923 452724991 453175507 453922501 454027786 454516182 457676849 460707741 461943207 462375183
645.2 462375183 462441368 462360039 460842056 459945450 460505028 461349869 462664871 463901100 465906105
653.9 465906105 466891479 466175575 466411781 466876335 466277122 465337715 465035286 464798927 464031563 464052734
663.5 464052734 465618744 467806396 468121490 460719910 441372948 454005432 463158493 465616531
671.2 465616531 465126305 465634689 467132912 469373322 471593475 472608681 473348656 473737869 474317169
679.9 474317169 475293503 474754829 473880692 474660149 476546631 478871536 481358833 482772484 483132057
688.6 483132057 483455086 483670616 484666290 485129204 484488907 484695892 485670052 487306328 488362045
697.3 488362045 489112091 490008926 489577332 489374847 489510422 489992447 491125298 491574135 492329254 493434715
706.9 493434715 494691391 495895500 496401711 496498108 496875153 497769241 497744331 498229179 499057770 499466705
716.6 499466705 501259995 502213554 502043533 501614876 501249657 501578751 502047920 502989655 503657303 504668961
726.2 504668961 505720596 506956024 508396492 508760529 509752426 510664597 511076164 511447754 512293510
734.9 512293510 513098640 513408775 514935989 515285339 515589600 516677780 516385651 516144867 516857300
743.6 516857300 518055878 518192215 519020348 520992432 522131538 521581612 520964737 522669601 523559341
752.2 523559341 522995682 522198868 522415237 523897438 525475998 527405052 528010063 528673630 529509926
760.9 529509926 529614792 529648018 530278168 532158699 533183670 533393631 532936096 533220634 533927002 533853722
770.6 533853722 534125519 533646622 533144798 532541847 533154259 534494705 534457016 534704361 535748444 536994896
780.2 536994896 536816826 536615486 536474609 535934372 535595665 535241928 536402283 537103806 537443657 538501358
789.9 538501358 539817543 541042595 541369133 540836945 539384575 538462257 537167130 536828918 537736244
798.5 537736244 537957039 538146133 537715569 537205124 535732346 533518105 531249809 529886627 529571724
807.2 529571724 528212776 526928024 526068268 525619698 524641457 523190422 521917458 520709686 519966278
815.9 519966278 518574066 517842941 517698097 517861214 518219986 518906479 520596161 520801468 521298828
824.6 521298828 523186951 525087776 526622353 527766037 529847107 532250519 534566154 537014008
832.3 537014008 540085411 542369804 543837357 545425148 546876564 548861618 549969254 551156807
840 551156807 552091827 553334427 555645523 557459526 559066734 560175095 561691132 561925430 562579689
848.7 562579689 564292679 564744530 565213242 565698318 567428970 568720512 570086250 571964645 573178558
857.4 573178558 574760857 575430565 575660477 576237984 577994385 578123055 577754097 578788795 578650398
866 578650398 578952675 579175987 579085617 577325096 575466728 574868202 573584442 572666245 571323280 570980110
875.7 570980110 570787163 569976692 569417114 569049873 568982887 568172302 567778282 566832657 566378174 566212540
885.3 566212540 565481415 565324898 564173088 563269501 563261528 563404617 562981987 563774376 565176048 564767380
895 564767380 564363060 563906250 564667053 565301018 564417534 563918266 563852158 563762512 563539429 564440842
904.6 564440842 565542068 567259254 569615097 571052513 571644859 572016678 573089104 573453484 574134026
913.3 574134026 574225807 572689552 571469193 570010605 567895355 565467491 562994080 560484314 559155884
922 559155884 556827660 553406410 551309662 549409180 547409592 544037056 540273972 537155380 534251022
930.7 534251022 531621819 529875717 529066582 527868118 527939453 528113899 527566719 527105865 526391068
939.3 526391068 526351128 525262375 523986588 523360252 523150558 523746948 523910065 523797073 523249397 523217583
949 523217583 523742027 523723412 522958107 522102394 521574898 520411682 519758186 519748688 519402962 517897224
958.6 517897224 515437279 512889519 510344963 508614998 506913414 505237007 503873634 502268867
966.3 502268867 500792542 499222374 497513657 496270065 495368614 493444901 490594864 488215599 486344833
975 486344833 484057693 481452827 478826141 475756874 472546196 469337387 465965271 462167778 458427544
983.7 458427544 454784317 450967178 447388496 443432846 439057388 435483932 432632217 429280815
991.4 429280815 425756836 422073402 418634529 415949326 413264847 410161400 407202835 405016251
999.1 405016251 402328796 399974136 397889481 395959969 394726067 392152290 389415550 387728806
1006.8 387728806 387014351 386275368 384828568 383427277 382357979 381024094 378641777 377134438 375897598
1015.5 375897598 374140930 372135048 369065895 365848503 363351173 361378632 358997574 357272186
1023.2 357272186 355535622 354070358 352781982 350945015 350453072 349847870 349225883 347690926 346363068
1031.9 346363068 345744972 344882164 345592690 346108284 347380371 348533516 349846878 351655769 352587700
1040.6 352587700 353564644 353950386 354866066 354944687 354718208 354705086 354805908 355005913 353684196 352386131
1050.2 352386131 350609283 350029106 349475288 348335114 347253876 345257454 345703697 346904984 347680931
1058.9 347680931 347307701 348061867 350423164 351651955 353733940 355444031 357088890 358174782 359596977
1067.6 359596977 361549034 362779121 364156456 364799614 366223145 366838493 366693001 366910973 366654549
1076.3 366654549 366682091 366730232 366565437 366336708 367720909 368809319 369652634 370823936 371420975
1085 371420975 372173615 371673737 371624336 372617912 374578094 376561928 378220787 379775467 380462646
1093.6 380462646 381957970 382659798 383386917 384824677 386671677 388595161 389527245 391166878 392507401
1102.3 392507401 394212494 395793304 396848450 398487892 399616470 399970741 399312019 399403458 400503311
1111 400503311 401645432 402133331 402988548 404946175 405872574 406684380 407111702 406741943 406346245 406270981
1120.6 406270981 406305847 405729370 405724258 406008606 406558113 407796898 409653893 410527954 410522537 411658173
1130.3 411658173 413212128 415020142 416412239 418090286 420288124 423022003 425918236 427020836
1138 427020836 428190994 429748840 430602074 431243973 432506943 433839989 434528008 435574989 436538734
1146.7 436538734 437465439 437766266 437651176 437938843 437924423 437855377 437038956 436591225 436855583 436693420
1156.3 436693420 437048378 437179260 436505852 435526123 434315987 433090134 432908325 433863754 435020676
1165 435020676 436583138 438165665 439729462 441763268 443852196 445494232 447266579 449259605 451632652
1173.7 451632652 454683380 457491570 459694138 462122116 464583473 466236839 468075523 470165863
1181.4 470165863 471985588 473474693 474805183 476047211 477401314 479134903 480272522 481094475
1189.1 481094475 481250038 480891037 480589638 479714966 478932724 478785553 478511162 477473679 477091446
1197.8 477091446 477378235 477339821 476700287 474792557 473466721 472834396 471495514 470249329 469408264
1206.5 469408264 469476891 469724693 469362907 469431305 469395790 468872070 468102264 467370796 467038879 466600990
1216.1 466600990 466724586 467083130 466742630 466561165 466341133 465793800 465212212 464400749 463361320
1224.8 463361320 462555237 462139854 461647758 461449776 461633987 461140480 459798050 458835945 458486786
1233.5 458486786 457775459 456923943 456538963 456554985 456564178 456394577 456438789 456529007 456276360 455808487
1243.1 455808487 455288010 454823151 454298706 453825874 453370934 452835045 452575417 452437439 452458534 452681961
1252.8 452681961 452862587 452733269 452277832 451956596 451544495 451287804 451189728 451234055 451936302 452477074
1262.4 452477074 452673225 452830238 453139343 453681564 454310112 454673615 454802208 455386543 456367798 457632332
1272 457632332 458827972 459809418 460862961 461826401 462318306 462810631 463576202 464350243 465614586
1280.7 465614586 466825447 468049812 469669724 471092644 472377701 473423805 473981056 474393692 475250359
1289.4 475250359 476078110 476956711 478141556 479173927 479933128 480540733 481209908 481884422 482432632
1298.1 482432632 482326736 482077827 482270317 482855072 483341484 483272018 483193398 483063660 483026733 482683640
1307.7 482683640 482184181 481951752 481453667 480516510 479960442 480647202 480788651 480517311 480084343 479484825
1317.4 479484825 479936600 480407181 480915298 481126938 481355667 482393303 483581238 484424133 484545784
1326 484545784 484934998 485177193 484969177 484515419 484055634 483863487 483596535 483753624 483726044 483754349
1335.7 483754349 483702240 483226166 482826996 482543488 483173790 483818550 484760742 485495110 486068649 487147865
1345.3 487147865 487764091 488359795 488515778 488345718 488158951 488021927 487633743 487305031 487331848 486927490
1355 486927490 487159462 487352905 487518234 487508469 486935654 486314163 485211678 484219742 483244095 483784904
1364.6 483784904 484084778 483733101 483928185 483703079 483415985 482810059 481937866 481156387 480705185 480134430
1374.3 480134430 479499245 480327377 480636406 480596809 481122437 481486053 480630836 479369087 478266525
1382.9 478266525 476615944 475607872 474819717 473864746 472534828 472227058 472155952 471083527 470013809
1391.6 470013809 468121185 466221848 463250198 459635735 458753738 457949905 456533966 453708611 452414436
1400.3 452414436 451817322 450217705 448343048 446224899 443305893 441274185 440377884 439018364 437670441
1409 437670441 436590538 435464859 434677315 433611450 432816467 431823463 430575447 429256630 427619858
1417.7 427619858 427065125 425387840 426458855 428398514 429082184 429292603 428687210 429584846 430526886
1426.3 430526886 430769043 431468201 431748009 432180290 432916641 434716148 436172218 437152977 438581543
1435 438581543 439243202 439670944 440852737 443013916 444387970 445426979 446569557 447625656 449322433
1443.7 449322433 450018501 451181602 452179260 452389297 452381477 453435593 455076561 455816765 457064743
1452.4 457064743 458260918 459940910 460512161 459708366 459823914 460261688 464314766 466197472 468444672
1461.1 468444672 469960594 471196823 472997437 473011017 475703659 477771225 479892120 481706505 483759460
1469.7 483759460 486682510 487913132 488368912 490020256 494430313 497675133 500062790 502952347
1477.5 502952347 505079842 506647873 507815628 509084587 510650063 512800789 514627037 515724716
1485.2 515724716 516723022 517299271 518259201 518818054 516796417 517593575 520306892 521274605 520901108
1493.8 520901108 520520020 519526863 515186882 515485229 514639778 512852631 512903481 511901741 511237907
1502.5 511237907 510760384 511140137 510896950 505167122 499841957 500503120 503025131 503919754 504969978
1511.2 504969978 503898621 502766304 503319664 501888161 499992905 496996536 496691895 498847160 500146027
1519.9 500146027 497995682 493969994 495324554 497438011 499156036 498457375 499441757 500930710 501379471
1528.6 501379471 502404099 502950287 503208122 503337021 503071632 502591209 504181747 505298996 506029854
1537.2 506029854 507355309 504236031 500098610 502210541 503558960 504671631 506151237 506498032
1545 506498032 507082176 509598503 510489998 510935783 509759407 508761597 510389519 510952110 511192970
1553.6 511192970 508206139 508732834 510335083 509648743 503035049 496308441 501763458 503937035 505529099
1562.3 505529099 504764175 503836174 501478958 499336281 498401375 496173897 494534569 487227097 487990341
1571 487990341 487926788 484885445 481874237 478521233 476046104 465424614 466503487 465328293 462234306
1579.7 462234306 459428253 454930687 452073708 447610016 444555511 440356941 436673775 433026009
1587.4 433026009 428705330 426091194 421200943 418509941 414196815 411278992 407778511 403434830
1595.1 403434830 401129227 396774445 394701118 390865707 388544769 385195198 382314568 380491753
1602.8 380491753 376618500 375580978 372709541 371405029 368223915 366484680 365113182 362550926
1610.5 362550926 362716866 360280991 359980659 358422318 358920174 358078232 352143478 354547043 353718987
1619.2 353718987 354765816 353503876 353899956 353467407 351942444 353396797 353019600 354734917 353308334
1627.9 353308334 354212761 354694061 355379257 356225090 355696678 357617035 357764702 358068008 356222000
1636.6 356222000 359677620 362155342 363417511 365788460 366197815 368354797 368714828 371075630 372697525
1645.3 372697525 371229897 373060493 372570686 376453056 377501144 380022087 382024727 381873970 378165588
1653.9 378165588 378566628 384011269 385999832 388067513 389040337 390643387 392196159 393393669 395821342
1662.6 395821342 396191177 399739418 402075386 404728546 407005844 408845444 411075401 412369156
1670.3 412369156 417008438 419547424 423520088 427018127 429436646 432081261 435662041 440120316
1678 440120316 442606163 445730438 448233528 452624588 456605949 456572685 460494308 463994484 470310631
1686.7 470310631 474527435 478554497 482567902 485585442 489832611 493889694 498227921 502420540
1694.4 502420540 506336823 505634232 510824738 516709518 521358910 523132935 523185120 530536613 535410347
1703.1 535410347 538856201 541232872 543848801 546679153 549742699 553406906 555578613 557229004
1710.8 557229004 559710617 562270660 564226379 564124908 564611511 567570000 568493233 566234398 570667229
1719.5 570667229 573761864 575654068 577004128 577586288 578544807 580303459 582157440 583351288 584701576
1728.2 584701576 586033592 585359612 586026497 589155807 591898422 590182915 587307167 591605301 595347404
1736.9 595347404 597350044 599299011 598888741 599226723 603648300 605980148 606192741 608094063 611270905
1745.5 611270905 613422279 614368820 615540886 618092003 623191795 624832039 626403313 630777855
1753.3 630777855 633426781 636059685 637909584 637642670 639908752 642737274 644703903 646916428
1761 646916428 646070023 647192535 651007462 652758942 654208145 655746384 656719666 655458069 657293472
1769.7 657293472 660506058 659870758 658426208 658727570 662485275 664410400 664286499 666200409 666521149
1778.3 666521149 667614670 668229523 667960281 669225540 670535583 671446915 670966415 671827850 673549042
1787 673549042 674309692 674223404 675132751 675185928 674694519 674383163 674594421 677626190 678223419 678000793
1796.7 678000793 679862442 681440430 681340332 680028763 681433563 681144867 681913681 683803711 684297791
1805.3 684297791 684991379 685161743 685679626 686492462 686893768 685942383 686899719 688522873 688804703
1814 688804703 689519577 689859619 690520401 690118790 690348282 691246414 691650848 692740097 692317963 692879105
1823.7 692879105 693469849 691825027 692423630 694160538 695402527 694213181 691701279 693393860 696070480
1832.3 696070480 696511383 696461563 696949844 697314301 697281036 696643219 697592087 698134460 698682556 698816833
1842 698816833 699505997 699757080 695535889 697871323 699976044 700132751 700122223 700657043 701390533 701075821
1851.6 701075821 701567001 701644516 702256546 702636871 702461777 702833633 702433090 702610703 702728500 702898331
1861.3 702898331 702854309 703381577 703779221 703893433 704604645 703958282 704594040 703783264 702515030 703749466
1870.9 703749466 704499512 704971619 705164948 705690536 705482788 705837250 706095734 706284027 706989899 706475830
1880.6 706475830 706371689 705855713 705974197 706190491 705913010 706311340 706726990 707683716 707152328 706355591
1890.2 706355591 706994781 707540741 707542038 707354355 706771393 706164703 707506714 707920303 707945404 708291550
1899.8 708291550 708351746 708634033 708588257 708794098 708034592 707892456 708168106 708349686 708751526 708161011
1909.5 708161011 708107300 708538742 709638062 709848251 709317703 708678894 708462753 709319153 707805405
1918.2 707805405 707602768 708727570 709275742 709486771 708556137 708428116 708937531 709403839 709054871
1926.8 709054871 708887100 709053268 709132538 709167480 709020462 709499130 709676132 710111008 710017700 709640808
1936.5 709640808 709306870 708822861 709161148 708906937 709203568 708510895 707368698 708722153 709447327
1945.2 709447327 709138870 708621216 708696899 708747025 708800430 708881149 708700943 708460770 708446732 708741531
1954.8 708741531 708311234 708400650 708343887 708278122 708639145 708265762 707949829 707686920 708039780 708101044
1964.5 708101044 707948685 707743378 707033768 707256927 707813110 708145523 707755737 707756348 707767792 707570267
1974.1 707570267 707721024 707543793 707540131 707301407 707614899 707642746 707562485 707965164 707895660 707970276 707328720
1984.7 707328720 706837463 706589279 706392975 706284943 706045227 706328049 706304474 706312027 706232681 706407928
1994.3 706407928 706143417 705724792 705835266 705281982 705030365 704983139 705458298 705801468 705804138 705774765
2004 705774765 705277786 705457153 705344772 704922409 704398270 704228897 704164810 703946304 704142532 703995819
2013.6 703995819 704713898 705065994 704517975 703955231 703694687 703655090 702874603 702635422 702558899 702826920
2023.3 702826920 703181458 703166046 703130646 702764359 702687683 702078400 701889420 701788406 701476593 701524887
2032.9 701524887 701342926 701712494 701881561 701772308 701561966 701678009 701170197 700087891 700226669
2041.6 700226669 700494461 700737152 700259552 700034485 700598602 700735474 700508575 699993744 700002060 699696808
2051.2 699696808 699226532 698731613 698699799 699102325 699008408 699332657 699445724 699659576 699677658 699671860
2060.9 699671860 699545822 698649750 698254242 697891159 698170395 698559113 698664856 698894958 698959503 699242325
2070.5 699242325 699267731 699102631 698508530 697995224 697567596 697587509 697979202 697817993 698042679 698238983
2080.2 698238983 698471298 698347702 697857742 697443848 697165604 697081451 696416473 696402283 696642456 696818466
2089.8 696818466 696941986 696910858 697111893 696812439 696714401 696276169 695991821 696127472 696054764 696014481
2099.5 696014481 695836716 696013336 695969315 695934677 695657959 695404510 695347977 695164948 695323334 694958038
2109.1 694958038 694970627 694964676 694841766 694946518 694575653 694457169 694527512 694650726 694244308 694063339
2118.7 694063339 694089355 693982086 694080048 693930435 694175186 694307175 694207153 693445969 693254166 694025040
2128.4 694025040 693728027 693267212 693162918 693677521 693815079 693522644 693509216 693224106 693167419 693226929
2138 693226929 693601913 693718796 693805923 693742752 693422928 693589325 693514862 693524780 693344345 693152466 693181534
2148.6 693181534 693423386 693560867 693394165 693461304 693198776 693378525 693323517 693012619 692881622 692741928
2158.3 692741928 693291702 693550339 693625717 693377991 693441620 694000549 694422379 694245605 693236618 693131561
2167.9 693131561 693054123 693047791 693024673 693019104 693799515 693920746 694155426 694358902 694142914 693592911 693290710
2178.5 693290710 693439636 693151245 693309402 693691788 694180832 694475021 694576797 694646149 694505920 694140854
2188.2 694140854 693615341 693682251 693296814 693287964 693620529 693821182 694572067 694837952 695003815 694707718
2197.8 694707718 694365540 694052505 693504410 693273239 693463898 694214935 694432526 694698944 695000839 695478210
2207.5 695478210 695926437 695616226 695177765 694398727 694307938 694275513 693941116 693819351 694290848 695194168
2217.1 695194168 695446014 695808334 695594940 695348282 694992828 694261856 694212570 694228058 694487839 694579391
2226.8 694579391 695017548 695388641 695349808 695399017 695056686 694784698 694667587 694751129 694142380 694030991
2236.4 694030991 694633331 694557266 694508133 694629135 694941864 694747696 694760361 694686661 694276428 694179840
2246 694179840 694150772 694585419 694456787 694621353 694826279 694584808 694541855 694195251 693665237 693202362
2255.7 693202362 693665543 693490219 693144608 693331146 693400879 693578110 693215561 693498840 693563538 693272705
2265.3 693272705 692705383 692321091 692590714 692232208 692630005 692968445 693123245 693050079 692945480 693250122
2275 693250122 692915802 692768402 692432251 692736359 692753906 692315521 692406006 692575302 692948303 692635651
2284.6 692635651 692570953 692106018 691923981 691768951 691073303 690913239 690268250 690360107 689689102 689031219
2294.3 689031219 688541031 687754593 687807159 687272339 687560501 686988297 686569672 686127548 685182800 685163879
2303.9 685163879 683834305 683261566 682078323 680942154 680111618 679305649 679310379 677838974 677550278
2312.6 677550278 676342697 675861893 675708313 674096985 673378983 671883469 671636658 669672775 667710114
2321.3 667710114 666568756 664925461 665052261 664549713 664668121 662980194 661467667 659896622 658452682
2329.9 658452682 658777618 658656769 659624329 658142700 657619476 657182693 656067886 655738144 655337524
2338.6 655337524 656340790 654465485 653894806 654270935 654400253 655066299 656453552 659517365 662227173
2347.3 662227173 666029129 666354675 663163910 659922104 656808929 654260712 651042099 648561554
2355 648561554 646559372 643396759 640272293 638684731 637771645 637440453 639571495 641585999 643541565
2363.7 643541565 644592743 646553802 647963333 648756027 650749512 652241592 654246597 655881882
2371.4 655881882 658932190 661951904 664264374 666678085 668691177 670607986 671271973 672833099
2379.1 672833099 674908066 676479721 677863998 679087143 680592346 681652985 682318115 682449417 682849884
2387.8 682849884 682975235 682431030 681923828 681504822 681570358 681162643 681028214 680752335 680686951 681430054
2397.4 681430054 681554642 681639862 681007309 680217285 679675140 679459915 679346924 678616180 678707123 679094009
2407.1 679094009 679483948 679529495 679168167 678749847 678116074 677787094 677650146 677681808 677150192 676987305
2416.7 676987305 677161484 676914673 676937866 676840897 676725998 676233139 675716934 675284958 675065155 674898224
2426.4 674898224 674379578 674247131 673891296 673891296 673956070 673750000 673658142 673302383 673055496 672586288 672180634
2437 672180634 671721344 671584930 671729507 671522751 671369019 671156158 671013412 670477295 670227127 670312576
2446.6 670312576 670075378 669842987 669334793 668883286 668644485 668532257 668237915 667959290 667621841 667354355
2456.3 667354355 667310181 666856613 666509705 666142044 666049271 665892792 665639267 665610809 665168915 664969864
2465.9 664969864 664453049 663931732 663729401 663520203 663317642 662952499 663016891 662770844 662147751 661417618
2475.6 661417618 661206894 661542892 661444016 661053696 660505295 660218658 659573669 658934937 658795013 658832932
2485.2 658832932 658694839 658102875 657986450 657854767 657850189 657496414 656554718 656035538 655746307 655424881
2494.8 655424881 654610519 654245453 654007187 653904953 653861160 653320694 653324203 652872925 652499161 652212906
2504.5 652212906 651675415 651423950 650919113 650629807 650158920 649753113 649609375 649669418 649559479 649144592
2514.1 649144592 648845596 648145294 647829590 647481384 647103043 647004547 646734238 646572418 646259766 646146240
2523.8 646146240 645782700 645278854 644975281 644594727 644274292 643797760 643081436 642505341 642614670 642677078
2533.4 642677078 642656937 642431183 642300186 642383881 641590652 641080246 640553131 639918861 639702339 639443550
2543.1 639443550 639528847 639443512 638992195 638414001 638212967 638165512 638023491 637708473 637267609 637007751
2552.7 637007751 636222534 635953941 636108131 635938988 635849152 635537529 635023117 634487114 634335747 634072571
2562.4 634072571 633689117 633127747 632672234 632699242 632462997 632442131 632155762 631543732 631087456 630908012
2572 630908012 630884666 630475655 629957504 629402161 629280281 628929214 628616486 628753929 628558884 628289566
2581.6 628289566 627760162 627478447 627047081 626729851 626751862 626390686 626122360 625702782 625435944 624887810
2591.3 624887810 624390144 624287529 623929405 623750954 623454399 623074303 622555809 622263107 622202568 622078819
2600.9 622078819 621849785 621338959 621005020 620590286 620482292 619930801 619058380 618950996 618713684 618414879
2610.6 618414879 618100891 617868042 617499161 617121925 616983986 616806145 616471748 615564690 615343399 615565681
2620.2 615565681 615097008 614233971 613737526 613706398 613011932 612449989 612288170 612085495 611960983 611354523
2629.9 611354523 610472755 609814758 609688301 609691696 609242516 608862076 608971443 608842545 608430710 607879601
2639.5 607879601 607308121 607124901 606551628 605909767 605647736 605565834 605247688 604558182 604141083 603568611
2649.1 603568611 603294067 603383141 603134079 602551498 602063370 601850471 601530304 601421471 600901718 600322304
2658.8 600322304 600143585 600033073 599916992 599144287 598623352 598479652 598383064 597989731 597394028 597497406
2668.4 597497406 597470665 597085152 596657600 596529694 596223526 595736313 595682602 595449829 595291862 595087585
2678.1 595087585 594826126 594519005 594043427 593577461 593192863 593170624 592854347 592289963 591887245 591505241
2687.7 591505241 590953598 590774612 590933990 590700378 590615273 590552902 590456619 589957809 589348450 589099655
2697.4 589099655 588712654 588664360 588417130 588149261 587968025 587823410 587869034 587341652 586793251 586429138
2707 586429138 586229057 585871887 585609055 585533295 585232430 585243530 584921951 584595184 584413147 583975105
2716.6 583975105 583638191 583514442 583507462 583086052 582822723 582657051 582355881 582416534 582453232 581909332
2726.3 581909332 581435738 581612854 581513710 581106834 580401001 579989243 580150414 579907722 579399376 578986244
2735.9 578986244 579411201 579848251 579676933 579403267 578971291 578897324 578754082 578183289 577573166 577747955
2745.6 577747955 578156815 577849808 577525406 577254486 576918297 576297531 576028175 576384773 576425514 576042938
2755.2 576042938 575596962 575381203 574967651 574457321 574279022 574413834 574516411 574301758 574187546 574148560
2764.9 574148560 573638191 573159294 573323021 572786064 572074547 572084312 571922989 571675072 571366997 571427841
2774.5 571427841 571098862 570501289 570314217 569557533 568886261 568627014 568610764 568453178 568154526 568034897
2784.2 568034897 567974663 567960739 567462082 567071266 566726456 566116905 565354729 564833221 564676704 564038925
2793.8 564038925 563619995 563357124 563468475 563599663 562764740 562001076 561196289 560323219 559661064 559496040
2803.4 559496040 559507866 558924255 558470078 558273811 557804642 557130661 556584091 555712128 554666405 554113197
2813.1 554113197 553868179 553379745 552682457 552315559 551900444 551529999 550850220 550126648 549661827 548673172
2822.7 548673172 547885628 547044220 546377640 546112556 545688133 545176353 544478264 544177055 543634567 542385635
2832.4 542385635 540913162 539749222 538911324 538178215 537684212 536790390 535594330 534049530 532802582
2841.1 532802582 531543655 529385529 527404137 525561562 524159012 522703323 520707283 518898315
2848.8 518898315 517404861 515949287 514168205 513110580 512564468 512046051 511388512 510991020 511541367
2857.4 511541367 511695976 511993141 512416077 512169189 511819191 511581802 511459389 511046867 510830231 510422020
2867.1 510422020 509333534 508503990 508044128 507383728 506664429 506583061 506727219 506310539 505430679 504801140
2876.7 504801140 504571533 504509239 504241104 503551102 503084869 502633362 501635208 500450630 499798241 499300766
2886.4 499300766 498692474 497985191 496847763 496036644 495375595 494827232 494001350 492764053 492169724
2895.1 492169724 491395683 490549316 489786148 488892517 488377609 488105392 487683144 487084427 486591415 485307503
2904.7 485307503 483977470 483188553 482383194 481773911 480630722 479534798 478760376 477702980 476072044
2913.4 476072044 474102058 472488823 471095390 469741211 467860565 466408882 465412636 464175034
2921.1 464175034 463565750 462560196 461621513 461507187 461220169 461021538 461260452 461922913 462546043
2929.8 462546043 462874527 463168602 463049660 462662659 463185310 464451904 465369453 466018410 467246361
2938.5 467246361 468625717 469310760 469987106 470845375 471703606 472243805 472551346 473056870 473323708
2947.1 473323708 473929482 474621544 474689751 474870987 475826302 476766968 476832047 476911888 476997986 476948891
2956.8 476948891 477184296 477923317 478698235 478700714 478952789 479746208 480583305 481532059 482599297 483614006
2966.4 483614006 484420319 485130310 485522041 485873299 486652260 487826424 488797722 489195213 489160538 489500618
2976.1 489500618 490363731 490825768 491453781 492021751 492417374 492789078 492633095 492309418 492441559 493692284
2985.7 493692284 494095840 493813820 494247017 494493637 494905167 494932823 494894447 494647751 494014435 493955688
2995.3 493955688 494064980 494451637 494332657 493529510 493047752 493179741 492948456 492272644 491879883 491072502
3005 491072502 490538177 490381813 490392418 490370789 489906807 489363441 488439522 487853050 487577477 487301598
3014.6 487301598 486856346 486092415 485539207 485187416 484960670 484188995 483917236 484192429 483816986 483111916
3024.3 483111916 481868782 480875778 480816231 481085129 480598602 479654999 478904495 478051491 477622261 477198296
3033.9 477198296 476665802 476093407 475295715 474469414 473662338 472895660 472203941 472297554 472198219 471084366
3043.6 471084366 470004616 469403191 469121552 468810387 468320656 467504005 466705360 466012306 465253906
3052.2 465253906 464654808 464318466 463853035 462936783 462101135 461343803 460896835 460353699 459502449 459186974
3061.9 459186974 458769875 458147202 457673378 457382584 456830559 455835152 455100708 454689407 454464226 453917351
3071.5 453917351 453242645 452509384 451666260 451114578 450671463 450491524 450270729 449694099 448974648 448513603
3081.2 448513603 447997475 447217445 446863327 446396255 445435143 444635162 444427757 444295692 443923302 443207321
3090.8 443207321 442539062 442566948 442000237 440902061 439877853 439002571 439018288 438865280 438026352 437482452
3100.5 437482452 437148361 436436691 435764084 435018349 434453888 434271088 433811722 433285904 432201385
3109.1 432201385 431320038 431012764 430401726 430042992 429683762 429096451 428453598 427886810 427066193 426183319
3118.8 426183319 425696678 425213699 424685020 423693542 422846107 422410469 422038727 421403542 420569954 420054779
3128.4 420054779 419075775 418261566 417605858 417008247 416805077 416232643 415781326 415116425 414423332 414040451
3138.1 414040451 413483047 412509727 411258316 410525131 410080910 409719963 409136620 408194618 407439651
3146.8 407439651 407269821 406900673 405914154 405049629 404035797 403494072 402848282 401926575 401615677
3155.4 401615677 401207848 400703392 399746513 399023552 398452225 397825317 397274590 395766220 394760857
3164.1 394760857 394397392 393833237 393201294 392698174 392170525 391143265 390375290 389768829 389287109
3172.8 389287109 388655357 387847214 387260361 386821175 386424255 385568275 385143890 384263039 382872162
3181.5 382872162 382442284 382154999 381501465 380265121 379304047 378809967 378416862 377940216 377015648
3190.1 377015648 376598320 376040726 375006828 374509888 374060707 372967567 372333565 372456322 371858253
3198.8 371858253 371027069 370448418 369896469 369541359 368984871 368188210 367661781 367322998 366871681 366388664
3208.5 366388664 365522232 364854584 364605827 364145355 363593826 362896729 362430153 362174568 361770744 360925293
3218.1 360925293 360126457 359822617 359246063 358785210 358384781 357856102 357553101 356971207 356070862 355440102
3227.8 355440102 355201988 354912033 354788704 354819984 354560966 353737488 352553787 351875038 351329155 350649490
3237.4 350649490 350465012 350023155 349198303 349062004 348920937 348509445 348074532 347234688 346713181 346444473
3247 346444473 345994911 345178413 344489861 344132729 343678741 344052162 344361725 343669281 342673302 341966476
3256.7 341966476 341759605 341254082 340570335 339963913 339658241 339686775 339478302 338737450 337941895 337835846
3266.3 337835846 337692070 337330971 337269478 337164307 336258430 335660706 335933647 335360756 334640732 334375648
3276 334375648 334253197 333986092 333656006 333448563 332509613 331783066 331569862 331822281 332103233 331709480
3285.6 331709480 331513481 331479492 331085854 329975739 329524498 329713249 329230652 328181992 327430687
3294.3 327430687 328005180 328051567 327453346 327074242 326919174 327006187 326284256 325817451 325572891 325397339
3303.9 325397339 325306778 324999428 324969559 324564934 324184418 323945580 323851357 323364563 322689514 322417221
3313.6 322417221 321522789 320946121 320739403 320571747 320329399 319822483 319387455 318856335 318817539 318486691
3323.2 318486691 317698498 317154274 316751423 316161747 315421391 315210133 314757290 314218636 313854866 313523655
3332.9 313523655 313263702 312351189 311439915 311074085 310969543 310684509 310140419 309213905 308302975 308045216
3342.5 308045216 307741051 307328510 306851006 306405125 306076546 305729713 305388374 304961262 304692936 304303169
3352.2 304303169 303844204 303165951 302449017 302213173 302019386 301817112 301809521 301857185 301072330 300162449
3361.8 300162449 300087967 300099506 299896564 299469185 299006863 298412399 298242931 298288994 297854061 297578182
3371.4 297578182 297455292 297371082 297056427 296509647 296266937 296347256 296008797 295521126 295493546 295200500
3381.1 295200500 295158100 295047531 294673615 294709873 294624481 294376392 293836212 293744144 293854160 293405895
3390.7 293405895 292806950 292221031 292499886 293128433 293404713 293218517 292727642 292338181 291960583 292279568
3400.4 292279568 292883606 292704086 292090511 291740093 291601810 291488800 291550808 291364288 291091423 291632576
3410 291632576 292369938 292227135 291887856 291739006 291548595 291486168 291727505 292245655 292368336 292590218
3419.7 292590218 292588730 291704845 291877937 292923470 293189983 292932568 293032322 293635025 294124317 294026680
3429.3 294026680 293932953 294162827 294508381 295043278 295362473 295399323 295377998 295764923 296171722 296208000
3439 296208000 296554356 296858673 297177010 297071381 296871071 297378387 298286190 299465427 299733086 300174141
3448.6 300174141 300921307 300979233 300973606 301209583 302182293 302685165 302924595 303506107 304063511 305199604
3458.2 305199604 305641155 305506954 305975571 306798801 307621498 308179321 308444023 309091320 310184650
3466.9 310184650 310523949 310912704 311741028 312370110 312718410 313004951 313842106 314391880 314920635 316255436
3476.6 316255436 317291603 317705841 318175240 318694515 319244022 319823761 320315590 321210289 322186127
3485.2 322186127 323173447 323840446 324297676 325472794 326476250 327048912 327305145 327851143 328797836
3493.9 328797836 329568558 330090981 330483475 331790199 332942619 333566360 334314194 335033989 335946236
3502.6 335946236 336406593 337000771 337880516 338333473 338924522 340340424 341156578 341279488 342575569
3511.3 342575569 344050179 345461655 345951195 346233635 347323418 348300667 349765015 350560913 351024208
3520 351024208 352141075 353578339 354828033 354947968 355291939 356018105 357233200 358599129 359642830
3528.6 359642830 360262947 361071625 362327690 363032990 364063492 365407448 367333794 368099556 368012085
3537.3 368012085 369601784 370422363 371233597 372237892 373416672 375092621 376556664 377891350 378519249
3546 378519249 379477386 380063286 382234192 383896103 384457664 386097260 386106758 387597427 389049873
3554.7 389049873 390221519 392214661 393203239 394996338 395973740 396340370 397001152 399632568 402002449
3563.4 402002449 401905441 404300461 404747581 405086784 406694145 407309303 410141945 411939163 413964272
3572 413964272 415750809 416669121 417486916 419283600 421497574 421929092 424042854 426178474 427182312
3580.7 427182312 428466721 430243912 432000122 432916603 436493454 437935944 437061539 439357605 439718513
3589.4 439718513 442730827 445538902 447782211 449156456 450082550 452538414 451843414 454044838 457046356
3598.1 457046356 458731918 462028847 462421951 463453140 465827560 467071877 468948135 472154160
3605.8 472154160 474607048 473988571 477378349 478297844 479053383 485818901 487598381 487020912 490606041
3614.5 490606041 490725708 493835411 496697655 497078018 500091743 500892525 501535339 504043388 506632576
3623.1 506632576 509114227 511767578 513724289 516494141 523956909 526314468 515369720 518655624
3630.9 518655624 523940659 528957748 530968933 531279144 534635811 537981453 540448189 541665154
3638.6 541665154 543663101 546398392 548783913 550428886 551190376 553391342 556888466 561848412
3646.3 561848412 562133522 560373764 565478287 565835571 563941574 564634323 569749527 574039268 577955322
3655 577955322 582691689 576898193 578967628 584057999 585847321 587912788 588869934 591129265 592488518
3663.6 592488518 593402596 594561882 595604095 599796333 601977081 601674995 601007042 595867043 599120522
3672.3 599120522 606484299 613690453 608639984 592881165 600172882 609245110 613885117 612062263
3680 612062263 613681870 617050705 618500443 619239769 619339142 620039902 623425140 628482170 620077629
3688.7 620077629 616608849 623961754 619462967 620122604 625597839 627261581 629256554 628890419 627941322
3697.4 627941322 628818016 628641739 630605545 633448448 629370422 627502403 631837463 633808823 634226608
3706.1 634226608 634684372 636657867 639163322 632489815 636060829 638818741 627364120 633200874
3713.8 633200874 638830643 639958763 639966812 641377029 642497482 639160767 639813080 644337158 640294724
3722.5 640294724 635777321 640102158 640857086 640288696 638775558 639562302 643384171 643655701 647756348
3731.2 647756348 646659622 640203552 647341995 647208786 639997635 641589432 642773972 643094864 645979614
3739.8 645979614 648644943 644866104 647768326 657947845 648279495 635309448 644072800 648852310
3747.5 648852310 654292374 651201096 640955887 650854568 647671432 641775742 646870270 651238556
3755.3 651238556 654260254 649563217 651919861 656672058 649586411 648416214 651717224 652946167
3763 652946167 653312988 656130219 653544388 649488831 653327408 658221664 658601913 650218658 651275330
3771.7 651275330 654153900 654145355 654697571 654578857 655934982 656871872 659370499 658761215 651171112
3780.3 651171112 653916473 656440659 657395248 659095688 656369095 655604630 656331482 657054214 657708435
3789 657708435 657227936 657750778 658309555 658744888 657565842 657744370 660874634 657766876 654491348
3797.7 654491348 656598587 660221710 665190582 658205872 648972092 651744461 654617157 659953461
3805.4 659953461 664669495 655619736 652461777 657185516 659167862 659744339 660592804 660143356 660513916
3814.1 660513916 664759140 662904129 651479111 655949326 660796432 664078674 664635162 650719452
3821.8 650719452 652833633 657314835 659405136 661707382 660554428 657270355 658365326 659706726
3829.5 659706726 661874695 662450867 655320663 658523102 665113525 659249573 658078613 665518723
3837.2 665518723 658668518 654065933 660581818 656614838 656806793 662386856 660006027 657193756
3844.9 657193756 659601974 660919342 661239090 662229538 660331116 661793442 666517563 658968964 658513031
3853.6 658513031 648878098 651486053 660797119 659884796 658185730 660243378 662373123 663993912
3861.3 663993912 659055099 659568329 665208130 659364014 654178543 657915573 662731171 668478394
3869.1 668478394 661397476 651162720 655325317 662212067 665394745 656419754 657442322 660992203
3876.8 660992203 660585785 662483292 666259766 661530762 654996643 659357224 660238419 661983185 666688461
3885.4 666688461 656065979 656951752 660556870 661184921 664297028 662738800 655489197 657049179
3893.2 657049179 660293427 659096146 660119247 661111374 662681274 664076920 656298523 661417084
3900.9 661417084 663990326 658127441 661072159 658746643 657228546 657279968 658506546 660739594 660540314
3909.6 660540314 660653458 660975952 662037506 661501312 660089111 661141663 661923141 658271866 656533051
3918.2 656533051 661239624 660928192 656659851 658947525 661358948 662286682 660189056 657315979 658618851
3926.9 658618851 660234222 660518036 659541397 660849762 663178329 660048065 657890701 659355469 659674606
3935.6 659674606 659919052 660839615 660619888 659874191 659322357 660143890 660694427 657015762 657039490 659157639
3945.2 659157639 659863892 660295486 657495499 658199158 659607086 657794724 659957275 661166458 660363617
3953.9 660363617 660250931 659970932 659066162 657920532 658816528 658935013 658881607 659247360 658431244 659012222
3963.6 659012222 659760132 659617920 659381256 658962326 658770370 658791122 658696136 659126129 659043808 658153458
3973.2 658153458 658291168 658564529 658620377 658655548 659425735 660189819 659618301 659831924 660237732 659524155
3982.8 659524155 658698349 658282166 658031464 658662720 658925552 658052521 658832245 659174194 658588638 658835526
3992.5 658835526 659149475 659436798 658473129 658107224 658848953 659061203 659060135 659509964
4000.2 659509964
##END=$$ End of the data block
