##TITLE=$$ Begin of the data block
##JCAMP-DX=5.00 $$ ACD/SpecManager v 10.08
##SPECTROMETER/DATA SYSTEM=Varian
##DATE=08 Jan 2013 15:20:30
##DATA TYPE=INFRARED SPECTRUM
##DATA CLASS=XYDATA
##ORIGIN=
##OWNER=
##NPOINTS=3735
##FIRSTX=399.26403809
##LASTX=4000.35498047
##MAXX=4000.35498047
##MINX=399.26403809
##MAXY=71.13780212
##MINY=29.15846062
##XFACTOR=1.0000000000
##YFACTOR=0.000000100000000
##FIRSTY=44.96275330
##DELTAX=0.96440572
##XUNITS=1/CM
##YUNITS=TRANSMITTANCE
##XYDATA=(X++(Y..Y))
$$ plain form
399.3 449627533 457320709 468907013 485223732 493053017 487077026 476161766 470624504 468050232
407 468050232 468639984 470629425 475660248 478206902 476782761 478475418 477651062 477201080 479324837
415.7 479324837 480565147 477732124 469435310 471330414 472863693 474367409 475600052 481897011
423.4 481897011 484414482 478792000 475636253 477706642 482498474 476399841 466066360 468265343
431.1 468265343 476118469 479571266 473796310 469138374 470230331 468213539 470063019 473980026
438.8 473980026 474743347 475115929 474309502 473370590 473970795 478748169 483164444 477561951 475220985
447.5 475220985 478133545 475838127 476325989 475393219 474181595 474597931 470956726 470179558 472465553
456.2 472465553 473408775 470190277 469375572 467175598 464296417 464640312 467813339 473399925 473394623
$$ packed form
399.3D49627533P693176J1586304J6316719P829285n975991j0915260n537262k574272
407D68050232N89752J989441N030823K546654j424141J692657q24356m49982K123757
415.7D79324837J240310k833023q296814J895104J533279J503716J232643O296959
423.4D81897011K517471n622482l155747K070389M791832o098633j0333481K198983
431.1D68265343P853126L452797n774956m657936J091957k016792J849480L917007
438.8D73980026P63321L72582q06427r38912O00205M777374M416275n602493k340966
447.5D75220985K912560k295418M87862r32770j211624M16336l641205p77168K285995
456.2D72465553R43222l218498q14705k199974k879181L43895L173027N586586n302
$$ plain form
464.8 473394623 468287582 461182327 461556053 467318039 461628418 460410233 463893661 462370300 465292969
473.5 465292969 468048935 468346786 467143593 466876831 467164001 467331467 467885246 465398865 463013916
482.2 463013916 462211533 458539581 459234161 463809891 463185959 461588135 460858994 457558212 455435753
490.9 455435753 455642891 454836082 453710480 454978600 458020706 459661674 458083229 458937607 461503181
499.6 461503181 459958267 458710594 459320259 459048080 457376022 455682869 455199776 453065491 453319855
508.2 453319855 456421051 458382607 459354324 457999077 454552879 452104301 450687485 449002228 447240524
516.9 447240524 449484978 452589340 451436844 448640251 447781525 450890732 452077827 450563354 451341362
525.6 451341362 449572029 447091141 446135445 448713417 451833000 451720161 452621117 451033745 448429680
$$ packed form
464.8D73394623n107041p105255L73726N761986n689621j218185L483428j523361K922669
473.5D65292969K755966K97851j203193k66762K87170J67466N53779k486381k384949
482.2D63013916q02383l671952O94580M575730o23932j597824p29141l300782k122459
490.9D55435753K07138q06809j125602J268120L042106J640968j578445Q54378K565574
499.6D61503181j544914j247673O09665k72179j672058j693153m83093k134285K54364
508.2D53319855L101196J961556R71717j355247l446198k448578j416816j685257j761704
516.9D47240524K244454L104362j152496k796593q58726L109207J187095j514473P78008
525.6D51341362j769333k480888r55696K577972L119583j12839R00956j587372k604065
$$ plain form
534.3 448429680 448260994 448594437 448409843 447299156 447298775 446168175 445330315 445180550 444947090 445921440
543.9 445921440 446414413 447210159 446280823 445315208 445279617 443917084 442771683 441970634 442560692 444239998
553.6 444239998 445910072 445448494 443712044 443107262 441486320 440018578 439858856 440730515 442393112
562.3 442393112 443030128 442160683 442225990 443644447 443816223 442351227 440793915 440751457 440857430 439676323
571.9 439676323 438831367 439958076 441945763 442235374 442069283 442463531 442714424 442036400 440578766
580.6 440578766 440353851 441040459 440888062 439521713 439389725 439575233 439039612 439825668 441905174
589.3 441905174 444057541 444021339 442424011 441423378 441766434 443771706 444339409 442944489 443219452
597.9 443219452 444535446 444498062 444714470 444450760 444087105 444154434 443712311 443463135 441187897 440244141
$$ packed form
534.3D48429680j68686L33443j84594j110687l81j130600q37860j49765k33460R74350
543.9D45921440M92973P95746r29336r65615l5591j362533j145401q01049N90058J679306
553.6D44239998J670074m61578j736450o04782j620942j467742j59722Q71659J662597
562.3D42393112O37016q69445O5307J418457J71776j464996j557312m2458J05973j181107
571.9D39676323q44956J126709J987687K89611j66091L94248K50893o78024j457634
580.6D40578766k24915O86608j52397j366349j31988J85508n35621P86056K079506
589.3D41905174K152367l6202j597328j000633L43056K005272N67703j394920K74963
597.9D43219452J315994l7384K16408k63710l63655O7329m42123k49176k275238r43756
$$ plain form
607.6 440244141 442220650 442696648 441032562 438876305 439579163 440519409 439819450 439115334 437582283
616.3 437582283 436442337 437155457 439023209 439385185 439359207 440149345 441060066 442160187 442411690
624.9 442411690 442634811 443282433 443662872 443325500 443709259 445489998 447022400 448490753 450408554
633.6 450408554 452662315 453831367 454556503 455261726 454652672 454038773 453568497 454983215 458363876
642.3 458363876 460959320 462427979 462756004 463248940 462586594 459842072 459169884 460322304 461392479
651 461392479 463554687 466131821 467507286 467588463 467121582 467104912 467043648 465891571 465467873 465093727
660.6 465093727 463529358 463503952 465649796 467917938 469729042 470122032 463915329 445103035 454814224
669.3 454814224 462326279 464498749 464750938 465333481 466361732 469638672 472806778 472951088 473555031
$$ packed form
607.6D40244141J976509M75998j664086k156257P02858R40246o99959p04116j533051
616.3D37582283j139946P13120J867752L61976k5978P90138R10721J100121K51503
624.9D42411690K23121O47622L80439l37372L83759J780739J532402J468353J917801
633.6D50408554K253761J169052P25136P05223o09054o13899m70276J414718L380661
642.3D58363876K595444J468659L28025M92936o62346k744522o72188J152420J070175
651D61392479K162208K577134J375465Q1177m66881j6670o1264j152077m23698l74146
660.6D65093727j564369k5406K145844K268142J811104L92990o206703j8812294R711189
669.3D54814224P512055K172470K52189N82543J028251L276940L168106J44310O03943
$$ plain form
678 473555031 474318085 473534279 473289948 473653679 473832932 475228004 476907578 478128242 480931168
686.7 480931168 482463989 482944260 484514198 484791985 485421829 485730743 485232162 485659599 485997543
695.3 485997543 486596260 487216034 488446808 490131073 490841331 490829277 490065575 490190659 491605301
704 491605301 493016815 494286308 494490013 494505539 495683479 496413574 496691132 497663612 497621231 496864738
713.7 496864738 497942963 499367714 499984169 501337624 502293968 501531219 500872231 502231064 503495827
722.3 503495827 503265724 503185692 503577385 504919014 506728172 508324051 509707489 510238953 510664101
731 510664101 510860176 511261711 511571121 512026367 513210983 514045677 515288925 515577354 515067673 514755211
740.7 514755211 515445709 517271271 517858276 519100876 520202332 520758438 521863403 521856842 521848259 522117500
$$ packed form
678D73555031P63054p83806k44331L63731J79253J395072J679574J220664K802926
686.7D80931168J532821M80271J569938K77787O29844L08914m98581M27437L37944
695.3D85997543N98717O19774J230774J684265P10258j2054p63702J25084J414642
704D91605301J411514J269493K03705J5526J177940P30095K77558R72480m2381p56493
713.7D96864738J078225J424751O16455J353455R56344p62749o58988J358833J264763
722.3E03495827k30103q0032L91693J341629J809158J595879J383438N31464M25148
731E10664101J96075M01535L09410M55246J184616Q34694J243248K88429n09681l12462
740.7E14755211O90498J825562N87005J242600J101456N56106J104965o561q583K69241
$$ plain form
750.3 522117500 522469711 521802483 521277885 522585564 524093285 525041962 525589714 527361221 528879509
759 528879509 529344177 530222702 530951843 531446762 531369247 531499100 532357521 533100739 533357353 534218597
768.6 534218597 535330391 535062180 534437599 534274902 533963890 533241882 533545074 534186668 534431458 535099373
778.3 535099373 535385475 536197205 537158661 536840630 535797310 535440483 535655136 535396690 535517006 536184959
787.9 536184959 537282181 539193840 541487885 541892128 540801468 540596161 540258179 539092789 537811584
796.6 537811584 537773018 537759743 537831573 538607025 538642654 538165741 535864983 533473015 531986313 530471001
806.2 530471001 529651108 528083687 526593933 526506310 526270103 525021553 523691940 522479782 521555252
814.9 521555252 520473938 518639832 517354126 517006721 517909393 518706589 518749466 519844170 522053833
$$ packed form
750.3E22117500L52211o67228n24598J307679J507721R48677N47752J771507J518288
759E28879509M64668Q78525P29141M94919p7515J29853Q58421P43218K56614Q61244
768.6E34218597J111794k68211o24581j62697l11012p22008L03192O41594K44790O67915
778.3E35099373K86102Q11730R61456l18031j043320l56827K14653k58446J20316O67953
787.9E36184959J097222J911659K294045M04243j090660k05307l37982j165390j281205
796.6E37811584l8566j3275P1830P75452L5629m76913k300758k391968j486702j515312
806.2E30471001q19893j567421j489754q7623k36207j248550j329613j212158r24530
814.9E21555252j081314j834106j285706l47405R02672P97196M2877J094704K209663
$$ plain form
823.6 522053833 524064827 525166664 526072998 525885353 526402931 529474602 532244415 534320984 536553955
832.3 536553955 539446106 542278481 544411316 546170845 547923088 549645157 550350418 550761528 551497345
841 551497345 553859596 555814934 557363472 559556618 560225525 561744461 562838097 563562737 564442101
849.6 564442101 564724350 565648422 566200981 567999039 569300880 570162849 572231216 574032249 575158920
858.3 575158920 575654030 576907730 577950249 578599663 578258324 578131981 579375458 579764709 579436111
867 579436111 579413834 579545631 578011703 576654243 574836960 572770424 572248154 571858406 572504158 571646042
876.7 571646042 570592804 570191116 568947258 568620262 568461533 568459625 567805405 566979904 566238327 565708237
886.3 565708237 565461006 564909554 564223099 563555984 564464836 564419632 563875160 563782501 563459511 564345741
$$ packed form
823.6E22053833K010994J101837R06334j87645N17578L071671K769813K076569K232971
832.3E36553955K892151K832375K132835J759529J752243J722069P05261M11110P35817
841E51497345K362251J955338J548538K193146O68907J518936J093636P24640Q79364
849.6E64442101K82249R24072N52559J798058J301841Q61969K068367J801033J126671
858.3E75158920M95110J253700J042519O49414l41339j26343J243477L89251l28598
867E79436111k2277J31797j533928j357460j817283k066536n22270l89748O45752q58116
876.7E71646042j053238m01688j243858l26996j58729j908o54220q25501p41577n30090
886.3E65708237k47231n51452o86455o67115R08852m5204n44472r2659l22990Q86230
$$ plain form
895.9 564345741 565267715 566139832 565497437 564722824 564926834 564582748 564051056 563914909 564854355 565710526
905.6 565710526 567638855 569227867 570037918 571476974 572523270 573262100 573142014 574159966 574074326
914.3 574074326 572444305 570925102 568965225 567622986 565251846 563161964 561148605 558925514
922 558925514 556088333 552872772 551244049 548645973 545907669 543091621 540050354 537640114 534829941
930.7 534829941 532118340 530352707 530100784 529607887 528878136 528355026 527948914 527903099 527080345 525910072
940.3 525910072 524391594 523411789 522730179 522155609 522587471 523026314 523493919 523826828 523950615 523613129
949.9 523613129 523378830 523335800 522235527 520820999 519996452 519847069 519527855 518784676 517251549
958.6 517251549 515163116 512908897 510132332 507646255 505550156 504041557 502912941 501703987
$$ packed form
895.9E64345741R21974Q72117o42395p74613K04010l44086n31692j36147R39446Q56171
905.6E65710526J928329J589012Q10051J439056J046296P38830j20086J017952q5640
914.3E74074326j630021j519203j959877j342239k371140k089882k013359k223091
922E58925514k837181l215561j628723k598076k738304k816048l041267k410240k810173
930.7E34829941k711601j765633k51923m92897p29751n23110m06112m5815q22754j170273
940.3E25910072j518478r79805o81610n74570M31862M38843M67605L32909J23787l37486
949.9E23613129k34299m3030j100273j414528q24547j49383l19214p43179j533127
958.6E17251549k088433k254219k776565k486077k096099j508599j128616j208954
$$ plain form
966.3 501703987 500704384 499739647 497902565 496012421 495272293 493428307 490748138 488681602 486060638
975 486060638 483039360 480644226 478782120 476483459 473314323 469537163 465884628 462156448 458278389
983.7 458278389 454412308 450118179 446128273 442728462 439051361 435301743 431915627 428469238
991.4 428469238 425257378 422157555 419129333 415998459 413010368 410198135 407397881 405279388
999.1 405279388 402196007 399198189 397180214 395739441 394843407 392789917 390784721 389086685 387551727
1007.8 387551727 386124649 384494629 382789841 381229782 380369492 378816452 377291298 375493889
1015.5 375493889 373308334 371635513 369301300 366345406 363757591 362088814 359898109 357983818
1023.2 357983818 356283112 354289474 352536201 351047020 350625381 349534836 348666801 348005676 347285347
$$ packed form
966.3E01703987r99603r64737j837082j890144p40128j843986k680169k066536k620964
975D86060638l021278k395134j862106k298661l169136l777160l652535l728180l878059
983.7D58278389l866081m294129l989906l399811l677101l749618l386116l446389
991.4D28469238l211860l099823l028222l130874k988091k812233k800254k118493
999.1D05279388l083381k997818k017975j440773q96034k053490k005196j698036j534958
1007.8C87551727j427078j630020j704788j560059q60290j553040j525154j797409
1015.5C75493889k185555j672821k334213k955894k587815j668777k190705j914291
1023.2C57983818j700706j993638j753273j489181m21639j090545q68035o61125p20329
$$ plain form
1031.9 347285347 346308327 345329895 346137810 346627045 347429962 348164711 349301262 351007919 351991959
1040.6 351991959 352679176 353004341 354450836 355350723 355839348 355419083 354425697 354669800 354065208
1049.3 354065208 353186226 352125969 351123924 349497948 348524628 348246002 346771317 346069603 345756226
1058 345756226 346169319 346499176 348300514 350324478 351366119 354029350 355866203 357645454 359538612
1066.6 359538612 361191292 361657639 362266960 364004173 364589653 365995216 366725845 366729622 366473351
1075.3 366473351 366539650 367285500 367307701 367492256 367078094 368051872 369037819 369389038 370006256 370301628
1085 370301628 370986137 370990524 372250977 373887215 376048355 377939491 378493195 379815559 380922279
1093.6 380922279 382206345 382725830 383850479 385453873 386293983 387672310 388956451 390801010 392331009
$$ packed form
1031.9C47285347r77020r78432Q07915M89235Q02917P34749J136551J706657R84040
1040.6C51991959O87217L25165J446495Q99887M88625m20265r93386K44103o04592
1049.3C54065208q78982j060257j002045j625976r73320k78626j474685p01714l13377
1058C45756226M13093L29857J801338K023964J041641K663231J836853J779251J893158
1066.6C59538612J652680M66347O09321J737213N85480J405563P30629L777k56271
1075.3C66473351O6299P45850K2201J84555m14162R73778R85947L51219O17218K95372
1085C70301628O84509M387J260453J636238K161140J891136N53704J322364J106720
1093.6C80922279J284066N19485J124649J603394Q40110J378327J284141J844559J529999
$$ plain form
1102.3 392331009 394028816 395713234 396950073 398307648 398842773 399132652 399759445 400816765 401227570
1111 401227570 401629677 402313461 403244476 404487953 404862137 405818520 406996880 407255287 406394272 405686226
1120.6 405686226 405619621 405471992 406497307 407593193 408023605 408042068 408788109 410083237 411040611
1129.3 411040611 412260971 413214569 414674034 416346779 418351021 420466499 422857475 425518341
1137 425518341 426665649 427770844 429385986 430756149 431842117 433394356 434595833 434785271 435923004
1145.7 435923004 437241821 438113937 438305473 437840042 437590027 437487564 437883415 437853165 437328987 436901970
1155.4 436901970 436939163 437794952 438002815 436902390 435343437 434093018 433511505 433620491 433967896
1164 433967896 435007782 436437988 437785339 439853363 441958656 444071236 445840302 447281227 449165421
$$ packed form
1102.3C92331009J697807J684418J236839J357575N35125K89879O26793J057320M10805
1111D01227570M02107O83784R31015J243477L74184R56383J178360K58407q61015p08046
1120.6D05686226o6605j47629J025315J095886M30412J8463P46041J295128R57374
1129.3D11040611J220360R53598J459465J672745K004242K115478K390976K660866
1137D25518341J147308J105195J615142J370163J085968J552239J201477J89438J137733
1145.7D35923004J318817Q72116J91536m65431k50015j02463L95851l0250n24178m27017
1155.4D36901970L7193Q55789K07863j100425j558953j250419n81513J08986L47405
1164D33967896J039886J430206J347351K068024K105293K112580J769066J440925J884194
$$ plain form
1172.7 449165421 451620102 453984985 456070862 459173508 462266464 464679718 467060089 468869286
1180.4 468869286 469980774 471152458 472794418 474693336 476008186 477249794 478640137 479296036
1188.1 479296036 480157471 480667000 480888443 481051865 480490341 479939842 479061852 478323059 478096123 478016472
1197.8 478016472 477767639 477163925 476223679 474798164 474048042 473084602 471313438 470427208 470215416
1206.5 470215416 470406342 470127258 469345589 469758224 469882011 468877945 468335876 467954826 467298241
1215.1 467298241 466682053 466293106 466454277 466700058 466586113 466074219 465519104 465296478 464517174 463532333
1224.8 463532333 463191566 462864876 462202492 461354866 461010513 460750542 460001144 459361687 458643532 457938042
1234.4 457938042 457240105 456747665 456638451 456271858 455933037 455930214 456231880 456457787 456376762 455993843
$$ packed form
1172.7D49165421K454681K364883K085877L102646L092956K413254K380371J809197
1180.4D68869286J111488J171684J641960J898918J314850J241608J390343O55899
1188.1D79296036Q61435N09529K21443J63422n61524n50499q77990p38793k26936p9651
1197.8D78016472k48833o03714r40246j425515p50122r63440j771164q86230k11792
1206.5D70215416J90926k79084p81669M12635J23787j004066n42069l81050o56585
1215.1D67298241o16188l88947J61171K45781j13945n11894n55115k22626p79304r84841
1224.8D63532333l40767l26690o62384q47626l44353k59971p49398o39457p18155p05490
1234.4D57938042o97937m92440j09214l66593l38821k823L01666K25907q1025l82919
$$ plain form
1244.1 455993843 455327454 454532089 453643150 453104591 452670059 452246284 452392197 452858353 453017731 453010254
1253.7 453010254 452966347 452493973 451872177 451384468 451279678 451308670 451586151 452275276 452673836 453026962
1263.4 453026962 453144875 453524551 454117012 454315529 454724312 455574112 456674156 457093849 457657013
1272 457657013 458827972 459572716 460411530 461566620 462737045 463660088 464257622 464932251 465834923
1280.7 465834923 466886139 468331413 469976349 471409645 472686768 473514023 473856430 474616966 475563469
1289.4 475563469 476286316 477771606 479159889 479755745 480123253 480786514 481678505 481942062 482190971
1298.1 482190971 482482834 482812538 482992363 483051033 483242378 483261566 483674126 483737526 483514786 483105278
1307.7 483105278 482742615 482655449 482076836 482030830 481646423 480290718 479661789 479979630 480157433 480008278
$$ packed form
1244.1D55993843o66389p95365q88939n38559m34532m23775J45913M66156J59378p477
1253.7D53010254m3907m72374o21796m87709j04790K8992K77481O89125L98560L53126
1263.4D53026962J17913L79676N92461J98517M08783Q49800J100044M19693N63164
1272D57657013J170959P44744Q38814J155090J170425R23043N97534O74629R02672
1280.7D65834923J051216J445274J644936J433296J277123Q27255L42407P60536R46503
1289.4D75563469P22847J485290J388283N95856L67508O63261Q91991K63557K48909
1298.1D82190971K91863L29704J79825N8670J91345J9188M12560O3400k22740m09508
1307.7D83105278l62663q7166n78613m6006l84407j355705o28929L17841J77803j49155
$$ plain form
1317.4 480008278 480107498 480209007 480928726 481664314 482148170 482896118 483887749 485034103 485365944 485558434
1327 485558434 485850830 485909958 485309448 484334946 484076080 483859253 483876648 484210091 484206581 483790436 483556328
1337.6 483556328 483423538 483006325 483339691 484034462 485058594 486057396 486797638 487525139 487933769
1346.3 487933769 488644333 489100609 489115562 488822250 488303757 487782478 487638626 487356758 486817551 487203560
1355.9 487203560 487531738 487894440 487795219 487031288 486068268 485190849 484593391 483355904 484145508 484759827
1365.6 484759827 484566345 484659271 484038277 483606949 483060799 482386932 481808662 481363411 480576859 479794350
1375.2 479794350 480405350 480822258 481426430 481618652 481482620 481084976 480004005 478962708 477276077
1383.9 477276077 475859718 475052299 474388809 472911186 472265587 472210464 471019478 469462357 467475624
$$ packed form
1317.4D80008278R9220J01509P19719P35588M83856P47948R91631J146354L31841J92490
1327D85558434K92396N9128o00510r74502k58866k16827J7395L33443l510m16145k34108
1337.6D83556328j32790m17213L33366O94771J024132R98802P40242P27501M08630
1346.3D87933769P10564M56276J4953k93312n18493n21279j43852k81868n39207L86009
1355.9D87203560L28178L62702r9221p63931r63020q77419n97458j237487P89604O14319
1365.6D84759827j93482R2926o20994m31328n46150o73867n78270m45251p86552p82509
1375.2D79794350O11000M16908O04172J92222j36032l97644j080971j041297j686631
1383.9D77276077j416359q07419o63490j477623o45599n5123j190986j557121j986733
$$ plain form
1392.6 467475624 465776939 463114891 459950218 458863258 457733727 456356087 453815956 452804680
1400.3 452804680 452176743 450502281 448965073 446838608 443423691 441600113 440973206 439583206 438304596
1409 438304596 437357140 435959244 434989014 433954124 432989731 432045670 430859261 429450836 428067245
1417.7 428067245 427895088 425930138 426448479 428330917 429166260 429658356 429236565 430158958 430950851
1426.3 430950851 430896683 431505585 431684914 432492027 433721390 435282516 436361389 437472687 439319916
1435 439319916 439718628 438807564 440359344 442799187 444234695 445572891 447107658 448198166 449880104
1443.7 449880104 450842972 451807480 452295265 452494545 452732544 453933983 455579147 455958366 457272720
1452.4 457272720 458515549 459817276 460764542 460459366 458824959 458359833 463211975 466146545 468984756
$$ packed form
1392.6D67475624j698685k662048l164673j086960j129531j377640k540131j011276
1400.3D52804680o27937j674462j537208k126465l414917j823578o26907j390000j278610
1409D38304596r47456j397896r70230j034890r64393r44061j186409j408425j383591
1417.7D28067245j72157j964950N18341J882438Q35343M92096m21791R22393P91893
1426.3D30950851n4168O08902J79329Q07113J229363J561126J078873J111298J847229
1435D39319916L98712r11064J551780K439843J435508J338196J534767J090508J681938
1443.7D49880104R62868R64508M87785J99280K37999J201439J645164L79219J314354
1452.4D57272720J242829J301727R47266l05176j634407m65126M852142K934570K838211
$$ plain form
1461.1 468984756 470610390 471733551 473634682 473493118 475815773 477946129 480139046 482224884
1468.8 482224884 484397469 487248230 488747139 489235535 490732079 495259323 498429413 500202065
1476.5 500202065 502857628 505164223 507050056 508647957 510074921 511562920 513346176 514752693
1484.2 514752693 515953178 516934013 517284622 518417816 519441643 517870674 517918053 520504570 521539993
1492.9 521539993 521137581 520979156 520211525 515899963 516223488 515114098 512971268 513384666 512669220
1501.6 512669220 511844597 511233864 511392403 510963554 503888664 497542496 500932732 504023590 504009972
1510.2 504009972 504407501 503351555 502811356 503587151 502252579 500938377 499586487 498737984 499954185
1518.9 499954185 501097755 499239807 495584755 496655884 498613930 500071602 498889809 499529648
$$ packed form
1461.1D68984756J625634J123161J901131j41564K322655K130356K192917K085838
1468.8D82224884K172585K850761J498909M88396J496544M527244L170090J772652
1476.5E00202065K655563K306595J885833J597901J426964J487999J783256J406517
1484.2E14752693J200485R80835L50609J133194J023827j570969M7379K586517J035423
1492.9E21539993m02412j58425p67631m311562L23525j109390k142830M13398p15446
1501.6E12669220q24623o10733J58539m28849p074890o346168L390236L090858j3618
1510.2E04009972L97529j055946n40199P75795j334572j314202j351890q48503J216201
1518.9D99954185J143570j857948l655052J071129J958046J457672j181793O39839
$$ plain form
1526.6 499529648 500708122 501095428 502496719 503633690 504044342 503956184 503093185 501995239 504524574
1535.3 504524574 505915527 506529083 508344078 505191689 500360031 503437614 504958878 505136375 506162910
1544 506162910 506760597 507890129 510494919 511281853 512051773 511324577 509972420 511246872 511268730
1552.7 511268730 511551056 509289131 509484596 510862541 509432373 500121803 493733444 503612671 505666466
1561.4 505666466 506616898 505664864 504439735 501832542 499981346 499532471 497662010 496031036 489328651
1570 489328651 489359589 488503647 485386925 482972755 480546646 478381042 466779175 467140732 465644722
1578.7 465644722 462611580 459901695 455939026 453110275 448041191 444796982 440680580 437230911
1586.4 437230911 433702812 429298973 426528664 421831856 419234810 414706116 411864624 408279648
$$ packed form
1526.6D99529648J178474L87306J401291J136971M10652q8158q62999j097946K529335
1535.3E04524574J390953O13556J814995l152389m831658L077583J521264J77497J026535
1544E06162910N97687J129532K604790P86934P69920p27196j352157J274452K1858
1552.7E11268730K82326k261925J95465J377945j430168r310570o388359R879227K053795
1561.4E05666466R50432r52034j225129k607193j851196m48875j870461j630974o702385
1570D89328651L0938q55942l116722k414170k426109k165604j1601867L61557j496010
1578.7D65644722l033142k709885l962669k828751n069084l244209m116402l449669
1586.4D37230911l528099m403839k770309m696808k597046m528694k841492l584976
$$ plain form
1594.1 408279648 403816071 401442223 397153587 395360107 391476097 388983841 385642014 383006783
1601.9 383006783 381305656 377373657 376235161 373168030 371585083 368264008 366803627 365591278
1609.6 365591278 363007278 362800598 360195389 360550804 359056587 359105148 357668304 351566200 354486351
1618.2 354486351 353717804 354646873 353155632 353793488 353492584 351480865 353114967 352952881 355064545
1626.9 355064545 353448715 353962708 354650841 355116119 355909195 355870705 357941742 357912788 358360023 356390724
1636.6 356390724 359345703 362002754 364047012 366592560 366753769 368935966 368950272 370983467 372578964
1645.3 372578964 371455345 373501511 372558670 376453400 377917328 381008530 382696724 379463158
1653 379463158 380128441 380097313 384354324 385806999 387930641 389112320 391001587 392626762 393771820
$$ packed form
1594.1D08279648m463577k373848m288636j793480l884010k492256l341827k635231
1601.9C83006783j701127l931999j138496l067131j582947l321075j460381j212349
1609.6C65591278k584000k06680k605209L55415j494217M8561j436844o102104K920151
1618.2C54486351p68547R29069j491241O37856l00904k011719J634102j62086K111664
1626.9C55064545j615830N13993O88133M65278P93076l8490K071037k8954M47235j969299
1636.6C56390724K954979K657051K044258K545548J61209K182197J4306K033195J595497
1645.3C72578964j123619K046166r42841L894730J463928L091202J688194l233566
1653C79463158O65283l1128M257011J452675K123642J181679J889267J625175J145058
$$ plain form
1661.6 393771820 396309853 396691628 400215721 402339859 405127678 407644539 409454727 411795311
1669.4 411795311 413361397 418200455 420291138 424266586 427891960 429968071 432693481 436434479
1677.1 436434479 440926857 443090897 446423225 449285774 453543091 457712593 455536003 458152504
1684.8 458152504 464360542 471437111 475899734 479422569 483223228 486249847 490364037 494340134
1692.5 494340134 498985329 503516159 507461548 507164612 512052879 518023796 523528137 526353416
1700.2 526353416 524302483 531509476 536104164 538714943 541375122 544919624 547646599 550762901
1707.9 550762901 554422188 556172295 557644463 559908028 562166176 564249039 564393044 564551163 566820412
1716.6 566820412 568220787 567667542 571660690 574604111 576403008 577982063 578858643 579754448 581252213
$$ packed form
1661.6C93771820K538033L81775L524093K124138K787819K516861J810188K340584
1669.4D11795311J566086M839058K090683L975448L625374K076111K725410L740998
1677.1D36434479M492378K164040L332328K862549M257317M169502k176590K616501
1684.8D58152504O208038P076569M462623L522835L800659L026619M114190L976097
1692.5D94340134M645195M530830L945389k96936M888267N970917N504341K825279
1700.2E26353416k050933P206993M594688K610779K660179L544502K726975L116302
1707.9E50762901L659287J750107J472168K263565K258148K082863J44005J58119K269249
1716.6E66820412J400375n53245L993148K943421J798897J579055Q76580Q95805J497765
$$ plain form
1725.3 581252213 582676849 583835678 585256462 586718674 586366158 587056122 590148697 592473183 589365387
1734 589365387 586870270 592035484 595828857 597961769 600428009 600269394 600441246 604741631 606776390
1742.7 606776390 606248894 608261948 612200241 614547882 615621376 617372131 619374313 623749886
1750.4 623749886 625279922 626701393 631390724 634412651 636953278 639196396 638995781 640701447
1758.1 640701447 643706818 645973282 648355865 647220001 647899628 651613007 653506699 655132370
1765.8 655132370 656578674 657350311 656100006 658506851 662010345 660959396 659130630 659167099 663162537
1774.5 663162537 665430984 665062027 666938171 667676697 668752441 668846741 668339386 669787827 671573181
1783.2 671573181 672790222 672013016 672736969 674334488 674990158 675350647 676592560 676926270 676603394
$$ packed form
1725.3E81252213J424636J158829J420784J462212l52516O89964L092575K324486l107796
1734E89365387k495117N165214L793373K132912K466240j58615J71852M300385K034759
1742.7F06776390n27496K013054L938293K347641J073494J750755K002182M375573
1750.4F23749886J530036J421471M689331L021927K540627K243118k00615J705666
1758.1F40701447L005371K266464K382583j135864O79627L713379J893692J625671
1765.8F55132370J446304P71637j250305K406845L503494j050949j828766L6469L995438
1774.5F63162537K268447l68957J876144P38526J075744R4300n07355J448441J785354
1783.2F71573181J217041p77206P23953J597519O55670L60489J241913L33710l22876
$$ plain form
1791.8 676603394 675227051 674995499 678288956 679201355 678967133 680625534 682223587 682124557 680982971
1800.5 680982971 682381516 682182236 683041306 684680939 685301590 686174316 686415939 686999512 687855225
1809.2 687855225 688484955 687378235 688069916 689514389 689637756 690171967 690168915 691004333 691180420 691825180
1818.8 691825180 692829056 692819748 693660583 693465881 694388199 695421295 693611374 693712997 695086288
1827.5 695086288 695940399 694885483 692743225 694464798 697095566 697523880 697676163 698374557 698773575
1836.2 698773575 698437042 697681351 698899765 699414062 699659576 699805832 700727081 701040192 696950150
1844.9 696950150 699275360 701155243 700864563 700740814 701442795 702297363 702461472 702909012 702632675
1853.6 702632675 703523941 704164810 704084625 704386215 703886719 703883133 703883820 704295273 704122772 704479828 704962997
$$ packed form
1791.8F76603394j376343k31552L293457R12399k34222J658401J598053r9030j141586
1800.5F80982971J398545j99280Q59070J639633O20651Q72726K41623N83573Q55713
1809.2F87855225O29730j106720O91681J444473J23367N34211l052Q35418J76087O44760
1818.8F91825180J003876r308Q40835j94702R22318J033096j809921J01623J373291
1827.5F95086288Q54111j054916k142258J721573K630768M28314J52283O98394L99018
1836.2F98773575l36533p55691J218414N14297K45514J46256R21249L13111m090042
1844.9F96950150K325210J879883k90680j23749P01981Q54568J64109M47540k76337
1853.6G02632675Q91266O40869q0185L01590m99496l586O87M11453j72501L57056M83169
$$ plain form
1864.2 704962997 704845734 705278473 704483185 704853058 704239883 703573380 705019989 705886383 706321716
1872.8 706321716 706504669 707164917 707231903 707679977 707614288 707531509 708045578 707648849 707887192 707609406
1882.5 707609406 707670670 707401657 707030334 707562561 707847977 708849564 708333054 707276764 708038483
1891.2 708038483 708715820 708619003 708692551 708530426 707945709 708968048 709418716 709803085 709925995 709767685
1900.8 709767685 710005417 709669418 709705505 709221115 709477692 709684067 709436417 709653473 709665756 709701920
1910.4 709701920 709512177 710453110 710578766 710486832 710379105 710030060 710606689 708907547 708844681 710048141
1920.1 710048141 710889206 711378021 710147705 709881592 710485611 710942535 710716171 710490494 710143280
1928.8 710143280 710253448 710785446 710712051 710889053 710705719 711075516 710927887 710464630 710249939 710077057
$$ packed form
1864.2G04962997j17263M32739p95288L69873o13175o66503J446609Q66394M35333
1872.8G06321716J82953O60248O6986M48074o5689q2779N14069l96729K38343k77786
1882.5G07609406O1264k69013l71323N32227K85416J001587n16510j056290P61719
1891.2G08038483O77337r6817P3548j62125n84717J022339M50668L84369J22910j58310
1900.8G09767685K37732l35999L6087m84390K56577K06375k47650K17056J2283L6164
1910.4G09701920j89743R40933J25656r1934j07727l49045N76629j699142o2866J203460
1920.1G10048141Q41065M88815j230316k66113O04019M56924k26364k25677l47214
1928.8G10143280J10168N31998p3395J77002j83334L69797j47629m63257k14691j72882
$$ plain form
1938.4 710077057 710593948 710137939 710553513 710267639 708966827 709899521 710304260 709909439 709672394
1947.1 709672394 710037689 710101547 710335999 710525208 710190277 710070267 710078201 710053940 709561539 709790421
1956.7 709790421 709532700 709169388 709461594 709371262 709717102 709788208 709827271 709340363 708992386 708997116
1966.4 708997116 708475113 708717880 709178848 709569702 709275131 709088974 708979111 708945465 709247818 709019623
1976 709019623 708866425 708413925 708739853 708984604 708721542 709020538 709150772 709228363 708778229 708418732
1985.7 708418732 707957230 707805481 707821121 707495804 707939148 708146744 707764435 707377090 707754822 707717209
1995.3 707717209 707162552 706995316 706705856 706745453 706682358 706826859 706791534 707164459 707379761 706911545
2005 706911545 707117233 706554871 706009903 705751419 705679169 705563126 705408707 705672607 705322952 705756683
$$ packed form
1938.4G10077057N16891m56009M15574k85874j300812R32694M04739l94821k37045
1947.1G09672394L65295O3858K34452J89209l34931j20010P934k4261m92401K28882
1956.7G09790421k57721l63312K92206r0332L45840P1106L9063m86908l47977M730
1966.4G08997116n22003K42767M60968L90854k94571j86157j09863l3646L02353k28195
1976G09019623j53198m52500L25928K44751k63062K98996J30234P7591m50134l59497
1985.7G08418732m61502j51749J5640l25317M43344K07596l82309l87345L77732l7613
1995.3G07717209n54657j67236k89460L9597o3095J44501l5325L72925K15302m68216
2005G06911545K05688n62362n44968k58484p2250j16043j54419K63900l49655M33731
$$ plain form
2014.6 705756683 706076202 706011047 705844421 705304337 704799118 704031677 704084549 704259262 704635544 704650650
2024.2 704650650 704620514 704873962 704468155 704311447 703600159 703397675 703391495 703095551 703019333 702927551
2033.9 702927551 703302002 703093643 703114929 703068008 702913666 702680435 702032318 701678619 701452026 701764145
2043.5 701764145 701486969 701610870 702015533 702065811 702271194 701817322 701599045 701199036 701029434 700609894
2053.2 700609894 700351105 700677643 700639496 701086807 700767288 700613861 700788269 700821228 700723495 699966354
2062.8 699966354 699624329 699131775 699463043 700277023 700568314 700514603 700440674 700471497 700001831 699846115
2072.5 699846115 699620056 699717026 699633484 699252243 699235840 699212570 699703903 699701767 699737396 699605865 699261398
2083.1 699261398 699058228 698698654 698743820 698220367 697966614 697930450 698075638 698568344 698773193 698719025
$$ packed form
2014.6G05756683L19519o5155j66626n40084n05219p67441N2872J74713L76282J5106
2024.2G04650650l0136K53448m05807j56708p11288k02484o180k95944p6218r1782
2033.9G02927551L74451k08359K1286m6921j54342k33231o48117l53699k26593L12119
2043.5G01764145k77176J23901M04663N0278K05383m53872k18277m00009j69602m19540
2053.2G00609894k58789L26538l8147M47311l19519j53427J74408L2959r7733p57141
2062.8F99966354l42025m92554L31268Q13980K91291n3711p3929L0823m69666j55716
2072.5F99846115k26059R6970q3542l81241j6403k3270M91333k136L5629j31531l44467
2083.1F99261398k03170l59574M5166n23453k53753l6164J45188M92706K04849n4168
$$ plain form
2092.7 698719025 698028030 697871399 697865601 697796097 697582932 697472763 697582321 697357559 697719269 697627182
2102.4 697627182 697263641 696912537 696513138 696287689 696512070 697245865 697145081 697165146 696847153 696387711
2112 696387711 696200638 695949631 696073151 695891800 696064072 695816269 695665970 695761185 695510178 695382385
2121.6 695382385 695038834 695245590 695267487 695300293 694896240 694474335 694907913 694863358 694884491 695054932
2131.3 695054932 695622330 695562439 695083008 694911957 694559174 694669342 694679642 694922104 694895325 695031967
2140.9 695031967 695328751 695103302 695069122 694869003 694804535 694394302 694339523 694507294 694718094 695149689
2150.6 695149689 695052719 695336075 695235901 695077972 694739761 694463196 694622498 694238586 694338608 694542847
2160.2 694542847 694787292 695029373 695358047 695658035 695790787 695675507 694791946 694724503 694849243 694850998
$$ packed form
2092.7F98719025o90995j56631n798o9504k13165j10169J09558k24762L61710r2087
2102.4F97627182l63541l51104l99399k25449K24381P33795j00784K0065l17993m59442
2112F96387711j87073k51007J23520j81351J72272k47803j50299R5215k51007j27793
2121.6F95382385l43551K06756K1897L2806m04053m21905M33578m4555K1133J70441
2131.3F95054932N67398n9891m79431j71051l52783J10168J0300K42462k6779J36642
2140.9F95031967K96784k25449l4180k00119o4468m10233n4779J67771K10800M31595
2150.6F95149689r6970K83356j00174j57929l38211k76565J59302l83912J00022K04239
2160.2F94542847K44445K42081L28674K99988J32752j15280q83561o7443J24740J755
$$ plain form
2169.9 694850998 694733810 694815292 695441742 695435181 695618286 695732040 695832367 695454025 695050964 695097580
2179.5 695097580 694898300 695349274 695520935 695843735 696116943 696015167 695965881 695810318 695604477 695071182
2189.1 695071182 695230637 694940720 694914093 695225143 695260849 696228485 696596985 696653519 696257324 695792770
2198.8 695792770 695607376 695286102 695258636 695119247 695554199 695964355 696566010 696981812 697064285 697303162
2208.4 697303162 696846237 696272125 695606537 695661316 695908661 695930252 696203766 696584167 697153702 697253723
2218.1 697253723 697376251 697050552 696676788 696289444 696059494 696334381 695975494 696120453 696206360 696297531
2227.7 696297531 696749191 696845093 696806717 696595306 696301498 695738983 695933380 695987320 695918655 696257706
2237.4 696257706 695992584 695794830 695844650 696433868 696681900 696490402 696041336 695564117 695648575 695628891
$$ packed form
2169.9F94850998j17188Q1482O26450o561J83105J13754J00327l78342m03061M6616
2179.5F95097580j99280M50974J71661L22800K73208j01776m9286j55563k05841n33295
2189.1F95071182J59455k89917k6627L11050L5706R67636L68500N6534l96195m64554
2198.8F95792770j85394l21274k7466j39389M34952M10156O01655M15802Q2473K38877
2208.4F97303162m56925n74112o65588N4779K47345K1591K73514L80401N69535J00021
2218.1F97253723J22528l25699l73764l87344k29950K74887l58887J44959Q5907R1171
2227.7F96297531M51660R5902l8376k11411k93808n62515J94397N3940o8665L39051
2237.4F96257706k65122j97754M9820N89218K48032j91498m49066m77219Q4458j9684
$$ plain form
2247 695628891 695934906 696102295 696415024 696414719 696080704 695978851 695457993 695222092 694910507 694879379 694838181
2257.6 694838181 695000610 695330353 695058441 694981766 694736938 694861984 694764862 694570541 694578400 694370956
2267.3 694370956 694314041 694185028 694711227 695037155 695011368 694665451 694596024 694847794 694459229 694335709
2276.9 694335709 693868790 693920898 694246597 694415894 694651566 694501572 694326477 693843460 693927612 693675919
2286.5 693675919 693546295 693374100 692906723 692778702 691851120 691684418 691193390 690591431 689826202 689244080
2296.2 689244080 689698944 689252167 689315872 688381958 687688446 687318115 686400528 686335220 685024719 684411545
2305.8 684411545 683621979 682674179 681920090 680982971 680666962 679614563 679011307 677264862 676794815
2314.5 676794815 676805038 675526047 674711533 672968903 671933060 670107346 669320908 668712845 667043076
$$ packed form
2247F95628891L06015J67389L12729l05l34015j01853n20858k35901l11585l1128m1198
2257.6F94838181J62429L29743k71912p6675k44828J25046r7122j94321P859k07444
2267.3F94370956n6915j29013N26199L25928k5787l45917o9427K51770l88565j23520
2276.9F94335709m66919N2108L25699J69297K35672j49994j75095m83017Q4152k51693
2286.5F93675919j29624j72195m67377j28021r27582j66702m91028o01959p65229n82122
2296.2F89244080M54864m46777O3705r33914o93512l70331r17587o5308j310501o13174
2305.8F84411545p89566r47800p54089r37119l16009j052399o03256j746445m70047
2314.5F76794815J0223j278991q14514j742630j035843j825714p86438o08063j669769
$$ plain form
2323.2 667043076 666250076 665633316 665894012 664188232 662929382 661220627 660040741 660057526 659631195
2331.9 659631195 660363235 658963699 658818588 657525101 656685104 656943054 655337067 654950562 653568268
2340.6 653568268 654294815 654345779 654611206 655681458 656652756 659557648 662606659 667221146 667889023
2349.2 667889023 664316101 660241776 656729965 654616241 652322464 649697266 645748749 643840866
2356.9 643840866 643708191 641575317 639212379 638398781 640339661 642526627 645252914 644914322 644950027
2365.6 644950027 647398071 649232330 651516953 651972122 653102951 656070175 659593048 662046432
2373.3 662046432 664261856 667106094 669523163 671740875 672912598 674490509 676216736 677378693
2381.1 677378693 678798294 680489655 681848068 682588120 683579407 684105835 684307251 684401321 684005661
$$ packed form
2323.2F67043076p93000o16760K60696j705780j258850j708755j179886J6785m26331
2331.9F59631195P32040j399536j45111j293487q39997K57950j605987l86505j382294
2340.6F53568268P26547N0964K65427J070252R71298K904892L049011M614487O67877
2349.2F67889023l572922m074325l511811k113724k293777k625198l948517j907883
2356.9F43840866j32675k132874k362938q13598J940880K186966K726287l38592L5705
2365.6F44950027K448044J834259K284623M55169J130829K967224L522873K453384
2373.3F62046432K215424K844238K417069K217712J171723J577911J726227J161957
2381.1F77378693J419601J691361J358413P40052R91287N26428K01416R4070l95660
$$ plain form
2389.7 684005661 683244400 682646255 682577591 682382889 682668610 682639999 682731628 683272171 683333206 683374939
2399.4 683374939 682626648 681822586 680996399 680422745 680424271 680503387 680862579 681051941 681634674 681354599
2409 681354599 680654526 680360565 679575882 679043427 678833542 678828506 678419800 678374023 678549652 678190460
2418.7 678190460 678054810 677934570 677846451 677605362 677431030 676987839 676500702 676233292 675883636 675749893
2428.3 675749893 675565491 675665054 675432816 675252838 675198059 674631119 674030685 673606262 673714294 673290634
2438 673290634 672912216 673112183 673223419 672942963 672428055 672496262 672159729 671825638 671532669 671041946
2447.6 671041946 670664368 670151749 670272751 670385513 670076599 669649048 669577332 669378357 669049454 669033356
2457.2 669033356 668677444 668385925 667806015 667483749 667117004 666808853 667047958 666487045 666048660 665774155
$$ packed form
2389.7F84005661p61261n98145o8664j94702K85721k8611R1629N40543O1035M1733
2399.4F83374939p48291q04062q26187n73654J526P9116L59192J89362N82733k80075
2409F81354599p00073k93961p84683n32455k09885n036m08706m5777J75629l59192
2418.7F78190460j35650j20240q8119k41089j74332m43191m87137k67410l49656j33743
2428.3F75749893j84402R9563k32238j79978n4779n66940o00434m24423J08032m23660
2438F73290634l78418J99967J11236k80456n14908O8207l36533l34091k92969m90723
2447.6F71041946l77578n12619J21002J12762l08914m27551p1716j98975l28903j6098
2457.2F69033356l55912k91519n79910l22266l66745l08151K39105n60913m38385k74505
$$ plain form
2466.9 665774155 665621262 665367737 664839478 664652405 664416428 664295959 663768539 663342667 663333511 663415604
2476.5 663415604 663236771 662714233 662230988 661556702 661366577 660915833 660312424 660202560 660183182 659825821
2486.2 659825821 658988876 658728256 658751831 659015656 658673096 657908707 657610550 657108917 656535416 655633087
2495.8 655633087 655478134 655564041 655677109 655820923 655035095 654878922 654764099 654245377 653578491 653058548
2505.5 653058548 652745438 652065964 651683578 651405716 651350784 651156235 650898666 650620728 650441055 650523148
2515.1 650523148 650005188 649473038 648653259 648241196 648215866 647781143 647467728 647242279 647462997 647279129
2524.7 647279129 646989212 646747742 646299667 646000595 645421066 644835663 644138107 643949051 644142380 644245300
2534.4 644245300 643955536 643509445 643608551 643220901 642666702 642005386 641454544 641290436 641194839 641275024
$$ packed form
2466.9F65774155j52893k53525n28259j87073k35977j20469n27420m25872r156Q2093
2476.5F63415604j78833n22538m83245o74286j90125m50744o03409j09864j9378l57361
2486.2F59825821q36945k60620K3575K63825l42560p64389k98157n01633n73501r02329
2495.8F55633087j54953Q5907J13068J43814p85828j56173j14823n18722o66886n19943
2505.5F53058548l13110o79474l82386k77862n4932j94549k57569k77938j79673Q2093
2515.1F50523148n17960n32150q19779m12063k5330m34723l13415k25449K20718j83868
2524.7F47279129k89917k41470m48075k99072n79529n85403o97556j89056J93329J02920
2534.4F44245300k89764m46091R9106l87650n54199o61316n50842j64108r5597Q0185
$$ plain form
2544 641275024 640850677 640557404 640288467 639723053 639295082 639156990 639122696 638630333 638117905 637696342
2553.7 637696342 637552719 637637367 637570419 637261543 636974983 636467056 635593605 635250206 634907036 634582214
2563.3 634582214 634221077 634062271 634342422 634132271 633784027 633018684 632444038 632234993 631876526 631598549
2573 631598549 631357536 631278458 630859032 630729637 630420570 629769135 629537468 629264450 629198685 629021530
2582.6 629021530 628738594 628238068 627849007 627957153 627916260 627686424 627306824 626759758 626165810 626238098
2592.2 626238098 625992889 625202370 624986877 624853401 624589119 624269142 624013100 623341560 623170967 623265305
2601.9 623265305 622424088 621949501 621732979 621536140 621076393 620523911 620290108 619803085 619305382 619111023
2611.5 619111023 619323845 619169998 618712196 618252754 617964249 617708092 617261543 617067108 616415482 615852470
$$ packed form
2544F41275024m24347k93273k68937n65414m27971j38092l4294m92363n12428m21563
2553.7F37696342j43623Q4648o6948l08876k86560n07927q73451l43399l43170l24822
2563.3F34582214l61137j58806K80151k10151l48244p65343n74646k09045l58467k77977
2573F31598549k41013p9078m19426j29395l09067o51435k31667k73018o5765j77155
2582.6F29021530k82936n00526l89061J08146m0893k29836l79600n47066n93948P2288
2592.2F26238098k45209p90519k15493j33476k64282l19977k56042o71540j70593R4338
2601.9F23265305q41217m74587k16522j96839m59747n52482k33803m87023m97703j94359
2611.5F19111023K12822j53847m57802m59442k88505k56157m46549j94435o51626n63012
$$ plain form
2621.2 615852470 615234718 614684715 614737968 614665642 614581909 613947487 613412399 612969818 612257385 611778374
2630.8 611778374 611609383 611535263 610889778 610502739 610174599 609799690 609373169 609036865 609038391 608403206
2640.5 608403206 607985687 607492676 607158241 607157631 606633224 606064987 605757141 606134071 605853882 605043945
2650.1 605043945 604554672 604142303 603968964 603790169 603717422 603046951 602383385 602133865 601961708 601900902
2659.8 601900902 601655998 601388512 600670319 600030670 599655228 599702110 599769821 599072723 598540764 598366432
2669.4 598366432 598425827 598125229 597773399 597574120 597295036 597226105 596716118 596073952 595721970 595841217
2679 595841217 595866661 595833549 595899200 595291557 594632149 593970985 593651886 593423462 592903023 592769318
2688.7 592769318 592767715 592862625 592896423 592537270 591804428 591370697 591189919 590888481 590520592 590246773
$$ packed form
2621.2F15852470o17752n50003N3253p2326q3733o34422n35088m42581p12433m79011
2630.8F11778374j68991p4120o45485l87039l28140l74909m26521l36304J526o35185
2640.5F08403206m17519m93011l34435o10n24407n68237l07846L76930k80189q09937
2650.1F05043945m89273m12369j73339j78795p2747o70471o63566k49520j72157o0806
2659.8F01900902k44904k67486p18193o39649l75442M6882O7711o97098n31959j74332
2669.4E98366432N9395l00598l51830j99279k79084o8931n09987o42166l51982J19247
2679E95841217K5444l3112O5651o07643o59408o61164l19099k28424n20439j33705
2688.7E92769318j603R4910L3798l59153p32842m33731j80778l01438l67889k73819
$$ plain form
2698.3 590246773 590261040 590001411 589792824 589341507 588927498 588744659 588224754 588086090 587858810 587909851
2708 587909851 587867775 587111092 586510620 586129646 585925713 585745087 585837402 585446167 585134888 585174561
2717.6 585174561 584596214 584718819 584803085 584060783 583605766 583799362 583920326 583378220 582975159 583035851
2727.3 583035851 583044205 582626839 582311897 581999321 581407623 581194229 581388359 581263504 580826874 580914383
2736.9 580914383 580861855 580450935 580022621 579693451 579896431 580037804 579899864 579623299 579275208 578821640
2746.5 578821640 578569794 578515015 578452034 578276558 577768860 577665787 577433968 577403870 577639809 577212257
2756.2 577212257 576817093 576308174 575988960 576013870 576336517 576200256 575365486 575122261 574938965 574617729
2765.8 574617729 574342117 574310455 573834038 573327255 573686028 573479576 573223076 573101196 573044510 572775879
$$ packed form
2698.3E90246773J4267k59629k08587m51317m14009j82839n19905j38664k27280N1041
2708E87909851m2076p56683o00472l80974k03933j80626R2315l91235l11279L9673
2717.6E85174561n78347J22605Q4266p42302m55017J93596J20964n42106m03061O0692
2727.3E83035851Q354m17366l14942l12576n91698k13394J94130j24855m36630Q7509
2736.9E80914383n2528m10920m28314l29170K02980J41373j37940k76565l48091m53568
2746.5E78821640k51846n4779o2981j75476n07698j03073k31819l0098K35939m27552
2756.2E77212257l95164n08919l19214K4910L22647j36261q34770k43225j83296l21236
2765.8E74617729k75612l1662m76417n06783L58773k06452k56500j21880n6686k68631
$$ plain form
2775.5 572775879 572000237 571734238 571239128 570501366 570005989 569939423 569973450 569649124 569375839 569161987
2785.1 569161987 568976173 568634262 568416710 568106995 567577400 567001877 566497726 566095772 565637894 565719566
2794.8 565719566 565577545 565089607 564659081 564127769 563352699 562329407 561828003 561303329 560992317
2803.4 560992317 560529022 559741440 559703102 559734306 559444618 558543549 557679482 557033195 556294289 555558281
2813.1 555558281 554904518 554862556 554288292 553573647 553207283 552708130 552403984 551691895 550794220 550086403
2822.7 550086403 549514465 548989677 548439102 547819939 547105675 546300659 545519943 545071716 544400902 543510399
2832.4 543510399 542347794 541296692 540841599 540102539 539036980 537771263 536445389 535296555 534155388
2841.1 534155388 532621422 531117477 529607811 527504501 525752220 524002457 522051125 520195389
$$ packed form
2775.5E72775879p75642k65999m95110p37762m95377o6566L4027l24326k73285k13852
2785.1E69161987j85814l41911k17552l09715n29595n75523n04151m01954m57878Q1672
2794.8E65719566j42021m87938m30526n31312p75070j023292n01404n24674l11012
2803.4E60992317m63295p87582l8338L1204k89688r01069q64067o46287p38906p36008
2813.1E55558281o53763m1962n74264p14645l66364m99153l04146p12089q97675p07817
2822.7E50086403n71938n24788n50575o19163p14264q05016p80716m48227o70814q90503
2832.4E43510399j162605j051102m55093p39060j065559j265717j325874j148834j141167
2841.1E34155388j533966j503945j509666k103310j752281j749763j951332j855736
$$ plain form
2848.8 520195389 518167114 516416969 515129318 514181175 513443871 513271446 512685814 511889076 512172127
2857.4 512172127 512664185 512835884 512687454 512666512 512680054 512734680 512636948 512195702 512031136 511439934
2867.1 511439934 510719910 510274925 509648933 508612289 507839890 507623405 507093811 506857567 506730766
2875.8 506730766 506343002 505857964 505516014 505319176 504955254 504612808 503488312 502350464 501747780
2884.4 501747780 501273232 500563469 499422035 498856354 498364220 497855606 497053947 496018143 495063553
2893.1 495063553 493954964 493345299 492616730 492087784 491095543 489790840 489411011 488863029 488550377
2901.8 488550377 488210983 487428970 486458817 485350761 484293289 483202820 482647133 482005386 480816765
2910.5 480816765 479578819 478342247 476752701 475111465 473766365 472561531 471196289 469096756
$$ packed form
2848.8E20195389k028275j750145j287651r48143p37304j72425n85632p96738K83051
2857.4E12172127M92058J71699j48430k0942J3542N4626r7732m41246j64566n91202
2867.1E11439934p20024m44985o25992j036644p72399k16485n29594k36244j26801
2875.8E06730766l87764m85038l41950j96838l63922l42446j124496j137848o02684
2884.4E01747780m74548p09763j141434n65681m92134n08614q01659j035804r54590
2893.1D95063553j108589o09665p28569n28946r92241j304703l79829n47982l12652
2901.8D88550377l39394p82013r70153j108056j057472j090469n55687o41747j188621
2910.5D80816765j237946j236572j589546j641236j345100j204834j365242k099533
$$ plain form
2918.2 469096756 467344246 466154671 465369186 464740868 463568649 462916069 462487907 462079926 461833839
2926.9 461833839 462138252 463068199 463582802 463891945 464206810 464956398 465457382 465727654 465919762 465757103
2936.5 465757103 466670265 467841454 468793983 470007057 471008148 471601257 472265625 473162117 473482246
2945.2 473482246 474075623 474777069 475115051 475729256 476183853 476593971 477034225 477493248 477699585 477556381
2954.8 477556381 477959099 478860168 479499283 479609375 479460449 479877701 480781174 481246948 481848068 482734604
2964.5 482734604 483203812 483611412 484605446 485758209 486441612 487213440 488041534 488726578 489438057
2973.2 489438057 490125237 490399437 490870171 492050667 492489738 492912064 493582954 493764763 493969460
2981.8 493969460 493983650 494014702 494114952 494467316 494673500 495118599 495501709 495184631 495855522 496243477
$$ packed form
2918.2D69096756j752510j189575p85485o28318j172219o52580m28162m07981k46087
2926.9D61833839L04413R29947N14603L09143L14865P49588N00984K70272J92108j62659
2936.5D65757103R13162J171189R52529J213074J001091N93109O64368Q96492L20129
2945.2D73482246N93377P01446L37982O14205M54597M10118M40254M59023K06337j43204
2954.8D77556381M02718R01069O39115J10092j48926M17252R03473M65774O01120Q86536
2964.5D82734604M69208M07600R94034J152763O83403P71828Q28094O85044P11479
2973.2D89438057O87180K74200M70734J180496M39071M22326O70890J81809K04697
2981.8D93969460J4190L1052J00250L52364K06184M45099L83110l17078O70891L87955
$$ plain form
2991.5 496243477 495927010 495627289 495293159 495437317 495507202 495909081 495532684 494564743 494393768 493666039
3001.1 493666039 492747192 493057098 493518867 492734947 491732292 491163750 491030731 491037521 490792732 490735970
3010.8 490735970 490413933 489772606 489259682 489253807 488976822 488170433 487632141 486969910 486475639 485876236
3020.4 485876236 485263100 485033493 484976997 484710236 483570518 482566109 481932526 481605721 481461754
3029.1 481461754 481091080 480645294 479680939 479234238 479054680 478258438 477606850 476958275 476389503 475745163
3038.7 475745163 474624939 473966141 473788681 473211784 472521629 471802521 471021652 470448456 470197792
3047.4 470197792 470066490 469341240 468551521 467904778 466942329 466132469 465682449 465392075 464667664 463410225
3057.1 463410225 462645149 462416992 461795769 460992317 460343857 459790421 459306793 458971024 458980980 458407211
$$ packed form
2991.5D96243477l16467k99721l34130J44158O9885M01879l76397r67941j70975p27729
3001.1D93666039r18847L09906M61769p83920j002655n68542j33019O790k44789n6762
3010.8D90735970l22037o41327n12924n875k76985q06389n38292o62231m94271n99403
3020.4D85876236o13136k29607n6496k66761j139718j004409o33583l26805j43967
3029.1D81461754l70674m45786r64355m46701j79558p96242o51588o48575n68772o44340
3038.7D75745163j120224o58798j77460n76897o90155p19108p80869n73196k50664
3047.4D70197792j31302p25250p89719o46743r62449q09860m50020k90374p24411j257439
3057.1D63410225p65076k28157o21223q03452o48460n53436m83628l35769R956n73769
$$ plain form
3066.7 458407211 457489510 456800804 456101646 455373535 454669762 454571838 453787155 452744751 452637520 452154579
3076.4 452154579 451847229 451911049 451555710 450897408 450302582 449592819 448727837 448237801 447495270 446637230
3086 446637230 446380997 446393051 446154022 445626831 444805412 444079285 443705597 442816467 442138748 441904221
3095.6 441904221 440763245 439349060 439150047 439451218 438854980 438268280 437730103 436952515 436476402
3104.3 436476402 436179047 435878944 435309067 434690132 433644676 432508392 431945724 431822853 431912117
3113 431912117 431419754 430644760 429788322 429078445 428622131 427890739 427179680 426675873 426277885 425565224
3122.6 425565224 424539070 423641510 423185959 422609901 421574554 421104507 420841141 419885368 418614693
3131.3 418614693 418139153 418099823 417629547 416853600 415885239 415424805 415036354 414177780 413310966 412993050
$$ packed form
3066.7D58407211r17701o88706o99158p28111p03773r7924p84683j042404j07231m82941
3076.4D52154579l07350O3820l55339o58302n94826p09763q64982m90036p42531q58040
3086D46637230k56233J2054k39029n27191q21419p26127l73688q89130o77719k34527
3095.6D41904221j140976j414185j99013L01171n96238n86700n38177p77588m76113
3104.3D36476402k97355l00103n69877o18935j045456j136284n62668j22871Q9264
3113D31912117m92363p74994q56438p09877m56314p31392p11059n03807l97988p12661
3122.6D25565224j026154q97560m55551n76058j035347m70047k63366r55773j270675
3131.3D18614693m75540l9330m70276p75947r68361m60434l88451q58574q66814l17916
$$ plain form
3141 412993050 412756195 411688461 410602112 409844093 409338379 408892059 408245354 407401466 406837273 406719551
3150.6 406719551 406004295 405250053 404281349 403259087 402980232 402332916 401484871 400770340 399960442
3159.3 399960442 399001999 398371124 397814255 396883049 396375465 396056747 395556107 394616089 393679047 393059425
3168.9 393059425 392394829 391636086 390765572 390189247 389795914 389457779 388507805 387648010 387072563 386037865
3178.6 386037865 385566711 384818230 384388313 384164276 383606987 383365097 381961250 380939751 380721626
3187.3 380721626 379988365 379139671 378221016 377620964 377100677 376583748 376152954 375590134 374707603 374108200
3196.9 374108200 373551407 372512779 371902390 371194305 370869293 371009598 370384178 369320641 368737144
3205.6 368737144 368652725 367990494 367285309 366612968 366003494 365912247 365542107 365239716 364669800 363787804
$$ packed form
3141D12993050k36855j067734j086349p58019n05714m46320o46705q43888n64193j17722
3150.6D06719551p15256p54242r68704j022262k78855o47316q48045p14531q09898
3159.3C99960442r58443o30875n56869r31206n07584l18718n00640r40018r37042o19622
3168.9C93059425o64596p58743q70514n76325l93333l38135r49974q59795n75447j034698
3178.6C86037865m71154p48481m29917k24037n57289k41890j403847j021499k18125
3187.3C80721626p33261q48694r18655o00052n20287n16929m30794n62820q82531n99403
3196.9C74108200n56793j038628o10389p08085l25012J40305o25420j063537n83497
3205.6C68737144q4419o62231p05185o72341o09474r1247l70140l02391n69916q81996
$$ plain form
3215.2 363787804 363123016 362386971 361850243 361487045 361085358 360490265 360059280 359948921 359331818 358428078
3224.9 358428078 358267975 358180199 357399712 356645241 356464310 356414108 355781326 355421638 355223694 354129982
3234.5 354129982 353082314 352390785 351564751 351052971 350995140 350835991 350541687 349960632 349614410 349481812
3244.2 349481812 348543091 348048668 347581139 346762428 346513557 345828857 345076599 344811935 344781837 344550705
3253.8 344550705 343976440 343718376 343528633 343071251 342382393 341859131 341440125 340909805 340698967 340576477
3263.4 340576477 340001297 339406204 339004745 338456802 338132515 337930145 337786636 337434349 336927032 336704826
3273.1 336704826 336032257 335594902 335379677 334771805 334355812 334111557 333894310 333409271 333162422 333282089
3282.7 333282089 333239250 332870979 332159348 331425209 331161995 331333733 331000481 330658722 330312614 329897270
$$ packed form
3215.2C63787804o64788p36045n36728l63198m01687n95093m30985j10359o17103r03740
3224.9C58428078j60103q7776p80487p54471j80931n0202o32782l59688j97944j093712
3234.5C54129982j047668o91529q26034n11780n7831j59149k94304n81055l46222j32598
3244.2C49481812r38721m94423m67529q18711k48871o84700p52258k64664l0098k31132
3253.8C44550705n74265k58064j89743m57382o88858n23262m19006n30320k10838j22490
3263.4C40576477n75180n95093m01459n47943l24287k02370j43509l52287n07317k22206
3273.1C36704826o72569m37355k15225o07872m15993k44255k17247m85039k46849J19667
3282.7C33282089m2839l68271p11631p34139k63214J71738l33252l41759l46108m15344
$$ plain form
3292.4 329897270 329919319 329064369 328468094 329087067 329241982 328776588 328154068 327568932 327474632 327258720
3302 327258720 326756897 326498146 325922546 325921745 326482735 326247673 325352783 324340324 324095306 323988762
3311.7 323988762 323580284 322878838 322325287 322441750 322016106 321689911 321509933 320923309 320480194 320128326
3321.3 320128326 319930725 319365768 318730011 318411846 318019066 317202606 316519890 316311035 315766373 315312939
3330.9 315312939 314856205 314206905 313629017 312957306 312288685 311840973 311511040 310906658 310751953 310301952
3340.6 310301952 309514141 309358578 308850288 308105011 307252464 306708946 306548367 306376152 306392498 306078987
3350.2 306078987 305474625 304809113 304709778 304300995 303233929 302923241 302676315 302466354 302594814 302652760
3359.9 302652760 302347393 301338787 300118084 299591274 299853897 299900970 299910660 300083313 299872818 299242401
$$ packed form
3292.4C29897270K2049q54950n96275O18973J54915m65394o22520n85136r4300k15912
3302C27258720n01823k58751n75600q01N60990k35062q94890j012459k45018j06544
3311.7C23988762m08478p01446n53551J16463m25644l26195j79978n86624m43115l51868
3321.3C20128326j97601n64957o35757l18165l92780q16460o82716k08855n44662m53434
3330.9C15312939m56734o49300n77888o71711o68621m47712l29933o04382j54705m50001
3340.6C10301952p87811j55563n08290p45277q52547n43518j60579j72215J6346l13511
3350.2C06078987o04362o65512r9335m08783j067066l10688k46926k09961J28460N7946
3359.9C02652760l05367j008606j220703n26810K62623M7073R690J72653k10495o30417
$$ plain form
3369.5 299242401 298385353 297950745 297759953 297643681 297522831 296833801 296237812 296329594 296339970 296025791
3379.2 296025791 295971909 296108799 296058922 295646019 295258675 295041866 294632359 294321804 294166431 293989716
3388.8 293989716 293959141 294075699 293910217 293657589 293856831 294154205 294208851 293627720 292772484 292676144
3398.4 292676144 292877483 292985039 293211136 292812462 292203484 292224083 292355785 292672691 292604256 292009087
3408.1 292009087 291584606 291678658 292453232 292720776 292600403 292293339 291826344 291953011 292154102 292564774
3417.7 292564774 292562885 292057438 291912594 291904869 292591953 293481865 293743038 293680115 293804817 294207668
3427.4 294207668 294519196 294866791 295155144 295297184 295350361 295567360 296315022 296797161 296672192 296795998
3437 296795998 297097416 297037544 296853981 297532063 298568802 298135090 297695599 298483086 299530735 300182228
$$ packed form
3369.5B99242401q57048m34608j90792j16272j20850o89030n95989R1782J0376l14179
3379.2B96025791n3882J36890m9877m12903l87344k16809m09507l10555j55373j76715
3388.8B93989716l0575J16558j65482k52628J99242K97374N4646n81131q55236r6340
3398.4B92676144K01339J07556K26097l98674o08978K0599J31702L16906o8435n95169
3408.1B92009087m24481R4052P74574K67544j20373l07064m66995J26667K01091M10672
3417.7B92564774j889n05447j44844p725O87084Q89912K61173o2923J24702M02851
3427.4B94207668L11528L47595K88353J42040N3177K16999P47662M82139j24969J23806
3437B96795998L01418n9872j83563O78082J036739m33712m39491P87487J047649O51493
$$ plain form
3446.7 300182228 299873943 299965153 300534725 301110401 301944885 302426300 302861938 303551044 304043884 304638023
3456.3 304638023 305363464 305353260 305709648 306764030 307120819 307390804 307776241 308442898 308845291 309064369
3466 309064369 310431004 311598358 311933537 312406464 313512325 314195442 314450493 315244026 315670013
3474.6 315670013 315858841 316110477 316971569 318291016 319152012 319902534 320437660 320850639 321281319
3483.3 321281319 322400398 323475571 323810692 324580727 325277290 325613098 326044502 327042236 328252716
3492 328252716 328957481 329769859 330510864 330874100 331120415 331957245 333624840 335103760 335844040 336595459
3501.6 336595459 337312164 337294388 337467766 338604813 339799995 340283737 341203156 342076645 342761688
3510.3 342761688 344304085 345105896 345758743 346485977 347192192 348290901 349023972 349955788 350613785
$$ packed form
3446.7C00182228l08285R1210N69572N75676Q34484M81415M35638O89106M92840N94139
3456.3C04638023P25441j0204L56388J054382L56789K69985L85437O66657M02393K19078
3466C09064369J366635J167354L35179M72927J105861O83117K55051P93533M25987
3474.6C15670013J88828K51636Q61092J319447Q60996P50522N35126M12979M30680
3483.3C21281319J119079J075173L35121P70035O96563L35808M31404R97734J210480
3492C28252716P04765Q12378P41005L63236K46315Q36830J667595J478920P40280P51419
3501.6C36595459P16705j7776J73378J137047J195182M83742R19419Q73489O85043
3510.3C42761688J542397Q01811O52847P27234P06215J098709P33071R31816O57997
$$ plain form
3519 350613785 351239662 352623825 354546585 355770416 355721779 356641235 357798119 358692360 359495087
3527.7 359495087 360095673 360931625 362032204 363238487 364397049 365569420 366434097 368107071 369393234
3536.4 369393234 369552498 370555420 371485519 372393799 373527374 375340881 376985359 378029137 378917694
3545 378917694 380179596 381580925 380820694 382343597 384227180 385300179 387276459 387167702 389024353
3553.7 389024353 390945129 392234573 393830147 394112244 396090469 397707634 398114204 398886833 401324120
3562.4 401324120 403090630 403735390 407069969 407248802 406705933 407474518 408220444 411770859 414018478
3571.1 414018478 415912971 417546196 418598022 419447327 421115761 423231354 424064980 426120682 427263756
3579.7 427263756 428565216 431041756 432966270 434417610 435385017 438956718 440212250 438511314
$$ packed form
3519C50613785O25877J384163J922760J223831m8637R19456J156884Q94241Q02727
3527.7C59495087O00586Q35952J100579J206283J158562J172371Q64677J672974J286163
3536.4C69393234J59264J002922R30099R08280J133575J813507J644478J043778Q88557
3545C78917694J261902J401329p60231J522903J883583J072999J976280j08757J856651
3553.7C89024353J920776J289444J595574K82097J978225J617165M06570P72629K437287
3562.4D01324120J766510O44760L334579J78833n42869P68585P45926L550415K247619
3571.1D14018478J894493J633225J051826Q49305J668434K115593Q33626K055702J143074
3579.7D27263756J301460K476540J924514J451340R67407L571701J255532j700936
$$ plain form
3587.5 438511314 440183372 441108170 444153557 446951332 449441605 450576363 451682625 454967232
3595.2 454967232 455313339 457440643 460040779 460842476 462600784 463649712 466092186 468730125 470565033
3603.9 470565033 472566452 475390053 477599525 477385445 480967674 481066360 481700020 488473969 489563713
3612.5 489563713 488953896 492869492 492546692 495661850 498960800 498879128 501568604 502845764 503787956
3621.2 503787956 506656609 509302750 511528778 514077721 515952110 518510132 524982681 525342751
3628.9 525342751 516129150 520788727 526823807 532189140 533824120 533596153 537083282 540886612
3636.6 540886612 543049088 543931694 546138115 549010239 551501312 553054466 554391518 556593742
3644.4 556593742 559342537 564484444 564699707 563274956 568719940 567188721 565996208 567645988
$$ packed form
3587.5D38511314J672058R24798L045387K797775K490273J134758J106262L284607
3595.2D54967232L46107K127304K600136Q01697J758308J048928K442474K637939J834908
3603.9D70565033K001419K823601K209472k14080L582229R8686O33660O773949J089744
3612.5D89563713o09817L915596l22800L115158L298950q1672K689476J277160R42192
3621.2E03787956K868653K646141K226028K548943J874389K558022O472549L60070
3628.9E25342751r213601M659577O035080N365333J634980k27967L487129L803330
3636.6E40886612K162476Q82606K206421K872124K491073J553154J337052K202224
3644.4E56593742K748795N141907K15263j424751N444984j531219j192513J649780
$$ plain form
3652.1 567645988 573052902 577833328 581396523 585629921 579849510 581824684 586997108 588779488
3659.8 588779488 590983543 592030182 593837929 594826622 596527977 598648300 599338188 603729897 606570816
3668.5 606570816 605515099 604118538 598641815 602945328 610873985 618141785 614200516 597356911
3676.2 597356911 603119965 611303406 616164780 614561310 615462761 619241982 621297951 622333946
3683.9 622333946 622370224 622120361 625231094 631362877 624091225 620157280 627554550 622864265 622812233
3692.6 622812233 627985535 629053993 630598259 631204224 631098175 631883812 631968575 633963966 636255302
3701.3 636255302 632021179 630808296 635140915 636255150 636441765 637476463 639653702 642387390
3709 642387390 635856209 638310661 641179199 631207962 636504364 641439438 641939316 642483902 644289703
$$ packed form
3652.1E67645988N406914M780426L563195M233398n780411J975174N172424J782380
3659.8E88779488K204055J046639J807747R88693J701355K120323O89888M391709K840919
3668.5F06570816j055717j396561n476723M303513P928657P267800l941269j6843605
3676.2E97356911N763054Q183441M861374j603470R01451L779221K055969J035995
3683.9F22333946L6278k49863L110733O131783p271652l933945P397270m690285n2032
3692.6F22812233N173302J068458J544266O05965j06049P85637Q4763J995391K291336
3701.3F36255302m234123j212883M332619J114235J86615J034698K177239K733688
3709F42387390o531181K454452K868538r971237N296402M935074M99878N44586J805801
$$ plain form
3717.7 644289703 644436493 641154709 642898636 648319626 644667816 639751778 643657761 643720016 642964706
3726.3 642964706 641420441 642163315 645823288 645790558 649509888 647311478 640879517 648303070 647289734
3735 647289734 639117432 641645813 644640350 646247864 649305115 652165070 648920822 651743393 661366882
3743.7 661366882 648255386 636569138 647796707 653527908 658869400 654681244 643813019 654172592
3751.4 654172592 650147018 643885956 649839630 654676056 658172989 653773041 655516891 659829407
3759.1 659829407 651987457 650980377 654963455 656150131 656579361 659869232 657325897 652763977
3766.8 652763977 656178894 660340118 659873886 652238007 653956146 656909027 657113190 658469086 658757477
3775.5 658757477 659611282 660153732 662024384 660935211 653532562 655882416 658050156 659393845 661915741
$$ packed form
3717.7F44289703J46790l281784J743927N420990l651810m916038L905983O2255p55310
3726.3F42964706j544265P42874L659973l2730L719330k198410o431961P423553j013336
3735F47289734q172302K528381K994537J607514L057251K859955l244248K822571R623489
3743.7F61366882j3111496j1686248J1227569N731201N341492m188156j0868225J0359573
3751.4F54172592m025574o261062N953674M836426L496933m399948J743850M312516
3759.1F59829407p841950j007080L983078J186676M29230L289871k543335m561920
3766.8F52763977L414917M161224m66232p635879J718139K952881K04163J355896K88391
3775.5F58757477Q53805N42450J870652j089173p402649K349854K167740J343689K521896
$$ plain form
3784.2 661915741 659149399 657892380 658895264 659956436 660809784 660358429 660564346 660662231 661238937
3792.9 661238937 660929031 661134872 663728027 660201950 656634140 659453201 663137817 668378372 663290100
3801.5 663290100 652185745 655658493 658869553 662614517 666956253 658734131 655300751 660031128
3809.3 660031128 662333679 662792969 663142548 662595062 662645111 666186218 664452057 654673004 658802032
3817.9 658802032 662714691 666125412 667031326 651532211 654462128 660174789 662081451 664009933
3825.7 664009933 663450775 660031662 661031036 662842407 665215225 666139221 658660889 661413345 668496628
3834.3 668496628 662191772 660579910 668184967 659950562 655471802 661403275 657657013 659888916
3842.1 659888916 665931015 663472366 660447540 662689056 663950348 664398346 665930252 664601669
$$ packed form
3784.2F61915741k766342j257019J002884J061172Q53348m51355K05917R7885N76706
3792.9F61238937l09906K05841K593155l526077l567810K819061L684616N240555n088272
3801.5F63290100j1104355L472748L211060L744964M341736q222122l433380M730377
3809.3F60031128K302551M59290L49579n47486N0049L541107j734161r779053M129028
3817.9F58802032L912659L410721R05914j5499115K929917N712661J906662J928482
3825.7F64009933n59158l419113R99374J811371K372818R23996p478332K752456P083283
3834.3F68496628o304856j611862P605057q234405m478760N931473l746262K231903
3842.1F59888916O042099k458649l024826K241516J261292M47998J531906j328583
$$ plain form
3849.8 664601669 666556396 671956635 664878235 661130219 648117523 652928925 663322906 663250961
3857.5 663250961 661195755 662612457 664690475 666383133 661132736 661267624 667452774 662818985
3865.2 662818985 656975479 659739380 664792633 670603180 662148285 653643417 658268051 664946213
3872.9 664946213 667446365 658099365 660960312 664963913 663611298 665253677 669430695 663900604
3880.6 663900604 657013474 662700348 664050140 665060272 668927841 657019272 658574219 663424759
3888.3 663424759 664294815 667508469 666477585 659023437 660854797 663709641 662250671 663738632
3896.1 663738632 664420776 666040802 667098923 658143234 663521347 665103531 659336929 663516922
3903.8 663516922 659951706 658564758 660001831 660995789 663137817 663685989 664313278 664269333 664402008
$$ packed form
3849.8F64601669J954727N400239p078400l748016j3012696M811402J0393981p1945
3857.5F63250961k055206J416702K078018J692658n250397J34888O185150m633789
3865.2F62818985n843506K763901N053253N810547q454895q504868M624634O678162
3872.9F64946213K500152r347000K860947M003601j352615J642379M177018n530091
3880.6F63900604o887130N686874J349792J010132L867569j1908569J554947M850540
3888.3F63424759Q70056L213654j030884p454148J831360K854844j458970J487961
3896.1F63738632O82144J620026J058121q955689N378113J582184n766602M179993
3903.8F63516922l565216j386948J437073R93958K142028N48172O27289m3945J32675
$$ plain form
3912.5 664402008 664005661 662696075 663333435 665433731 662581787 659499435 663965912 664013138 660213394
3921.1 660213394 662087479 663727493 664747086 662327118 660046844 662288589 663837204 663910446 661726303
3929.8 661726303 661766281 663603363 661023788 660636444 662626572 663031921 663422699 663733749 662927780
3938.5 662927780 662403946 662624741 663935699 664883728 661204147 660425568 661852722 662406235 663447189
3947.2 663447189 661379700 661921463 662185745 659731674 661740265 662404022 662052078 662495728 662702026
3955.8 662702026 662920990 661671829 661362762 661003876 661499329 661904449 660493851 661186752 661954575
3964.5 661954575 661523972 661293411 661305466 661655350 661943359 662005997 662494431 662629089 661770554 661167603
3974.2 661167603 661386261 662655334 663031616 662573471 662421875 662239685 662456207 662582016 662751083
$$ packed form
3912.5F64402008l96347j309586O37360K100296k851944l082352M466477M7226l799744
3921.1F60213394J874085J640014J019593k419968k280274K241745J548615P3242k184143
3929.8F61726303L9978J837082k579575l87344J990128M05349L90778L11050q05969
3938.5F62927780n23834K20795J310958R48029l679581p78579J427154N53513J040954
3947.2F63447189k067489N41763K64282k454071K008591O63757l51944M43650K06298
3955.8F62702026K18964j249161l09067l58886M95453M05120j410598O92901P67823
3964.5F61954575m30603k30561J2055L49884K88009O2638M88434J34658q58535o02951
3974.2F61167603K18658J269073L76282m58145j51596j82190K16522J25809J69067
$$ plain form
3982.8 662751083 662210312 661784973 661929626 662244110 662626724 661722488 661671295 661650925 661172409 661481476
3992.5 661481476 661646042 661888504 661392365 661758728 662395325 662168198 662176514 662456436
4000.2 662456436
$$ packed form
3982.8F62751083n40771m25339J44653L14484L82614r04236n1193k0370m78516L09067
3992.5F61481476J64566K42462m96139L66363O36597k27127Q316K79922
4000.2F62456436
##END=$$ End of the data block
