##TITLE=$$ Begin of the data block
##JCAMP-DX=5.00 $$ ACD/SpecManager v 10.08
##SPECTROMETER/DATA SYSTEM=Varian
##DATE=08 Jan 2013 15:20:26
##DATA TYPE=INFRARED SPECTRUM
##DATA CLASS=XYDATA
##ORIGIN=
##OWNER=
##NPOINTS=3735
##FIRSTX=399.26403809
##LASTX=4000.35498047
##MAXX=4000.35498047
##MINX=399.26403809
##MAXY=71.31504059
##MINY=29.31388092
##XFACTOR=1.0000000000
##YFACTOR=0.000000100000000
##FIRSTY=47.86094284
##DELTAX=0.96440572
##XUNITS=1/CM
##YUNITS=TRANSMITTANCE
##XYDATA=(X++(Y..Y))
$$ plain form
399.3 478609428 474525604 475263367 478424034 482074394 489718246 481153564 469909630 472771301
407 472771301 477565613 478247414 479098587 480115051 483125763 485185776 479736290 472636757 473547134
415.7 473547134 481323090 481894035 469708672 455630569 460902443 471556511 474378281 478004341
423.4 478004341 480703926 478588638 477748947 479624023 481126671 478396912 477588921 475096245 472238770
432.1 472238770 472705116 472859535 476054153 475570755 469802170 467489624 469406357 471731911 474379539
440.7 474379539 475673981 476121559 480178566 480033188 479497643 477193451 471489677 468813286 469934158
449.4 469934158 475242500 475537224 473625793 471126289 468208084 468609009 471528778 471026878 465425148
458.1 465425148 472028618 471891708 466331062 462936821 465235596 470858498 468260880 468284683 465658913
$$ packed form
399.3D78609428m083824P37763L160667L650360P643852q564682j1243934K861671
407D72771301M794312O81801Q51173J016464L010712K060013n449486p099533R10377
415.7D73547134P775956N70945j2185363j4078103N271874J0654068K821770L626060
423.4D78004341K699585k115288q39691J875076J502648k729759q07991k492676k857475
432.1D72238770M66346J54419L194618m83398n768585k312546J916733K325554K647628
440.7D74379539J294442M47578M057007j45378n35545k304192n703774k676391J120872
449.4D69934158N308342K94724j911431k499504k918205M00925K919769n01900n601730
458.1D65425148O603470j36910n560646l394241K298775N622902k597618K3803k625770
$$ plain form
466.8 465658913 462581215 465265808 462341042 461185112 458571129 459338379 463457336 465341759 466374512
475.5 466374512 462973289 464504356 466256065 465036011 462820015 463387566 465074501 460338593 460064888
484.1 460064888 461955032 459250908 461198730 463931885 462745667 461606865 460277634 459214020
491.8 459214020 459214973 458075600 456057854 456264915 460037727 461565933 463343048 464957848 460816574
500.5 460816574 455570602 453870773 455756264 456286507 457995682 455841980 453018799 456454430 455828590
509.2 455828590 456884995 457430840 455917969 456415291 453406029 451789703 450917320 448666458 448495026
517.9 448495026 451165428 452894707 449558716 448797874 451683350 452017975 451182213 451833992 450485802
526.6 450485802 450767517 453100166 454320335 453009567 449713173 450238419 449527054 447179909 447994194
$$ packed form
466.8D65658913l077698K684593k924766j155930k613983P67250M118957J884423J032753
475.5D66374512l401223J531067J751709j220054k215996N67551J686935m735908k73705
484.1D60064888J890144k704124J947822K733155j186218j138802j329231j063614
491.8D59214020R53j139373k017746K07061L772812J528206J777115J614800m141274
500.5D60816574n245972j699829J885491N30243J709175k153702k823181L435631o25840
509.2D55828590J056405N45845j512871M97322l009262j616326q72383k250862j71432
517.9D48495026K670402J729279l335991p60842K885476L34625q35762O51779j348190
526.6D50485802K81715K332649J220169j310768l296394N25246p11365k347145Q14285
$$ plain form
535.2 447994194 448546104 448800964 448216972 447574501 446545105 447338028 448994026 448025665 447822380
543.9 447822380 447343330 446825981 445945930 444939079 444921951 443578529 442306862 443253593 444994469
552.6 444994469 444459610 444273262 444286499 443133392 442798195 442015533 440914536 440426216 440978775 439702225
562.3 439702225 439613571 442409706 442920418 442436790 442629089 443660316 442748108 441046219 441242447
570.9 441242447 441112061 440810699 440458183 441983223 443281746 441951790 440510521 440390968 441019325
579.6 441019325 440041199 439744835 439678078 439202499 440079041 441844673 442222481 441626587 442959900 443069839
589.3 443069839 442485008 442796326 443107643 444247780 444504242 445233765 445320930 444067879 443648338 444100189
598.9 444100189 445768929 446659431 446098785 445209846 444111366 443506012 444300652 443589554 440195122
$$ packed form
535.2D47994194N51910K54860n83992o42471j029396P92923J655998r68361k03285
543.9D47822380m79050n17349q80051j006851j7128j343422j271667R46731J740876
552.6D44994469n34859j86348J3237j153107l35197p82662j100997m88320N52559j276550
562.3D39702225q8654K796135N10712m83628J92299J031227r12208j701889J96228
570.9D41242447j30386l01362l52516J525040J298523j329956j441269j19553O28357
579.6D41019325r78126k96364o6757m75579Q76542J765632L77808n95894J333313J09939
589.3D43069839n84831L11318L11317J140137K56462P29523Q7165j253051m19541M51851
598.9D44100189J668740Q90502n60646q88939j098480o05354P94640p11098l394432
$$ plain form
607.6 440195122 439402809 441210251 442310371 441567459 440351982 440339317 439751892 439062538 438670807
616.3 438670807 437571678 437106857 437083282 437883377 440631638 442622452 443039589 442627029 441774368
624.9 441774368 442242165 444074974 444982109 443973045 444267578 447018738 449332237 450360069 451956329
633.6 451956329 454342308 455044708 454989319 455126419 454640274 455231133 456685905 457511749 458306122 460887299
643.3 460887299 463752251 464480247 464995918 465210876 463188705 460948753 460799904 461851883 463061905
651.9 463061905 464500732 466214447 467721901 467732658 467782593 468259239 466832848 465146637 465017014
660.6 465017014 465913239 466544762 467166824 468362770 469726334 470670357 463915787 442755165 455680389
669.3 455680389 464479561 467630768 468111382 468369827 469875221 471394844 472900352 474486504 475068703
$$ packed form
607.6D40195122p92313J807442J100120p42912j215477j2665n87425o89354l91731
616.3D38670807j099129m64821k3575Q00095K748261J990814M17137m12560q52661
624.9D41774368M67797J832809R07135j009064K94533K751160K313499J027832J596260
633.6D51956329K385979P02400n5389J37100m86145N90859J454772Q25844P94373K581177
643.3D60887299K864952P27996N15671K14958k022171k239952j48849J051979J210022
651.9D63061905J438827J713715J507454J0757M9935M76646j426391j686211j29623
660.6D65017014Q96225O31523O22062J195946J363564R44023o754570k1160622J2925224
669.3D55680389Q799172L151207M80614K58445J505394J519623J505508J586152N82199
$$ plain form
678 475068703 475301590 476070671 476912918 476687660 475799522 476835747 478722649 480072327 481705132
686.7 481705132 482295609 483120842 484613495 485225792 486042023 486295013 486420021 487166290 487399826 488477592
696.3 488477592 490357704 491281853 491486664 491297836 491613503 492476997 492642784 492970238 493792915 495172691
705.9 495172691 496231041 496736870 498683434 499341621 498229332 498659477 499553604 499816895 500388107
714.6 500388107 501509438 501989479 502541275 504261589 504395485 502891617 503740730 505098686 504748077
723.3 504748077 505065231 506032028 507608910 509386940 510175018 510734787 511301346 512016678 512131805
732 512131805 512241745 512746506 513629417 514942932 515805283 517067070 517565079 517518158 517589760 517614403
741.6 517614403 518326035 518807411 519647942 520000801 520482445 521839943 522397652 523178291 524037666 523993721
$$ packed form
678D75068703K32887P69081Q42247k25258q88138J036225J886902J349678J632805
686.7D81705132N90477Q25233J492653O12297Q16231K52990J25008P46269K33536J077766
696.3D88477592J880112R24149K04811j88828L15667Q63494J65787L27454Q22677J379776
705.9D95172691J058350N05829J946564O58187j112289M30145Q94127K63291N71212
714.6E00388107J121331M80041N51796J720314J33896j503868Q49113J357956l50609
723.3E04748077L17154R66797J576882J778030P88078N59769N66559P15332J15127
732E12131805J09940N04761Q82911J313515Q62351J261787M98009m6921P1602K4643
741.6E17614403P11632M81376Q40531L52859M81644J357498N57709P80639Q59375m3945
$$ plain form
751.3 523993721 523628044 523592453 523454781 524576187 526655197 527854233 529125481 529839134 530709572
760 530709572 532061081 532925415 532809868 532174797 532910423 533936768 534871521 535736198 536700630 537041435
769.6 537041435 535926781 536016922 537037659 536607552 535213318 535269089 535748482 535817947 536853600 537988167
779.2 537988167 538441963 538017349 537658424 537608490 538110886 538247375 537167587 536860847 537705421 539411507
788.9 539411507 540726700 541333084 541605453 542127304 542331963 540942192 539943886 538898506 538508301
797.6 538508301 538955040 539074707 539039001 538646164 538721924 537582283 535713654 533837585 531994362
806.2 531994362 530776749 528960304 527203178 526391258 526387329 525588722 524807129 524611473 523348083
814.9 523348083 521176224 519288597 519260941 519111099 518568382 518770065 519433136 521249237 523105850
$$ packed form
751.3E23993721l65677l5591j37672J121406K079010J199036J271248P13653Q70438
760E30709572J351509Q64334j15547o35071P35626J026345R34753Q64677R64432L40805
769.6E37041435j114654R0141J020737m30107j394234N5771M79393O9465J035653J134567
779.2E37988167M53796m24614l58925m9934N02396J36489j079788l06740Q44574J706086
788.9E39411507J315193O06384K72369N21851K04659j389771r98306j045380l90205
797.6E38508301M46739J19667l5706l92837P5760j139641j868629j876069j843223
806.2E31994362j217613j816445j757126q11920l929p98607p81593j95656j263390
814.9E23348083k171859j887627k7656j49842n42717K01683O63071J816101J856613
$$ plain form
823.6 523105850 524742851 525824509 526378899 527470779 529610252 531915207 533750420 536056099 537885895
832.3 537885895 540584641 543560333 545688515 547663689 548528404 550303917 551758881 552064285 553299980
841 553299980 555285301 557001419 558499565 560454254 562031288 562629280 562216644 563432198 565462418
849.6 565462418 566431503 567329788 568051834 569626694 570664597 572049217 574255295 575722961 576853027
858.3 576853027 577335548 577643051 578179207 579671631 579891624 579501457 580521126 580766449 579955673
867 579955673 579735374 580188179 578698235 576695251 574804192 573583336 573332253 572133026 571455193
875.7 571455193 571258240 571903687 571329765 570314636 570693550 570199280 569737587 568377762 567254372
884.4 567254372 566969833 566699677 566650162 566313972 565335732 563635025 563365784 563326187 563623199 564043922
$$ packed form
823.6E23105850J637001J081658N54390J091880K139473K304955J835213K305679J829796
832.3E37885895K698746K975692K128182J975174Q64715J775513J454964L05404J235695
841E53299980J985321J716118J498146J954689J577034N97992m12636J215554K030220
849.6E65462418R69085Q98285P22046J574860J037903J384620K206078J467666J130066
858.3E76853027M82521L07503N36156J492424K19993l90167J019669K45323q10776
867E79955673k20299M52805j489944k002984j891059j220856k51083j199227o77833
875.7E71455193j96953O45447n73922j015129L78914m94270m61693j359825j123390
884.4E67254372k84539k70156m9515l36190r78240j700707k69241l9597K97012M20723
$$ plain form
894 564043922 564254913 565312614 565699539 566608696 566536064 565694580 565293541 564443016 563468361 563184242
903.7 563184242 565016212 566590691 568288994 570008011 571085548 572643585 573285866 573907547 574249878
912.3 574249878 574478378 574380951 573228226 571360016 569580269 568102264 565896721 563804893 561184006
921 561184006 558812752 556541138 554480858 553162155 550468216 546602821 542381935 539634590 537489967
929.7 537489967 535058250 532586021 530330276 529901924 529571228 528839073 528281403 528152161 527981720
938.4 527981720 527310638 526912193 525781708 524624443 524251633 524543915 524406281 524185867 524747391
947.1 524747391 524370842 523750648 523422432 523473358 523376732 522867432 522366982 521277618 520489998 519910278
956.7 519910278 519344406 518165512 515946007 513108063 510244675 508247070 506584511 504737434 502899323
$$ packed form
894E64043922K10991J057701L86925R09157p2632q41484m01039q50525r74655k84119
903.7E63184242J831970J574479J698303J719017J077537J558037O42281O21681L42331
912.3E74249878K28500r7427j152725j868210j779747j478005k205543k091828k620887
921E61184006k371254k271614k060280j318703k693939l865395m220886k747345k144623
929.7E37489967k431717k472229k255745m28352l30696p32155n57670j29242j70441
938.4E27981720o71082l98445j130485j157265l72810K92282j37634k20414N61524
947.1E24747391l76549o20194l28216N0926r6626n09300n00450j089364p87620n79720
956.7E19910278n65872j178894k219505k837944k863388j997605j662559j847077j838111
$$ plain form
965.4 502899323 501837311 500527153 499283371 498172951 496134109 494838066 492953568 490307503
973.1 490307503 488499336 486438980 483585396 480571022 478019371 475414200 472361603 469206161
980.8 469206161 465954475 461949501 458008270 454308014 450489540 446625786 442424316 439145927
988.5 439145927 436072655 432558403 429212799 425678596 421898460 418384819 415403824 412442970
996.2 412442970 409426956 406804543 404925117 402737007 400168304 397813568 396103554 394442253
1004 394442253 391898499 389966888 388679924 387724915 386297798 384567909 383383751 382034569 380511513
1012.6 380511513 378829842 377736931 375941162 373531036 371504021 369397583 366845131 363640900
1020.3 363640900 361990814 360208549 357641716 355634499 354002342 352979736 351787834 350497589
$$ packed form
965.4E02899323j062012j310158j243782j110420k038842j296043j884498k646065
973.1D90307503j808167k060356k853584l014374k551651k605171l052597l155442
980.8D69206161l251686m004974l941231l700256l818474l863754m201470l278389
988.5D39145927l073272l514252l345604l534203l780136l513641k980995k960854
996.2D12442970l016014k622413j879426k188110k568703k354736j710014j661301
1004C94442253k543754j931611j286964r55009j427117j729889j184158j349182j523056
1012.6C80511513j681671j092911j795769k410126k027015k106438k552452l204231
1020.3C63640900j650086j782265k566833k007217j632157j022606j191902j290245
$$ plain form
1028.1 350497589 348935051 348701515 348226662 346689262 346404495 346926994 347293625 347299652 348488464
1036.7 348488464 349383049 350677986 352109032 352509613 353937187 355166130 355766373 355168304 354726257
1045.4 354726257 355079765 355245399 355145531 354220123 353365479 352054749 351494675 350783882 349201355
1054.1 349201355 347991562 347061043 346775398 346593361 347199287 347275238 348327255 350447731 352579384
1062.8 352579384 354689445 355936241 357970886 358592072 359959106 362263603 363846359 365621338
1070.5 365621338 366437798 367019424 366177635 366382637 366928711 366689148 367375412 367020111 366879349 367462311
1080.1 367462311 368922005 369661407 370031013 370685921 371187096 372258148 371846695 372155418 373619270
1088.8 373619270 375271263 377063065 378688278 379959106 380823708 382528381 383163605 384252548 386103172
$$ packed form
1028.1C50497589j562538k33536m74853j537400k84767N22499L66631O027J188812
1036.7C48488464Q94585J294937J431046M00581J427574J228943O00243n98069m42047
1045.4C54726257L53508J65634r9868r25408q54644j310730n60074p10793j582527
1054.1C49201355j209793r30519k85645j82037O05926P5951J052017K120476K131653
1062.8C52579384K110061J246796K034645O21186J367034K304497J582756J774979
1070.5C65621338Q16460N81626q41789K05002N46074k39563O86264l55301j40762N82962
1080.1C67462311J459694P39402L69606O54908N01175J071052m11453L08723J463852
1088.8C73619270J651993J791802J625213J270828Q64602J704673O35224J088943J850624
$$ plain form
1097.5 386103172 387296715 388309937 389738884 392169151 393518486 394993973 396174202 397405968
1105.2 397405968 399210014 399483261 400124245 401038780 401444550 401774406 402507744 403220482 404160881
1113.9 404160881 405809937 406749916 407212601 406985283 406735687 406441994 406109810 406247826 406142693
1122.6 406142693 406543503 407120361 407780838 408273392 409237633 410167503 410600471 412191734 414193497
1131.2 414193497 416226730 417718735 419284897 420866966 422955627 426083069 427541199 427960472
1139 427960472 429104042 430993309 432358131 433784561 435384827 435583458 436058464 436869125 437615242
1147.6 437615242 438140488 437605896 437316322 437997704 438524742 438022308 437709389 437766151 437722435 437641029
1157.3 437641029 436988258 436072121 435397911 434920197 434095688 433899269 434653206 436160431 437854729
$$ packed form
1097.5C86103172J193543J013222J428947K430267J349335J475487J180229J231766
1105.2C97405968J804046K73247O40984R14535M05770L29856P33338P12738R40399
1113.9D04160881J649056R39979M62685k27318k49596k93693l32184J38016j05133
1122.6D06142693M00810N76858O60477M92554R64241R29870M32968J591263K001763
1131.2D14193497K033233J492005J566162J582069K088661L127442J458130M19273
1139D27960472J143570J889267J364822J426430J600266J98631M75006Q10661P46117
1147.6D37615242N25246n34592k89574O81382N27038n02434l12919N6762m3716q1406
1157.3D37641029o52771r16137o74210m77714q24509j96419P53937J507225J694298
$$ plain form
1166 437854729 438416595 439820786 441836624 443496513 445749779 447715187 449479980 452003136 454938164
1174.6 454938164 457573090 459769669 462320251 464792595 466672516 469161148 471250572 472162209
1182.4 472162209 473016548 474489594 475957642 477420120 479087410 479856758 480426331 480569611 480260773
1191 480260773 480241852 480207672 480139618 479620895 479048843 478698006 478376503 477918739 477376251 476633224
1200.7 476633224 475634537 474710999 473394508 472056313 471185455 470697937 470376244 470284729 470576210
1209.4 470576210 470355453 469618187 469009933 468626404 468292465 467885971 467406731 466984062 466994629 467207413
1219 467207413 467280807 466723366 465744057 465029182 464427872 463934441 463281479 462793694 462426033 461627922
1228.6 461627922 461211815 461092262 460657616 459861641 458721313 457872162 457597313 457299309 456643944
$$ packed form
1166D37854729N61866J404191K015838J659889K253266J965408J764793K523156K935028
1174.6D54938164K634926K196579K550582K472344J879921K488632K089424R11637
1182.4D72162209Q54339J473046J468048J462478J667290P69348N69573J43280l08838
1191D80260773j8921l4180o8054n18723n72052l50837l21503m57764n42488p43027
1200.7D76633224r98687r23538j316491j338195q70858m87518l21693r1515K91481
1209.4D70576210k20757p37266o08254l83529l33939m06494m79240m22669J0567K12784
1219D67207413P3394n57441r79309p14875o01310m93431o52962m87785l67661p98111
1228.6D61627922m16107j19553m34646p95975j140328q49151k74849k98004o55365
$$ plain form
1237.3 456643944 456292992 456558342 456938286 457109795 457024651 456693382 456071205 455520287 454911270 454152107
1247 454152107 453597183 453284454 453314247 453311310 453233948 453233833 453153801 452862625 452462158 452206535 452015533
1257.6 452015533 451907425 451642609 451734581 452101364 452519798 453425827 453908691 454260025 454552269 454917679
1267.2 454917679 455491486 455911179 456762733 457544098 458284569 459126892 460141182 461307678 462281647
1275.9 462281647 463211136 463983727 464672279 465204430 466021881 467159691 468392830 469927368 471522636
1284.6 471522636 472654800 473209114 473991928 475295601 476625557 477357140 478034668 478777809 479546394
1293.3 479546394 480706787 481521835 482270317 482785683 482732964 482743530 482992096 483342781 483878822 484192886
1302.9 484192886 484137344 484255180 484194641 484113388 483599205 482912979 482863350 482706299 482255592 481596832
$$ packed form
1237.3D56643944l50952K65350L79944J71509q5144l31269o22177n50918o09017p59163
1247D54152107n54924l12729K9793k937p7362j15q0032k91176m00467k55623j91002
1257.6D52015533j08108k64816R1972L66783M18434R06029M82864L51334K92244L65410
1267.2D54917679N73807M19693Q51554P81365P40471Q42323J014290J166496R73969
1275.9D62281647R29489P72591O88552N32151Q17451J137810J233139J534538J595268
1284.6D71522636J132164N54314P82814J303673J329956P31583O77528P43141P68585
1293.3D79546394J160393Q15048P48482N15366n2719J0566K48566L50685N36041L14064
1302.9D84192886n5542J17836o0539q1253n14183o86226m9629j57051m50707o58760
$$ plain form
1312.5 481596832 481208878 480963326 481012955 481138611 480809250 480664253 480779991 481722565 482418175 482582245
1322.2 482582245 483323708 484341393 485307732 485640182 485774803 485960693 485987778 485686302 485281181 484978828
1331.8 484978828 484569092 484611626 484661865 484625244 484469948 484100037 483767014 483494377 483953934 484620247
1341.5 484620247 485467720 486217842 487113991 488167725 488781319 489348755 489398651 489520226 489364243 488863258
1351.1 488863258 488402519 488221207 488291016 487694168 487827530 488357086 488672791 488559837 487885704 487071762
1360.8 487071762 486230011 485170326 483532372 484387627 485046196 484666939 484599228 483959198 483729095
1369.4 483729095 483478012 483079720 482479706 481564064 480967789 480308266 480732040 481371613 481874390 482047005
1379.1 482047005 481882095 481507530 480637093 479237366 477455635 476394386 475533333 474368324 472811012
$$ packed form
1312.5D81596832l87954k45552M9629J25656l29361j44997J15738R42574O95610J64070
1322.2D82582245P41463J017685R66339L32450J34621J85890K7085l01476m05121l02353
1331.8D84978828m09736M2534N0239l6621j55296l69911l33023k72637M59557O66313
1341.5D84620247Q47473P50122Q96149J053734O13594N67436M9896J21575j55983n00985
1351.1D88863258m60739j81312O9809n96848J33362N29556L15705j12954o74133q13942
1360.8D87071762q41751j059685j637954Q55255O58569l79257o7711o40030k30103
1369.4D83729095k51083l98292o00014r15642n96275o59523M23774O39573N02777J72615
1379.1D82047005j64910l74565q70437j399727j781731j061249q61053j165009j557312
$$ plain form
1387.8 472811012 472403717 472287064 471336784 470201073 468505974 466792450 463692780 460165672 459152565
1396.4 459152565 458232994 456525612 453879585 453469734 452819099 450860519 449240608 447406311 443984833
1405.1 443984833 441576843 441183052 440228271 438604851 437514534 436616440 435908699 434892426 433991127
1413.8 433991127 433017159 431680260 430354691 428852501 427749290 425685349 427250671 429333000
1421.5 429333000 430056038 430391998 429623375 430399475 431614456 431959038 432581787 432492409 432722549 433676453
1431.2 433676453 435286026 437062263 438824234 440682297 441262169 440436897 441630516 443902512 445240898
1439.8 445240898 446532059 447918968 448705635 450021629 450841522 452118530 453274345 453628922 453287621
1448.5 453287621 454316864 455883675 456756897 458338737 459008408 460087852 460820351 460882645 460834312
$$ packed form
1387.8D72811012m07295j16653r50280j135711j695099j713524l099670l527108j013107
1396.4D59152565r19571j707382k646027m09851o50635j958580j619911j834297l421478
1405.1D43984833k407990l93791r54781j623420j090317q98094p07741j016273r01299
1413.8D33991127r73968j336899j325569j502190j103211k063941J565322K082329
1421.5D29333000P23038L35960p68623P76100J214981L44582O22749q9378K30140R53904
1431.2D33676453J609573J776237J761971J858063N79872q25272J193619K271996J338386
1439.8D45240898J291161J386909P86667J315994Q19893J277008J155815L54577l41301
1448.5D53287621J029243J566811Q73222J581840O69671J079444P32499O2294m8333
$$ plain form
1457.2 460834312 459845924 464086151 466859169 469650269 471061935 472090950 474042931 473686218 476007271
1465.9 476007271 478415146 480959816 483070183 485095673 487659531 488750191 490216599 491989632
1473.6 491989632 495798225 498549919 500270157 503476486 506221085 507903252 508864975 510415573
1481.3 510415573 511981239 513738060 515540581 516893311 518091431 518057098 518508415 519975014 519156914
1490 519156914 519171715 521222305 522319908 522026291 521550255 520752869 516404762 516508980 515371017
1498.7 515371017 513583031 514251213 513392143 512414169 511988220 512062759 510417747 501815567 498506241
1507.3 498506241 502123566 504709854 504765739 505787239 505096130 503763084 503852997 502814102 502092667
1516 502092667 499006500 498057938 500309486 501071968 498076591 494439087 496713448 499663963 501508980
$$ packed form
1457.2D60834312r88388M240227K773018K791100J411666J029015J951981l56713K321053
1465.9D76007271K407875K544670K110367K025490K563858J090660J466408J773033
1473.6D91989632L808593K751694J720238L206329K744599J682167R61723J550598
1481.3E10415573J565666J756821J802521J352730J198120l4333M51317J466599q18100
1490E19156914J4801K050590J097603k93617m76036p97386m348107J04218j137963
1498.7E15371017j787986O68182q59070r77974m25949P4539j645012q602180l309326
1507.3D98506241L617325K586288N5885J021500o91109j333046Q9913j038895p21435
1516E02092667l086167r48562K251548P62482k995377l637504K274361K950515J845017
$$ plain form
1524.7 501508980 500550156 501489105 502843666 503016701 503963394 504691772 504990807 505040207 504265404 503311615
1534.3 503311615 505505562 506906738 508055649 509994621 504626884 499134598 504185104 506527901
1542.1 506527901 506699562 507666168 508496666 509218178 511646004 512557144 513178596 512528000 511226158
1550.7 511226158 512443123 512808685 512870941 510094604 510868950 512611465 512159615 505751457 499400673
1559.4 499400673 504971771 506561241 508020020 507128563 505281868 502433548 500897064 500659447 498917007
1568.1 498917007 496989021 489937401 490143852 489644623 487065506 484452362 481576653 479734230 468328247
1576.8 468328247 468312912 466746483 463692436 460754051 456492348 454009476 449509201 446213837 441908417
1585.5 441908417 438163414 434317436 430056839 427180176 422323456 419963684 415347862 412504425
$$ packed form
1524.7E01508980r58824R38949J354561J73035R46693P28378K99035M9400p74803r53789
1534.3E03311615K193947J401176J148911J938972n367737n492286N050506K342797
1542.1E06527901J71661R66606Q30498P21512K427826R11140O21452o50596j301842
1550.7E11226158J216965L65562O2256k776337P74346J742515m51850o408158o350784
1559.4D99400673N571098J589470J458779q91457j846695k848320j536484k37617j742440
1568.1D98917007j927986p051620K06451m99229k579117k613144k875709j842423j1405983
1576.8D68328247j5335j566429l054047k938385m261703k482872m500275l295364m305420
1585.5D41908417l745003l845978m260597k876663m856720k359772m615822k843437
$$ plain form
1593.2 412504425 409392738 405148087 402475243 398112679 396127014 391685867 389389229 386247826
1600.9 386247826 383135872 381523170 378052101 376927109 373857880 372662773 369397659 367666283
1608.6 367666283 366279106 363337021 363350487 360995407 361024666 359341507 359394531 358526573 352302589
1617.3 352302589 354831848 354377136 355315437 353972244 354589081 353462944 351582832 353662682 353501091
1626 353501091 355281219 353484879 354237366 354860573 355702553 356667213 356509743 358902245 358916512 359439316
1635.6 359439316 357732735 360480042 362881088 364581108 367201424 367391167 369246750 369361649 371720428
1644.3 371720428 373671227 372338943 373666267 372713356 376853180 378743439 382006989 384194450
1652 384194450 382887268 378771973 380043755 385044937 386595001 388792305 389816055 391599960 393595581
$$ packed form
1593.2D12504425l111687m244651k672844m362564j985665m441147k296638l141403
1600.9C86247826l111954j612702l471069j124992l069229j195107l265114j731376
1608.6C67666283j387177k942085J3466k355080K9259j683159N3024q67958o223984
1617.3C52302589K529259m54712R38301j343193O16837j126137j880112K079850j61591
1626C53501091J780128j796340P52487O23207Q41980R64660j57470K392502J4267N22804
1635.6C59439316j706581K747307K401046J700020K620316J89743J855583J14899K358779
1644.3C71720428J950799j332284J327324r52911M139824J890259L263550K187461
1652C84194450j307182m115295J271782N001182J550064K197304J023750J783905J995621
$$ plain form
1660.7 393595581 395122910 397503662 397598915 401133995 403286552 406211777 408703880 409902496 412111931
1669.4 412111931 414324722 419057312 421475906 425650826 428794785 430307732 433591805 437100639
1677.1 437100639 441425438 444069557 447260933 449816017 454497795 459100456 459524994 463506813
1684.8 463506813 466675529 472985001 477349091 480642052 484079018 487298126 491818161 495902100
1692.5 495902100 500171471 504285736 507698135 507085342 512775955 518999405 524277802 527008781
1700.2 527008781 525969734 532804794 537528152 540681915 542871628 545714340 548456802 551768227
1707.9 551768227 555523911 557387390 559070854 561472015 563653297 565493546 565747833 566484756 569422455
1716.6 569422455 570569000 568220253 572562866 575861206 578027153 579520493 580076904 580739632 582200546
$$ packed form
1660.7C93595581J527329K380752R5253L535080K152557K925225K492103J198616K209435
1669.4D12111931K212791M732590K418594M174920L143959J512947L284073L508834
1677.1D37100639M324799K644119L191376K555084M681778M602661M24538L981819
1684.8D63506813L168716O309472M364090L292961L436966L219108M520035M083939
1692.5D95902100M269371M114265L412399o12793N690613O223450N278397K730979
1700.2E27008781j039047O835060M723358L153763K189713K842712K742462L311425
1707.9E51768227L755684J863479J683464K401161K181282J840249K54287P36923K937699
1716.6E69422455J146545k348747M342613L298340K165947J493340N56411O62728J460914
$$ plain form
1725.3 582200546 584120750 585423508 586851959 588403740 587857094 588526649 591681099 594413719 592158585
1734 592158585 588801231 593297539 597137222 599541702 602323494 602432213 601707420 605881386 608174706
1742.7 608174706 608001671 610058746 613293114 615601730 617410622 619263611 621281433 625726433
1750.4 625726433 626920815 628384933 633015976 635911789 638805771 640984421 640688629 642778854
1758.1 642778854 645635529 647745667 650074158 649157410 650066299 653640289 655152054 656482773 658264999
1766.8 658264999 659509659 658285446 660428772 663634567 662058487 659762421 660392075 664593811
1774.5 664593811 666819763 666746902 668855515 669571381 670637589 670796509 670292892 671720047 673151169
1783.2 673151169 674249039 673869629 674428329 676039352 677058563 677388916 678424683 678517609 678090439
$$ packed form
1725.3E82200546J920204J302758J428451J551781n46646O69555L154450K732620k255134
1734E92158585l357354M496308L839683K404480K781792J08719p24793M173966K293320
1742.7F08174706j73035K057075L234368K308616J808892J852989K017822M445000
1750.4F25726433J194382J464118M631043K895813K893982K178650k95792K090225
1758.1F42778854K856675K110138K328491r16748R08889L573990J511765J330719J782226
1766.8F58264999J244660j224213K143326L205795j576080k296066O29654M201736
1774.5F64593811K225952p2861K108613P15866J066208J58920n03617J427155J431122
1783.2F73151169J097870l79410N58700J611023J019211L30353J035767R2926m27170
$$ plain form
1791.8 678090439 677090378 677077103 680277176 681212921 681113052 682547989 683885803 683849182 683012848
1800.5 683012848 684601669 684205627 684784012 686494675 687241135 688038940 688211823 688642197 689396896
1809.2 689396896 690282593 689414978 690157928 691449890 691465836 692261658 692482681 693327484 693321457 693914642
1818.8 693914642 694899750 694855576 695762711 695336151 696088257 696904831 694937973 695476913 697200775
1827.5 697200775 698232727 696948776 694564209 696320801 699117355 699841537 699846268 700056992 700242310
1836.2 700242310 700139160 699626541 700901413 701228790 701354218 701652756 702536621 702542648 698617477 701662827
1845.8 701662827 703712921 703249664 703055725 703741684 704834366 704768066 704963303 704684219 705493927
1854.5 705493927 706332550 706056976 706100388 705731506 705880051 705774765 706035385 706063232 706318893 706779938
$$ packed form
1791.8F78090439j000061j3275L200073R35745r9869J434937J337814l6621q36334
1800.5F83012848J588821l96042N78385J710663P46460P97805J72883M30374P54699
1809.2F89396896Q85697q67615P42950J291962J5946P95822K21023Q44803o027N93185
1818.8F93914642R85108m4174R07135m26560P52106Q16574j966858N38940J723862
1827.5F97200775J031952j283951k384567J756592K796554P24182M731K10724J85318
1836.2G00242310j03150n12619J274872L27377J25428K98538Q83865O027l925171L045350
1845.8G01662827K050094m63257j93939O85959J092682o6300J95237k79084Q09708
1854.5G05493927Q38623k75574M3412l68882J48545j05286K60620K7847K55661M61045
$$ plain form
1864.2 706779938 707105942 707650146 706629105 706907578 706565018 706350937 707561035 708022461 708359680
1872.8 708359680 708095932 708632355 709098740 709664536 709704971 709438095 709822845 709585114 709870834 709699097
1882.5 709699097 709747391 709405670 709331360 710128098 710104675 711011581 710568771 709259262 710066452 710750351
1892.1 710750351 710620499 710596390 710474854 710002213 711092453 711586075 711425323 711425171 711547089 711763611
1901.8 711763611 711671829 712060471 711687469 711616058 711694565 711844711 712044830 711548843 711457367 711557693
1911.4 711557693 712625961 712730408 712597885 712531738 712250443 713041687 711329193 710739594 711995544
1920.1 711995544 712868576 713072891 712030487 711992798 712515717 712822571 712455368 712493744 712519760 712601624
1929.7 712601624 713066940 712877960 712914047 712731476 713121796 713150406 712926788 713009949 712654800 712615204
$$ packed form
1864.2G06779938L26004N44204j021041K78473l42560k14081J210098M61426L37219
1872.8G08359680k63748N36423M66385N65796M0435k66876L84750k37731K85720j71737
1882.5G09699097M8294l41721p4310P96738k3423R06906m42810j309509Q07190O83899
1892.1G10750351j29852k4109j21536m72641J090240M93622j60752j52J21918K16522
1901.8G11763611r1782L88642l73002p1411P8507J50146K00119m95987r1476J00326
1911.4G11557693J068268J04447j32523o6147k81295P91244j712494n89599J255950
1920.1G11995544Q73032K04315j042404l7689N22919L06854l67203L8376K6016Q1864
1929.7G12601624M65316j88980L6087j82571L90320K8610k23618Q3161l55149l9596
$$ plain form
1939.4 712615204 712278595 712706985 711905518 710885391 712290268 712714081 712392502 712243881 712429581
1948.1 712429581 712213974 712255783 712437363 712177048 712060165 712083282 712342072 711896286 711832199 711717606
1957.7 711717606 711776199 712411804 712082825 711613464 711381683 711814346 711659088 711162033 711082840 710561295
1967.3 710561295 710649109 711078491 711513290 711473007 711515579 711409683 711116638 711057968 710848389 710944061
1977 710944061 710672073 710801315 710942841 711075058 711304016 711128845 711388626 710994186 710607986 710446243
1986.6 710446243 710297165 709706497 709111023 709819412 710074463 709810333 709779282 710126801 709874039 709524994
1996.3 709524994 709703217 709234924 709034805 708770828 708964920 709345551 709608612 709822464 709431534 709275360
2005.9 709275360 708621292 708064957 707633286 707595978 707775345 707657623 708022995 707873993 707987061 708071976
$$ packed form
1939.4G12615204l36609M28390q01467j020127J404877M23813l21579j48621J85700
1948.1G12429581k15607M1809J81580k60315j16883K3117K58790m45786o4087j14593
1957.7G11717606N8593O35605l28979m69361k31781M32663j55258m97055p9193n21545
1967.3G10561295Q7814M29382M34799m0283M2572j05896k93045n8670k09579R5672
1977G10944061k71988J29242J41526J32217K28958j75171K59781l94440l86200j61743
1986.6G10446243j49078n90668n95474P08389K55051k64130l1051L47519k52762l49045
1996.3G09524994J78223m68293k00119k63977J94092L80631K63061K13852l90930j56174
2005.9G09275360o54068n56335m31671l7308J79367j17722L65372j49002J13068Q4915
$$ plain form
2015.6 708071976 708026276 707927551 707447205 707152786 706710968 706648331 706373749 706535263 706931686 707090836
2025.2 707090836 707074966 706623840 706665573 706074448 705611801 705307693 704976196 705080719 705088882 705507507
2034.9 705507507 705404434 705371170 705524292 705547256 705262909 704477768 704019547 704029922 704380417 703837967
2044.5 703837967 703672714 704153976 704464951 704624634 704175949 704008942 703596497 703611679 703411560 702816315
2054.1 702816315 702902832 702880249 703207321 703353729 703492279 703360672 703010864 702885056 702569046 702442627
2063.8 702442627 702172623 702245865 702297058 702460709 702706833 702853012 703031998 702733536 702486725 701888733
2073.4 701888733 701637039 701631622 701629715 701734390 701634293 701938858 702063370 702202301 701918945 701805420
2083.1 701805420 701546936 700747070 700833054 700937271 701168442 701058655 701001053 701149521 701080246 701125641
$$ packed form
2015.6G08071976m5700r8725m80346k94419m41818o2637k74582J61514L96423J59150
2025.2G07090836j5870m51126M1733n91125m62647l04108l31497J04523Q163M18625
2034.9G05507507j03073l3264J53122K2964k84347p85141m58221J0375L50495n42450
2044.5G03837967j65253M81262L10975J59683m48685j67007m12445J5182k00119n95245
2054.1G02816315Q6517k2583L27072J46408J38550j31607l49808j25808l16010j26419
2063.8G02442627k70004P3242N1193J63651K46124J46179J78986k98462k46811n97992
2073.4G01888733k51694n417j907J04675j00097L04565J24512J38931k83356j13525
2083.1G01805420k58484p99866Q5984J04217K31171j09787n7602J48468o9275M5395
$$ plain form
2092.7 701125641 700465240 700112686 700186615 700491104 700289230 699906540 699951324 699826660 700114136 699869690
2102.4 699869690 699662552 699381104 699023514 698843842 698659821 699268036 699061432 698784561 698738327 698596725
2112 698596725 698628235 698348160 698381577 698369751 698521271 698439865 698259354 698016357 697958221 698318863 698053513
2122.6 698053513 698048172 698025742 697857132 697420120 697233353 697735291 697863693 697969208 697693710 697625427
2132.3 697625427 697744751 697737656 697456589 696944885 697019730 696867752 696875687 697005081 697294998 697597427
2141.9 697597427 697752609 697880173 697386475 697283173 697194977 697059402 696936340 697037888 697482986 697488937
2151.5 697488937 697605743 697528381 697645340 697591553 697274094 697103500 696894302 697029190 696974869 697040253
2161.2 697040253 697213058 697748108 698197784 698361206 698279343 697451096 697108002 696978302 697220688 697391663
$$ packed form
2092.7G01125641o60401l52554P3929L04489k01874l82690M4784j24664K87476k44446
2102.4F99869690k07138k81448l57590j79672j84021O08215k06604k76871m6234j41602
2112F98596725L1510k80075L3417j1826J51520q1406j80511k42997n8136L60642k65350
2122.6F98053513n341k2430j68610m37012j86767N01938J28402J05515k75498o8283
2132.3F97625427J19324p095k81067n11704P4845j51978P935J29394K89917L02429
2141.9F97597427J55182J27564m93698j03302q8196j35575j23062J01548M45098N951
2151.5F97488937J16806p7362J16959n3787l17459j70594k09198J34888n4321O5384
2161.2F97040253J72805N35050M49676J63422q1863q28247l43094j29700K42386J70975
$$ plain form
2170.8 697391663 697607956 698227463 698114319 697831116 697634354 697988892 697801895 697359543 697294922 697129440
2180.5 697129440 697406921 697390060 697961349 698451996 698447952 698544464 698617096 698468628 697605743 697429733
2190.1 697429733 697080460 696876450 697179413 697584915 698639145 699241333 699537888 698978043 698310242
2198.8 698310242 697937088 697662582 697726440 697521362 697833786 698239670 698774948 699103622 699285583 699470215
2208.4 699470215 699406586 699381485 698626862 698239670 698181381 698416977 698532028 698568344 699309540 699436493
2218.1 699436493 699553223 699274673 698902283 698552628 698136063 698406372 698398437 698667145 698804550 698941650
2227.7 698941650 699247589 699405365 699547043 699268723 698806534 698118286 698183060 698421555 698574829 698834686
2237.4 698834686 698907089 698944473 698570862 698803329 699031677 699098969 698964386 698530960 698374100 698221359
$$ packed form
2170.8F97391663K16293O19507j13144k83203j96762L54538j86997m42352o4621j65482
2180.5F97129440K77481j6861N71289M90647m044R6512P2632j48468q62885j76010
2190.1F97429733l49273k04010L02963M05502J054230O02188K96555n59845o67801
2198.8F98310242l73154k74506O3858k05078L12424M05884N35278L28674J81961J84632
2208.4F99470215o3629k5101p54623l87192n8289K35596J15051L6316P41196J26953
2218.1F99436493J16730k78550l72390l49655m16565K70309p935K68708J37405J37100
2227.7F98941650L05939J57776J41678k78320m62189o88248O4774K38495J53274K59857
2237.4F98834686P2403L7384l73611K32467K28348O7292j34583m33426j56860j52741
$$ plain form
2247 698221359 698485413 698439636 698437271 698307724 698203201 698267822 697960663 697951965 697640762 697530670 697219696
2257.6 697219696 697297134 697725372 697552948 697632980 697367554 697476578 697454910 697292480 697129135 696741791
2267.3 696741791 696844788 696691589 696884918 697189560 697402878 697130966 696852646 697120438 697171326 697282181
2276.9 697282181 696885147 696850052 696938934 696892776 696756058 696584396 696727448 696309357 696154022 695916824
2286.5 695916824 696091614 695969238 695549164 695204010 693924484 693709869 693464508 693313675 692468033
2295.2 692468033 691671906 692172089 691865768 691981125 691072922 690637054 690027924 688562317 688267899
2303.9 688267899 687215271 686559372 685348969 684523773 683615875 682823029 682802124 681714096 681686401
2312.6 681686401 680399704 679790955 678976135 677220993 676426163 674737778 674218826 672060623 670710220
$$ packed form
2247F98221359K64054m5777k365j29547j04523O4621l07159q698l11203j10092l10974
2257.6F97219696P7438M28238j72424Q0032k65426J09024k1668j62430j63345l87344
2267.3F96741791J02997j53199J93329L04642K13318k71912k78320K67792N0888J10855
2276.9F97282181l97034l5095Q8882m6158j36718j71662J43052m18091j55335k37198
2286.5F95916824J74790j22376m20074l45154j279526k14615k45361j50833q45642
2295.2F92468033p96127N00183l06321J15357r08203m35868o09130j465607k94418
2303.9F88267899j052628o55899j210403q25196r07898p92846k0905j088028k7695
2312.6F81686401j286697o08749q14820j755142p94830j688385n18952k158203j350403
$$ plain form
2321.3 670710220 670028534 668346863 667414856 666377335 666524963 664627151 663839493 662933350 661562042
2329.9 661562042 661259079 660963287 661805649 660337982 660471573 659496078 658463745 658529663 657341309
2338.6 657341309 657261581 655745926 655952682 655416565 655869064 656454163 657507706 661781311 664484940
2347.3 664484940 668265305 669086456 665811615 661787720 658283920 655823059 652621536 649182587
2355 649182587 645891037 644640732 643263855 641537933 640508804 639651527 641331635 641792450 643941422
2363.7 643941422 645499344 646165466 647903214 649411774 651887131 654302826 657126770 659221268
2371.4 659221268 662081299 664080582 665795441 668814163 671194382 673558731 675564957 677608032
2379.1 677608032 678733902 679897385 681513214 682739792 684302216 685311279 686151733 686780396 687555618
$$ packed form
2321.3F70710220o81686j681671r32007j037521J47628j897812p87658r06143j371308
2329.9F61562042l02963k95792Q42362j467667J33591r75495j032333O5918j188354
2338.6F57341309p9728j515655K06756n36117M52499N85099J053543M273605K703629
2347.3F64484940L780365Q21151l274841m023895l503800k460861l201523l438949
2355F49182587l291550j250305j376877j725922j029129q57277J680108M60815K148972
2363.7F43941422J557922O66122J737748J508560K475357K415695K823944K094498
2371.4F59221268K860031J999283J714859L018722K380219K364349K006226K043075
2379.1F77608032J125870J163483J615829J226578J562424J009063Q40454O28663P75222
$$ plain form
2387.8 687555618 687528534 686449203 686037674 685519257 685252380 685126953 685094833 684971542 685096359 685756531
2397.4 685756531 685729294 685404129 684774323 684516144 684058914 683509750 683300858 682829971 683174133 683517532
2407.1 683517532 683788834 683643799 683105850 682861786 682519913 682476196 682135239 681860123 681545868 681219864
2416.7 681219864 681440353 681398926 680867233 680535583 680546799 680050507 679643478 679314728 679026108 678759003
2426.4 678759003 678394318 678541107 678393250 678177719 677759857 677428741 677538223 677298279 676728287 676268768
2436 676268768 676448288 676349106 676098557 675572510 675149384 675398178 675076294 674727020 674413147 674254837
2445.7 674254837 674059830 673665466 673201065 672651062 672790909 672781448 672633820 672222443 671875916 671954346
2455.3 671954346 671798401 671698685 671290283 670943604 670559311 670224380 669751587 669256668 669354630 669035187
$$ packed form
2387.8F87555618k7084j079331m11529n18417k66877j25427l2120j23291J24817O60172
2397.4F85756531k7237l25165o29806k58179m57230n49164k08892m70887L44162L43399
2407.1F83517532K71302j45035n37949k44064l41873m3717l40957k75116l14255l26004
2416.7F81219864K20489m1427n31693l31650J1216m96292m07029l28750k88620k67105
2426.4F78759003l64685J46789j47857k15531m17862l31116J09482k39944n69992m59519
2436F76268768J79520r9182k50549n26047m23126K48794l21884l49274l13873j58310
2445.7F74254837j95007l94364m64401n50003J39847r461j47628m11377l46527P8430
2455.3F71954346j55945r9716m08402l46679l84293l34931m72793m94919R7962l19443
$$ plain form
2465 669035187 668758545 668362656 668014374 667861176 667381363 667210693 667046814 666715164 666134567 665751114
2474.6 665751114 665603256 665526199 665593796 665451126 665177155 664718475 664334564 663619156 662804108 662604141
2484.2 662604141 662686005 662272110 661753998 661807022 661665573 661649551 661158142 660380936 660162506 660012054
2493.9 660012054 659721222 658827896 658175278 657532578 657246170 657223587 656743546 656658478 656527557 656772766
2503.5 656772766 656401520 655530701 655218506 654880829 654686890 654089203 653765488 653606873 653531113 653413162
2513.2 653413162 652829208 652611389 652248611 651727371 651073608 650924072 650914459 650363617 650041122 649842300
2522.8 649842300 649917068 649651337 649352646 649173126 648682861 648125839 647486954 647017136 646415939 646301727
2532.5 646301727 646527405 646524048 646154633 645793076 645917892 645482712 644925690 644211426 643330994 642926483
$$ packed form
2465F69035187k76642l95889l48282j53198m79813j70670j63879l31650n80597l83453
2474.6F65751114j47858p7057O7597j42670k73971m58680l83911p15408q15048j99967
2484.2F62604141Q1864m13895n18112N3024j41449j6022m91409p77206k18430j50452
2493.9F60012054k90832q93326o52618o42700k86408k2583m80041q5068j30921K45209
2503.5F56772766l71246q70819l12195l37677j93939n97687l23715j58615p5760j17951
2513.2F53413162n83954k17819l62778n21240o53763j49536r613n50842l22495j98822
2522.8F49842300P4768k65731k98691j79520m90265n57022o38885m69818o01197j14212
2532.5F46301727K25678l357l69415l61557J24816m35180n57022p14264q80432m04511
$$ plain form
2542.1 642926483 643097153 643741913 643539505 642878342 642540054 642145309 641535339 641272278 641334076 641031570
2551.7 641031570 640693893 640244598 639679108 639481125 639856606 639918823 639515343 638996735 638144798 637856598
2561.4 637856598 637715492 637035179 636373291 636432991 636360130 635792694 635790443 635562210 635148506 634531059
2571 634531059 634167366 634382210 634173470 633749542 633039017 632713280 632556190 632616806 632911453 632366409
2580.7 632366409 631737022 631466484 631478119 630878372 630137558 630084991 629915886 629416580 628768921 628741112
2590.3 628741112 628851357 628576965 627974167 627474899 627306595 626973724 626847878 626666870 626373482 625991516
2600 625991516 625891914 625630836 625098648 625121384 624480133 623791580 623341599 622921028 622888908 622645378
2609.6 622645378 622369423 621667671 621145592 620932579 620548630 620530853 620757942 620454979 619428062 618528519
$$ packed form
2542.1F42926483J70670O44760k02408o61163l38288l94745o09970k63061O1798l02506
2551.7F41031570l37677m49295n65490j97983L75481O2217m03480n18608q51937k88200
2561.4F37856598j41106o80313o61888N9700p2861n67436k251k28233m13704o17447
2571F34531059l63693K14844k08740m23928p10525l25737j57090O0616K94647n45044
2580.7F32366409o29387k70538J1635n99747p40814n2567j69105m99306o47659k7809
2590.3F28741112J10245k74392o02798m99268j68304l32871j25846j81008k93388l81966
2600F25991516r9602k61078n32188K2736o41251o88553m49981m20571l2120k43530
2609.6F22645378k75955p01752n22079k13013l83949j7777K27089l02963j026917q99543
$$ plain form
2619.3 618528519 617958336 618025627 617874413 617247047 617104149 616914558 616581001 616014175 615628471 615320625
2628.9 615320625 614818497 614486046 614068298 613630562 613145676 612967720 612828865 612447128 612054596 611749191
2638.5 611749191 611540756 611034508 610404091 609765511 609299164 608798637 608375778 608102837 607918358 607993889
2648.2 607993889 607614822 607298775 607061920 606715088 606371002 605917549 605536232 604822807 604499245 604265022
2657.8 604265022 603883400 603892860 603969955 603739471 602951431 602411041 602060127 601745224 601367836 600991707
2667.5 600991707 600888710 600666809 600539551 600372734 600376930 600011940 599368896 599351082 599455719 599242859
2677.1 599242859 598719788 598595238 598433762 598002510 597309303 596717377 596655121 596233101 596117516 595949402
2686.8 595949402 595473137 594929810 594384613 594425964 594223328 593965530 593987579 594269409 594027710 593171310
$$ packed form
2619.3F18528519n70183O7291j51214o27366j42898j89591l33557n66826l85704l07846
2628.9F15320625n02128l32451m17748m37736m84886j77956j38855l81737l92532l05405
2638.5F11749191k08435n06248o30417o38580m66347n00527m22859k72941j84479P5531
2648.2F07993889l79067l16047k36855l46832l44086m53453l81317p13425l23562k34223
2657.8F04265022l81622R460P7095k30484p88040n40390l50914l14903l77388l76129
2667.5F00991707j02997k21901j27258j66817M196l64990o43044j7814J04637k12860
2677.1E99242859n23071j24550j61476m31252o93207n91926o2256m22020j15585j68114
2686.8E95949402m76265n43327n45197M1351k02636k57798K2049K81830k41699q56400
$$ plain form
2696.4 593171310 592696915 592535553 592646866 592274094 591889839 591646385 591423836 591243019 590640221 590498314
2706 590498314 590271606 589959717 589673729 589078522 588714447 588614883 588531456 588247833 588234329 587799416
2715.7 587799416 587260704 587111244 586861382 586876335 586850548 586898499 586471024 585910149 585833473 585467606
2725.3 585467606 584947968 584780807 584933510 584734497 584566345 584209595 583852654 583979645 583746910 583307190
2735 583307190 582827873 582731514 582511215 582251549 582453728 582504578 582580185 582233124 581756172 581494026
2744.6 581494026 581519699 581541901 581079140 580528526 579948387 580109978 580457039 580377655 580094185 579591980
2754.3 579591980 579415207 579281464 579097481 578654785 578073196 577890015 577989998 578104553 578104858 577824745
2763.9 577824745 577077293 576559906 576629906 576921654 576390648 575607567 575546074 575330505 575337791 575259323
$$ packed form
2696.4E93171310m74395j61362J11313l72772l84255k43454k22549j80817o02798j41907
2706E90498314k26708l11889k85988n95207l64075r9564q3427k83623j3504m34913
2715.7E87799416n38712j49460k49862J4953k5787M7951m27475n60875p6676l65867
2725.3E85467606n19638j67161J52703j99013j68152l56750l56941J26991k32735m39720
2735E83307190m79317r6359k20299k59666K02179N0850P5607l47061m76952k62146
2744.6E81494026K5673K2202m62761n50614n80139J61591L47061p9384k83470n02205
2754.3E79591980j76773j33743j83983m42696n81589j83181R9983J14555L05k80113
2763.9E77824745p47452n17387P0000K91748n31006p83081o1493k15569P286p8468
$$ plain form
2773.5 575259323 574949875 574772530 574451675 574140549 573446579 572648659 572071342 572038994 572193909 571948166
2783.2 571948166 571635094 571109695 570698509 570768852 570857620 570366707 569880333 569244347 568257141 567788925
2792.8 567788925 567487030 567671738 567870178 567514267 566864777 565721016 565028877 564433975 563395844
2801.5 563395844 562771873 562519951 562300911 562414665 562472038 561937904 561421928 560811958 559857178 559128494
2811.2 559128494 558581429 557905655 557411652 556943893 556406898 556065865 555510101 555006866 554491081 553532333
2820.8 553532333 552581444 551967659 551247520 550424652 550084953 549679337 549243164 548691216 547951698 547456932
2830.4 547456932 547015762 546183853 544389420 543328705 542645378 541512032 541324768 540708771 539231262
2839.1 539231262 537488251 535902328 534758186 533527374 531831665 529418259 527391548 526052971
$$ packed form
2773.5E75259323l09448j77345l20855l11126o93970p97920n77317l2348J54915k45743
2783.2E71948166l13072n25399m11186P0343Q8768m90913m86374o35986r87206m68216
2792.8E67788925l01895J84708J98440l55911o49490j143761o92139n94902j038131
2801.5E63395844o23971k51922k19040J13754N7373n34134n15976o09970r54780p28684
2811.2E59128494n47065o75774m94003m67759n36995l41033n55764n03235n15785r58748
2820.8E53532333r50889o13785p20139q22868l39699m05616m36173n51948p39518m94766
2830.4E47456932m41170q31909j794433j060715o83327j133346j87264o15997j477509
2839.1E39231262j743011j585923j144142j230812j695709k413406k026711j338577
$$ plain form
2846.8 526052971 524705162 522749901 520616188 518684807 517034912 516139030 515090065 514658661 514788971
2855.5 514788971 514730530 514813385 514738846 515297661 515421524 514738045 514532547 514633675 514685783 514567909
2865.2 514567909 514285507 513468246 512473183 511567955 510962372 510670700 510260620 510062141 509668541 508997536
2874.8 508997536 508423424 507713165 507177658 507126236 506912956 506854439 506721001 505550346 504568062 503754768
2884.4 503754768 502730942 501887817 501276321 500783501 500023994 499586525 498792686 497850304 497279930
2893.1 497279930 496345444 495482407 494730339 493954353 492700081 491372375 490682640 490415459 489999199
2901.8 489999199 489473991 489156990 487880592 486783791 486382523 485772133 485130043 484042320 483050690
2910.5 483050690 481815529 480376358 478655891 476707230 475769043 474643364 472808800 471106491
$$ packed form
2846.8E26052971j347809j955261k133713j931381j649895q95882j048965m31404J30310
2855.5E14788971n8441Q2855p4539N58815J23863o83479k05498J01128N2108j17874
2865.2E14567909k82402q17261r95063r05228o05583k91672m10080j98479l93600o71005
2874.8E08997536n74112p10259n35507n1422k13280n8517j33438j170655r82284q13294
2884.4E03754768j023826q43125o11496m92820p59507m37469p93839r42382n70374
2893.1D97279930r34486q63037p52068p75986j254272j327706o89735k67181m16260
2901.8D89999199n25208l17001j276398j096801m01268o10390o42090j087723r91630
2910.5D83050690j235161j439171j720467j948661r38187j125679j834564j702309
$$ plain form
2918.2 471106491 469429016 467671547 466858521 466700478 466102715 465542488 464796104 464161911 463890839
2926.9 463890839 464164314 464879036 465046997 465184021 465643997 465903053 465978661 466866264 467990456 468500214
2936.5 468500214 469104424 469994583 470962753 471677170 472849846 474024544 474577446 475141678 475393715
2945.2 475393715 475785370 476479721 477079201 477488632 477986145 478633995 479034081 479313889 479488831 479848900
2954.8 479848900 480051270 480071602 480591240 481335869 481662102 482012177 483017616 483826103 484442749 485125198
2964.5 485125198 485707321 485910492 486231194 487516022 488539085 489164543 489641533 490230675 491228294
2973.2 491228294 491994209 492674751 493023109 493424416 494106750 495015793 495797081 495808830 496081314 496433220
2982.8 496433220 496205444 496245804 497006378 497519035 497625542 497623024 497278252 497616196 498275299 498322906
$$ packed form
2918.2D71106491j677475j757469q13026j58043n97763n60227p46384o34193k71072
2926.9D63890839K73475P14722J67961J37024M59976K59056P5608Q87603J124192N09758
2936.5D68500214O04210Q90159R68170P14417J172676J174698N52902N64232K52037
2945.2D75393715L91655O94351N99480M09431M97513O47850M00086K79808J74942L60069
2954.8D79848900K02370K0332N19638P44629L26233L50075J005439Q08487O16646O82449
2964.5D85125198N82123K03171L20702J284828J023063O25458M76990N89142R97619
2973.2D91228294P65915O80542L48358M01307O82334R09043P81288J1749K72484L51906
2982.8D96433220k27776M0360P60574N12657J06507k518l44772L37944O59103M7607
$$ plain form
2992.5 498322906 498048439 497651558 497485237 497575951 497625656 497498856 497254753 496878052 496541595 496207581
3002.1 496207581 496039352 495696945 494845848 494464645 494252090 493769951 492964935 492248116 492314949 492333298
3011.7 492333298 491879539 491412048 491115379 490506439 489938889 489764290 489704285 489262657 487926521 487125511
3021.4 487125511 487013092 486870346 486739883 486143532 485124207 484186440 483765411 483265228 482755470
3030.1 482755470 482413788 481854401 481454201 481051102 480389099 479533310 478847580 478160515 477460670 476945724
3039.7 476945724 476479301 476079254 475544624 474942398 473972054 473262062 472975121 472433319 471662445 470606194
3049.4 470606194 470183830 469878044 469054565 468168335 467439804 467076988 466402588 465565910 464976463 464414597
3059 464414597 463666954 463147354 462833672 462305298 461902122 461366234 461027565 460693893 460032120 459291000
$$ packed form
2992.5D98322906k74467l96881j66321R0714M9705j26800k44103l76701l36457l34014
3002.1D96207581j68229l42407q51097l81203k12555m82139q05016p16819O6833J8349
3011.7D92333298m53759m67491k96669o08940n67550j74599o0005m41628j336136q01010
3021.4D87125511j12419j42746j30463n96351j019325r37767m21029n00183n09758
3030.1D82755470l41682n59387m00200m03099o62003q55789o85730o87065o99845n14946
3039.7D76945724m66423m00047n34630o02226r70344p09992k86941n41802p70874j056251
3049.4D70606194m22364l05786q23479q86230p28531l62816o74400q36678n89447n61866
3059D64414597p47643n19600l13682n28374m03176n35888l38669l33672o61773p41120
$$ plain form
3068.6 459291000 458380547 457473412 456730309 456590042 456166229 455439720 454893684 454427261 454587708 454411087
3078.3 454411087 453569870 452661972 452086563 451699638 451364212 450653458 449404182 449092026 448940849
3087 448940849 448354950 447848015 447294312 446638870 446013680 445736923 444790192 444107208 443913765 443085213
3096.6 443085213 442379456 441909866 441749268 441273117 440423050 439528885 438858452 438666115 438100357 437377968
3106.2 437377968 436815186 436437988 435826111 435021706 434463730 434063797 433798409 433153458 432425957 431584358
3115.9 431584358 430852776 430468292 429924660 429511604 429205322 428779984 427733955 426511955 425779228
3124.6 425779228 425382805 424993439 424311638 423714981 422811127 421802330 421325302 421083183 420542984
3133.3 420542984 419633408 418904686 418670959 418402061 417368469 416635551 415919456 414801826 414113922
$$ packed form
3068.6D59291000r10453r07135p43103j40267m23813p26509n46036m66423J60447j76621
3078.3D54411087q41217r07898n75409l86925l35426p10754j249276l12156j51177
3087D48940849n85899n06935n53703o55442o25190k76757r46731o82984j93443q28552
3096.6D43085213p05757m69590j60598m76151q50067q94165o70433j92337n65758p22389
3106.2D37377968n62782l77198o11877q04405n57976l99933k65388o44951p27501q41599
3115.9D31584358p31582l84484n43632m13056l06282m25338j046029j222000p32727
3124.6D25779228l96423l89366o81801n96657r03854j008797m77028k42119n40199
3133.3D20542984r09576p28722k33727k68898j033592p32918p16095j117630o87904
$$ plain form
3141.9 414113922 413252068 412405014 411678543 411565056 411814423 411311913 410366287 409383507 408661423 407742119
3151.6 407742119 407107468 406593132 405983658 405563202 404424248 403490868 402960968 402576065 402208443
3160.3 402208443 401322403 400298996 399234467 398479843 397762604 397352638 397199287 396391602 395403404
3168.9 395403404 394554939 393819580 393220978 392713280 392068787 391310272 390388641 389503098 389062119 388496170
3178.6 388496170 387618523 386903496 386509933 386072083 385793533 385027657 383501167 382694054 382252426
3187.3 382252426 381838074 381257629 380456619 379995995 379651031 379064789 378011589 377306557 376889610
3195.9 376889610 376259079 375451736 374608765 373882751 373172874 372990341 372540665 371936035 371782036 371316833
3205.6 371316833 370564575 369949684 369746819 369359818 368643951 367672729 367230835 367196503 366261215 365703659
$$ packed form
3141.9D14113922q61854q47054p26471j13487K49367n02510r45626r82780p22084r19304
3151.6D07742119o34651n14336o09474m20456j138954r33380n29900l84903l67622
3160.3D02208443q86040j023407j064529p54624p17239m09966j53351q07685r88198
3168.9C95403404q48465p35359n98602n07698o44493p58515r21631q85543m40979n65949
3178.6C88496170q77647p15027l93563m37850k78550p65876j526490q07113m41628
3187.3C82252426m14352n80445q01010m60624l44964n86242j053200p05032m16947
3195.9C76889610o30531q07343q42971p26014p09877j82533m49676o04630j53999m65203
3205.6C71316833p52258o14891k02865l87001p15867r71222m41894l4332r35288n57556
$$ plain form
3215.2 365703659 365245628 364492645 364047432 363326683 362718620 362399406 361883621 361403389 361570549 361051216
3224.9 361051216 359683456 358847237 358478165 358543739 358208733 357593384 357212334 356793022 356274796 355586205
3234.5 355586205 355171776 354450645 353430481 353179474 353246803 352574234 351917953 352008095 351834068 351231956
3244.2 351231956 350443039 349821243 349554825 349180679 348408127 347682953 347276382 346840706 346826935 346397209
3253.8 346397209 345523529 345460548 345350761 344618111 343609543 343010559 342865791 342749062 342482986 342136688
3263.4 342136688 341725845 341091995 340412979 339608765 339603806 340007706 339718590 339237671 338778915 338502235
3273.1 338502235 337790947 337339745 337358932 336816750 336398087 336193237 336096954 335645485 335001678 334847755
3282.7 334847755 334650764 334320526 333822708 333387108 333417892 333356667 332577515 332042007 332217102 331948013
$$ packed form
3215.2C65703659m58031p52983m45213p20749o08063l19214n15785m80232J67160n19333
3224.9C61051216j367760q36219l69072O5574l35006o15349l81050m19312n18226o88591
3234.5C55586205m14429p21131j020164k51007O7329o72569o56281R0142j74027o02112
3244.2C51231956p88917o21796k66418l74146p72552p25174m06571m35676j3771m29726
3253.8C46397209q73680o2981j09787p32650j008568n98984j44768j16729k66076l46298
3263.4C42136688m10843o33850o79016q04214m959M03900k89116m80919m58756k76680
3273.1C38502235p11288m51202J9187n42182m18663k04850r6283m51469o43807j53923
3282.7C34847755j96991l30238m97818m35600L0784o1225p79152n35508J75095k69089
$$ plain form
3292.4 331948013 331290855 330933990 330854645 330860977 330930367 330697403 330069351 329325409 328556824 328596611
3302 328596611 329168282 328782845 327977104 327962990 327976761 327673073 327092476 326245308 325895348 325354080
3311.7 325354080 324838486 324605446 323818359 323187828 323195801 323467712 323392677 323042831 322303772 321264801
3321.3 321264801 320729103 320589104 320617867 320316048 319591389 318785648 318269329 317637081 316876297 316875954
3330.9 316875954 316484833 315556812 314926090 314747295 314572392 313944817 313488388 312882004 312472610 311921425
3340.6 311921425 311248512 311186962 310697498 310130386 309407406 308745098 308249626 307263088 307029343 307332859
3350.2 307332859 307409649 306901283 305789642 305388222 305327911 304495125 304013691 304496593 304621677 303917999
3359.9 303917999 302978745 302502117 302504501 302482185 301930447 301491508 301655598 301092644 300717163 300626278
$$ packed form
3292.4C31948013o57158l56865p9345O332O9390k32964o28052p43942p68585L9787
3302C28596611N71671l85437q05741j4114J3771l03688n80597q47168l49960n41268
3311.7C25354080n15594k33040p87087o30531P973K71911p5035l49846p39059j038971
3321.3C21264801n35698j39999K8763l01819p24659q05741n16319o32248p60784l43
3330.9C16875954l91121r28021o30722j78795j74903o27575m56429o06384m09394n51185
3340.6C11921425o72913o1550m89464n67112p22980o62308m95472r86538k33745L03516
3350.2C07332859P6790n08366j111641m01420o0311q32786m81434M82902J25084p03678
3359.9C03917999r39254m76628K384k2316n51738m38939J64090n62954l75481r0885
$$ plain form
3369.5 300626278 299856491 299704266 299576950 299146194 299096165 298727207 298119297 297946396 297697601 297216854
3379.2 297216854 297509136 297766323 297328854 297371635 297581654 297056980 296306648 295798855 295641747 295751038
3388.8 295751038 295637436 295596962 295522976 294880104 294513626 294605942 294525299 294528542 294552956 294272614 294127083
3399.4 294127083 294233437 294260826 293887424 293745632 293936977 293825378 294141006 294137192 293602829 293415012
3409.1 293415012 293138809 293346596 293680210 293540955 293597088 293987675 294377441 294360542 293946877 293610592
3418.7 293610592 293697071 293686600 293674469 294078922 294935017 295633049 295503540 295440273 295500507 295572224 295955143
3429.3 295955143 296596489 297022400 296659031 296516533 297063179 297649994 297753735 298175182 298691368 298622437
3439 298622437 298825607 299064960 299484234 299206219 298919563 299773350 300519753 301271553 301408348 302202969
$$ packed form
3369.5C00626278p69787j52225j27316m30756n0029l68958o07910j72901k48795m80747
3379.2B97216854K92282K57187m37469M2781K10019n24674p50332n07793j57108J09291
3388.8B95751038j13602m0474p3986o42872l66478R2316q0643L243K4414k80342j45531
3399.4B94127083J06354K7389l73402j41792J91345j11599L15628l814n34363j87817
3409.1B93415012k76203K07787L33614j39255N6133L90587L89766j6899m13665l36285
3418.7B93610592Q6479j0471j2131M04453Q56095O98032j29509o3267O0234P1717L82919
3429.3B95955143O41346M25911l63369j42498N46646N86815J03741M21447N16186o8931
3439B98622437K03170K39353M19274k78015k86656Q53787P46403P51800J36795P94621
$$ plain form
3448.6 302202969 303393345 303378544 303285885 303390141 304092484 304815159 305625458 306421089 306454487 307461967
3458.2 307461967 308667736 308795166 308928165 309490986 309952297 310228825 310876751 311726990 312268391
3466.9 312268391 312804775 313452854 314009380 314690475 314889679 315346031 316183701 316638889 317812157
3475.6 317812157 318819103 319522972 320316048 320798836 321491203 322202454 322583466 322926712 323840866
3484.3 323840866 324492798 325144501 326326752 327546043 328636322 328670883 328551979 329113274 330557289
3493 330557289 332179337 332898750 333087196 333245544 334578705 335666008 336035271 336988220 338054047
3501.6 338054047 338620262 338823586 339650574 340267029 341059227 342397461 343820381 344751282 344974174
3510.3 344974174 346102448 346846046 347312508 348167877 349559441 351021042 351210632 351949043 353121490
$$ packed form
3448.6C02202969J190376j4801r2659J04256P02343P22675Q10299P95631L3398J007480
3458.2C07461967J205769J27430J32999N62821M61311K76528O47926Q50239N41401
3466.9C12268391N36384O48079N56526O81095J99204M56352Q37670M55188J173268
3475.6C17812157J006946P03869P93076M82788O92367P11251L81012L43246R14154
3484.3C23840866O51932O51703J182251J219291J090279L4561j18904N61295J444015
3493C30557289J622048P19413J88446J58348J333161J087303L69263R52949J065827
3501.6C38054047N66215K03324Q26988O16455P92198J338234J422920R30901K22892
3510.3C44974174J128274P43598M66462Q55369J391564J461601J89590P38411J172447
$$ plain form
3519 353121490 354111710 355244560 356824493 358001060 357448082 358296738 360080299 361289482 361761322
3527.7 361761322 362102051 362937355 363912888 365208549 366488190 367940826 368976097 370444412 371633377
3536.4 371633377 372168770 373678780 374695015 375757294 376410370 377676430 379631233 380740776 381423721
3545 381423721 381517258 382919083 383234291 384569931 387019882 388721581 390504074 389895630 391253548
3553.7 391253548 393237038 394407806 396299248 397411575 399383240 400918694 401197701 401276360 403703537
3562.4 403703537 405589867 405835953 409024582 409056358 409250870 411162491 412051506 415205460 416977882
3571.1 416977882 418890686 420761414 422084923 422904434 424131508 426297112 427310448 429281349
3578.8 429281349 430349197 431279221 433530922 435571480 436482468 437024727 441055183 442629623 441391945
$$ packed form
3519C53121490R90220J132850J579933J176567n52978Q48656J783561J209183M71840
3527.7C61761322L40729Q35304R75533J295661J279641J452636J035271J468315J188965
3536.4C71633377N35393J510010J016235J062279O53076J266060J954803J109543O82945
3545C81423721R3537J401825L15208J335640K449951J701699J782493o08444J357918
3553.7C91253548J983490J170768J891442J112327J971665J535454K79007P8659K427177
3562.4D03703537J886330K46086L188629L1776J94512J911621Q89015L153954J772422
3571.1D16977882J912804J870728J323509Q19511J227074K165604J013336J970901
3578.8D29281349J067848R30024K251701K040558R10988N42259M030456J574440j237678
$$ plain form
3587.5 441391945 443793945 444976501 447987976 450599976 452754097 453682518 454978981 457978783
3595.2 457978783 457451591 460291328 464300919 465280190 466684685 467144470 469021492 471589050 473465233
3603.9 473465233 476049690 478997993 480786896 480407639 483982277 484895020 485522499 492395782 494010010
3612.5 494010010 492514153 495931053 495757065 499481163 503253403 503255157 506179848 506913872 507653809
3621.2 507653809 510491371 513014946 515521774 517991791 519732056 522997932 529836922 528400116
3628.9 528400116 519565277 525904236 531599922 535803680 537316589 537765465 541288338 545147820
3636.6 545147820 547174911 547677422 549875984 553110161 556173325 557733002 558519135 560931168 564331055
3645.3 564331055 569569664 569010010 566335945 572042160 572305908 570716171 572237396 577666740 581858521
$$ packed form
3587.5D41391945K402000J182556L011475K612000K154121R28421J296463K999802
3595.2D57978783n27192K839737M009591R79271J404495M59785J877022K567558J876183
3603.9D73465233K584457K948303J788903l79257L574638R12743O27479O873283J614228
3612.5D94010010j495857L416900j73988L724098L772240J754K924691P34024P39937
3621.2E07653809K837562K523575K506828K470017J740265L265876O838990j436806
3628.9E28400116q834839O338959N695686M203758J512909M48876L522873L859482
3636.6E45147820K027091N02511K198562L234177L063164J559677P86133K412033L399887
3645.3E64331055N238609n59654k674065N706215K63748j589737J521225N429344M191781
$$ plain form
3654 581858521 585165825 588767128 582602310 585316658 590675621 592934723 595609245 596780205 598872337
3662.7 598872337 599881020 600894508 602115440 603196220 608194199 610097733 608954811 608848152
3670.4 608848152 602890549 606380539 614191360 622895546 621564560 602607880 608313255 617043915
3678.1 617043915 621330070 619146500 620310478 623722534 625260124 626259918 626699677 627170563 630217285
3686.8 630217285 635289879 627740211 625009880 632218437 626894379 627401848 632957840 634149971
3694.5 634149971 635563049 635837021 635426865 635839043 636081810 638605156 641139221 636963234 635518875
3703.2 635518875 639592476 640873337 641308746 642360153 645339508 648396454 640082932 642992783
3710.9 642992783 646920471 636811714 642499542 647229385 647189713 647230377 649100037 649781342 645677490
$$ packed form
3654E81858521L307304L601303o164818K714348N358963K259102K674522J170960K092132
3662.7E98872337J008683J013488J220932J080780M997979J903534j142922j06659
3670.4F08848152n957603L489990P810821Q704186j330986j8956680N705375Q730660
3678.1F17043915M286155k183570J163978L412056J537590R99794M39759M70886L046722
3686.8F30217285N072594p549668k730331P208557n324058N07469N555992J192131
3694.5F34149971J413078K73972m10156M12178K42767K523346K534065m175987j444359
3703.2F35518875M073601J280861M35409J051407K979355L056946q313522K909851
3710.9F42992783L927688j0108757N687828M729843l9672M0664J869660O81305m103852
$$ plain form
3719.6 645677490 646514435 652255249 648837051 643478394 647980347 648711090 647869415 646654053 646992264
3728.3 646992264 650049667 650765381 655709763 653266754 645986710 653261948 652585144 646051636 648079453
3736.9 648079453 650280991 651204147 653756332 656246719 652319641 654946747 664286118 652840805
3744.7 652840805 641726913 651851044 657088623 662103271 658806305 649336395 661393661 657188416
3752.4 657188416 648270111 654785233 659726334 662973099 658406982 659625092 664121704 657108383
3760.1 657108383 656096344 659800720 661053772 661525574 664768372 662408752 657685318 661042862
3767.8 661042862 665426559 665295868 657331009 658697662 662089767 662607498 663243179 663076706 664024124
3776.5 664024124 664216919 666441803 666165619 658916931 661811981 664039917 664565277 666495361 663622971
$$ packed form
3719.6F45677490Q36945N740814l418198n358657M501953P30743q41675j215362L38211
3728.3F46992264L057403P15714M944382k443009p280044P275238o76804o533508K027817
3736.9F48079453K201538R23156K552185K490387l927078K627106R339371j1445313
3744.7F52840805j1113892J0124131N237579N014648l296966r469910J2057266m205245
3752.4F57188416q918305O515122M941101L246765m566117J218110M496612p013321
3760.1F57108383j012039L704376J253052M71802L242798k359620m723434L357544
3767.8F61042862M383697j30691p964859J366653L392105N17731O35681j66473R47418
3776.5F64024124J92795K224884k76184p248688K895050K227936N25360J930084k872390
$$ plain form
3785.2 663622971 662217560 663272629 664486084 665519180 665239410 664886856 664717484 665523605 665610199
3793.8 665610199 666500702 669034042 665371017 661648636 663864212 667712936 672814865 666407852
3801.5 666407852 655952911 659472351 663093414 668450699 673606567 664442062 660875778 665368195
3809.3 665368195 667435074 667613754 667666245 667368164 667764206 671801300 669521484 657366791 661968765
3817.9 661968765 667324524 671571045 673612900 659632874 660504608 664915085 666308441 667939758
3825.7 667939758 667746048 664488220 665807190 668321609 670873566 671611481 663402939 665641632 672727280
3834.3 672727280 667147675 666340332 674823990 665692902 659868240 667160034 663007584 664147720
3842.1 664147720 671000824 669312057 665689163 667507324 668966980 669113464 670023422 668428955 670643921
$$ packed form
3785.2F63622971j405411J055069J213455J033096k79770l52554j69372Q06121Q6594
3793.8F65610199Q90503K533340l663025l722381K215576L848724N101929o407013
3801.5F66407852j0454941L519440L621063N357285N155868r164505l566284M492417
3809.3F65368195K066879J78680N2491k98081L96042M037094k279816j2154693M601974
3817.9F61968765N355759M246521K041855j3980026Q71734M410477J393356J631317
3825.7F67939758j93710l257828J318970K514419K551957P37915q208542K238693P085648
3834.3F72727280n579605q07343Q483658r131088n824662P291794m152450J140136
3842.1F64147720O853104j688767l622894J818161J459656J46484R09958j594467K214966
$$ plain form
3850.7 670643921 676872940 669227753 666318741 654749908 658092346 667876358 667326889 665929489
3858.4 665929489 667397156 669231415 671455383 666249542 666600876 673559647 668169174 661625290
3866.2 661625290 665712891 670944977 675116348 666375122 658460083 662967300 669431381 671465912
3873.9 671465912 661654739 664665298 669520187 668791428 670214844 673988876 669487457 663022842
3881.6 663022842 667638855 668529282 670195389 675255737 663551254 664198456 668489914 669521179
3889.3 669521179 672857513 671423264 663917694 665008621 668187408 667578735 668632050 669016800 671092834
3898 671092834 673222809 662947311 667158661 670269928 664585037 667617798 664762573 664124908 665655975
3906.7 665655975 666577148 668218384 667942963 668131104 668681107 669437485 668838348 668072662 669459229
$$ packed form
3850.7F70643921O229019p645187k909012j1568833L342438R784012n49469j397400
3858.4F65929489J467667J834259K223968n205841L51334O958771n390473o543884
3866.2F61625290M087601N232086M171371q741226p915039M507217O464081K034531
3873.9F71465912r811173L010559M854889p28759J423416L774032m501419o464615
3881.6F63022842M616013Q90427J666107N060348j1704483O47202M291458J031265
3889.3F69521179L336334j434249p505570J090927L178787o08673J053315L84750K076034
3898F71092834K129975j0275498M211350L111267n684891L032761k855225o37665J531067
3906.7F65655975R21173J641236k75421J88141N50003P56378n99137p65686J386567
$$ plain form
3915.3 669459229 671257858 667752533 664579315 669665833 669927292 665712433 667522278 668316269 668468552
3924 668468552 666556168 664198761 665949631 668132172 669719238 668482590 668143311 670019989 667637329
3932.7 667637329 666415024 667853165 667834549 667816772 668119431 667701721 667578125 667917023 669113617
3941.4 669113617 669456711 664937286 663978958 666264572 667549057 668498459 666946106 667627792 667557144
3950.1 667557144 665140152 667234573 668362198 667770844 667229843 667232742 667958984 667219162 667220459 666836624
3959.7 666836624 667076797 667338791 665876694 666631927 667669067 667650299 667529297 667381744 667487411
3968.4 667487411 667005920 666491089 667004471 667054367 666570740 667033615 666832581 666466293 666793060 667205429
3978 667205429 667574310 667583694 668013535 668145065 667982941 667874222 666988983 665785980 666188507 667210464
$$ packed form
3915.3F69459229J798629l505325l173218N086518K61459m214859J809845P93991J52283
3924F68468552j912384k357407J750870K182541J587066j236648l39279J876678k382660
3932.7F67637329j222305J438141j8616j7777L02659m17710j23596L38898J196594
3941.4F69113617L43094m519425r58328K285614J284485R49402j552353O81686p0648
3950.1F67557144k416992K094421J127625n91354n41001K899P26242p39822J297l83835
3959.7F66836624K40173K61994j462097P55233J037140j8768j21002j47553J05667
3968.4F67487411m81491n14831N13382M9896m83627M62875k01034l66288L26767M12369
3978F67205429L68881R384M29841J31530j62124j08719q85239j203003M02527J021957
$$ plain form
3987.7 667210464 666910172 667374344 667415771 666784210 666844330 666612625 666649170 666181412 666192398 666712189
3997.3 666712189 666845779 667113419 667149887
4000.2 667149887
$$ packed form
3987.7F67210464l00292M64172M1427o31561O0120k31705L6545m67758J0986N19791
3997.3F66712189J33590K67640L6468
4000.2F67149887
##END=$$ End of the data block
