##TITLE=$$ Begin of the data block
##JCAMP-DX=5.00 $$ ACD/SpecManager v 10.08
##SPECTROMETER/DATA SYSTEM=Varian
##DATE=08 Jan 2013 15:50:40
##DATA TYPE=INFRARED SPECTRUM
##DATA CLASS=XYDATA
##ORIGIN=
##OWNER=
##NPOINTS=3735
##FIRSTX=399.26403809
##LASTX=4000.35498047
##MAXX=4000.35498047
##MINX=399.26403809
##MAXY=75.34003448
##MINY=20.02338028
##XFACTOR=1.0000000000
##YFACTOR=0.000000100000000
##FIRSTY=44.26585770
##DELTAX=0.96440572
##XUNITS=1/CM
##YUNITS=TRANSMITTANCE
##XYDATA=(X++(Y..Y))
$$ plain form
399.3 442658577 442265167 438895760 440585937 445841522 453044586 449218216 436655312 424282684
407 424282684 420935860 432007332 439530258 438664093 438663635 440764389 439161644 438938675 441321602
415.7 441321602 435833931 425809059 404359779 410252609 437832336 444125290 441071167 431082840
423.4 431082840 426516838 428122063 431780014 430656891 429204597 428133049 426785011 428617821
431.1 428617821 428909035 429308167 427861176 425913506 425872536 428109283 435967216 435775757 427812157
439.8 427812157 426217003 432001839 434147072 427449493 426171646 431692619 434507446 431690521
447.5 431690521 429705811 429851303 428019638 425331306 425684166 426798477 426327057 424773254 422327614
456.2 422327614 420696335 419614067 421371307 422575836 422163277 421592712 424162636 428297081 427006187
$$ packed form
399.3D42658577l93410l369407J690177N255585P203064l826370j2562904j2372628
407D24282684l346824J1071472P522926q66165m58K100754j602745k22969K382927
415.7D41321602n487671j0024872k1449280N892830K7579727O292954l054123r988327
423.4D31082840m566002J605225L657951j123123j452294j071548j348038J832810
431.1D28617821K91214L99132j446991j947670m0970K236747P857933j91459p963600
439.8D27812157j595154N784836K145233o697579j277847N520973K814827k816925
447.5D31690521j984710J45492j831665k688332L52860J114311m71420j553803k445640
456.2D22327614j631279j082268J757240J204529m12559n70565K569924M134445j290894
$$ plain form
464.8 427006187 424744263 423231163 421206093 420046082 416756935 417047119 418012962 416889114 418461723
473.5 418461723 419507217 418415871 417064095 417008667 413279953 412951393 418364258 418695335 415314178
482.2 415314178 412442894 406638947 404180794 409273720 412133217 411809425 409135590 404870567 405515404
490.9 405515404 408361740 408842049 406192627 405094528 406903381 408143883 410078926 412319717 411161957
499.6 411161957 406870155 404863472 403852043 403509521 403185005 402118378 403251534 405094643 406344566
508.2 406344566 403705101 400322266 400630302 401905975 404420242 404730530 403063965 401041794 400395851
516.9 400395851 400175858 396107445 392614975 390929031 391946831 394216805 395599403 398285637 399044189
525.6 399044189 395748062 391452713 388767242 389142685 389885101 391299782 393850327 395532265 396675072
$$ packed form
464.8D27006187k261924j513100k025070j160011l289147K90184R65843j123848J572609
473.5D18461723J045494j091346j351776n5428l728714l28560N412865L31077l381157
482.2D15314178k871284n803947k458153N092926K859497l23792k673835m265023O44837
490.9D05515404K846336M80309k649422j098099J808853J240502J935043K240791j157760
499.6D11161957m291802k006683j011429l42522l24516j066627J133156J843109J249923
508.2D06344566k639465l382835L08036J275673K514267L10288j666565k022171o45943
516.9D00395851k19993m068413l492470j685944J017800K269974J382598K686234P58552
525.6C99044189l296127m295349k685471L75443P42416J414681K550545J681938J142807
$$ plain form
534.3 396675072 396693611 395181274 391988220 389411850 389933662 389956970 390811768 392555084 391265106
543 391265106 389368553 387220497 386267128 386872559 386350937 386567192 388424835 389606400 387996368
551.6 387996368 384888039 382837181 382723045 381493225 379653053 380684471 383211861 385318832 385070419
560.3 385070419 383059769 381776009 381897545 382810020 382593880 382512283 382780762 382149620 381758423 382285080
570 382285080 382475128 381422348 379839172 379037285 380405464 380956039 380337563 380693626 380505028 380356789
579.6 380356789 378239517 375364342 375624275 377597694 379536362 380232811 380739594 381331749 381637917
588.3 381637917 381293716 380130463 379931641 380474739 382158813 384155922 384382706 383828049 383114319
597 383114319 382208595 381358643 381328621 382628975 384207687 384639626 383769608 382393532 380088768 378441505
$$ packed form
534.3C96675072J8539j512337l193054k576370N21812K3308Q54798J743316j289978
543C91265106j896553k148056r53369O05431n21622K16255J857643J181565j610032
551.6C87996368l108329k050858j14136j229820j840172J031418K527390K106971k48413
560.3C85070419k010650j283760J21536R12475k16140q1597K68479o31142l91197N26657
570C82285080J90048j052780j583176q01887J368179N50575o18476L56063j88598j48239
579.6C80356789k117272k875175K59933J973419J938668O96449N06783N92155L06168
588.3C81637917l44201j163253j98822N43098J684074J997109K26784n54657p13730
597C83114319r05724q49952l0022J300354J578712M31939q70018j376076k304764j647263
$$ plain form
606.6 378441505 377913208 377638283 377873917 378203125 379499664 380342026 379448929 378458443 377163353
615.3 377163353 375980453 375595322 375945702 377148323 378504562 379033890 378765030 378041916 377240410
624 377240410 378179169 379810600 381568146 383850594 385384598 386977539 387617455 387531509 388001747
632.7 388001747 389280090 390962029 391576347 393238411 396623573 399233017 400245171 400956764 401458092
641.3 401458092 401174583 400918007 402710342 406458511 408571739 409071121 409331627 410197334 411457901
650 411457901 410390396 409146957 410431595 412596512 415214195 417963066 418507805 416638451 414923172
658.7 414923172 413741798 412918854 413216858 413363686 414628372 417194862 417846909 418072166 416992455
667.4 416992455 406722221 411111374 415126648 415822029 417346344 420648003 422672310 422554398 422189827
$$ packed form
606.6C78441505n28297k74925K35634L29208J296539Q42362q93097r90486j295090
615.3C77163353j182900l85131L50380J202621J356239N29328k68860p23114q01506
624C77240410R38759J631431J757546K282448J534004J592941O39916q5946M70238
632.7C88001747J278343J681939O14318J662064L385162K609444J012154P11593N01328
641.3D01458092k83509k56576J792335L748169K113228M99382K60506Q65707J260567
650D11457901j067505j243439J284638K164917K617683K748871N44739j869354j715279
658.7D14923172j181374q22944K98004J46828J264686K566490O52047K25257j079711
667.4D16992455j0270234M389153M015274O95381J524315L301659K024307j17912l64571
$$ plain form
676.1 422189827 422553940 423353386 424504929 426694641 429157219 430784912 432551079 433877716 433913574
684.7 433913574 433587570 433143921 433869743 436177330 438235741 440811386 442882004 442699242 441974068
693.4 441974068 441151772 440777245 441414223 443007164 445022545 447216415 448945732 448721542 448535805
702.1 448535805 448588943 448161011 448759117 450201302 451907463 453793106 456059875 457634964 457296791
710.8 457296791 455794029 455428581 456493416 458210144 460794907 462473488 463410072 463750191 463260040
719.5 463260040 462952881 462442513 462509956 463745613 465833702 467898865 469920197 471286240 471153984
728.1 471153984 470452614 469985695 470578232 472299194 474648743 476425591 478888741 479928894 478867378
736.8 478867378 479522057 478610001 477683983 477942200 479265556 482524605 483742294 484491997 484457893
$$ packed form
676.1D22189827L64113P99446J151543K189712K462578J627693J766167J326637L5858
684.7D33913574l26004m43649P25822K307587K058411K575645K070618j82762p25174
693.4D41974068q22296l74527O36978J592941K015381K193870J729317k24190j85737
702.1D48535805N3138m27932N98106J442185J706161J885643K266769J575089l38173
710.8D57296791j502762l65448J064835J716728K584763J678581R36584L40119m90151
719.5D63260040l07159n10368O7443J235657K088089K065163K021332J366043j32256
728.1D71153984p01370m66919N92537J720962K349549J776848K463150J040153j061516
736.8D78867378O54679r12056r26018K58217J323356L259049J217689P49703l4104
$$ plain form
745.5 484457893 483651848 482587242 481214638 482183495 484536781 487264442 488934212 490173416 490854149
754.2 490854149 490537910 490025673 489495201 489849739 490909691 494388313 498043671 500615158 501713867
762.8 501713867 500506592 499292755 498789787 500904007 502271614 502966652 504614258 505659485 506271782
771.5 506271782 504718552 503704338 502710457 502182808 502812538 503824463 506478996 507470932 507458763
780.2 507458763 506642456 505057869 503705978 503452110 505082207 506774025 509308128 511319771 511861038
788.9 511861038 510646820 508706245 507755547 507435226 507640114 508317451 510270920 510631905 509849205
797.6 509849205 508028412 505349998 504025345 501928101 500759697 500287552 499400902 497735825 495662117
806.2 495662117 493513107 490038910 487133865 484643593 483444595 482722282 481379242 480602226 479715424
$$ packed form
745.5D84457893q06045j064606j372604R68857K353286K727661J669770J239204O80733
754.2D90854149l16239n12237n30472L54538J059952L478622L655358K571487J098709
762.8E01713867j207275j213837n02968K114220J367607O95038J647606J045227O12297
771.5E06271782j553230j014214r93881n27649O29730J011925K654533R91936j2169
780.2E07458763q16307j584587j351891k53868J630097J691818K534103K011643N41267
788.9E11861038j214218j940575r50698l20321K04888O77337J953469L60985p82700
797.6E09849205j820793k678414j324653k097244j168404m72145q86650j665077k073708
806.2D95662117k149010l474197k905045k490272j198998p22313j343040p77016q86802
$$ plain form
814.9 479715424 478462944 476510277 474379539 472186890 471877480 473521576 475267029 476430779 477500305
823.6 477500305 479698868 480824280 482132797 483283577 484817772 489139557 493662338 498043671
831.3 498043671 500980148 503920593 506808434 508737411 510561028 512176208 515750389 518845596
839 518845596 522210541 525926857 528986893 531012344 531129990 531919899 532610779 534711189 537417870
847.7 537417870 540927582 544263000 545379333 547200241 547888107 547924004 548660469 551918335 555555229
856.4 555555229 558225288 561587410 562297363 561774902 561130333 561479073 561825218 562441521 563923912
865.1 563923912 564861755 566713562 566514244 564891090 562249031 559430046 557451591 556124954 556573601
873.8 556573601 557044373 557756767 556778450 554931908 552237282 549163818 548065071 547325134 547619934
$$ packed form
814.9D79715424j252480j952667k130738k192649l09410J644096J745453J163750J069526
823.6D77500305K198563J125412J308517J150780J534195M321785M522781M381333
831.3D98043671K936477K940445K887841J928977J823617J615180L574181L095207
839E18845596L364945L716316L060036K025451J17646P89909O90880K100410K706681
847.7E37417870L509712L335418J116333J820908O87866L5897P36465L257866L636894
856.4E55555229K670059L362122P09953n22461o44569L48740L46145O16303J482391
865.1E63923912R37843J851807j99318j623154k642059k818985j978455j326637M48647
873.8E56573601M70772P12394r78317j846542k694626l073464j098747p39937K94800
$$ plain form
882.4 547619934 548022995 548789902 548692551 548356323 548044243 545777130 544259567 543664246 544583054 545618973
892.1 545618973 547414703 549287109 549599152 549793701 547856064 546533203 546629448 548231735 550130844
900.8 550130844 551080513 552058868 551205444 550940323 551307335 552547569 554950027 558228493 561385269
909.4 561385269 563391685 565795746 565783310 564313202 561161499 558563461 557649918 555366707 553885269
918.1 553885269 552644653 551841011 549423180 544998627 539998398 535176201 531012230 526932068 525380936
926.8 525380936 523417816 521090469 518594666 514724007 511259727 506805496 503635025 502156601
934.5 502156601 501107445 500529022 500118446 500151482 499530945 497494698 494901886 493466530 492379532
943.2 492379532 492390289 493052711 493353806 493920898 493494377 492537918 490966721 489980927 489327927 488880882
$$ packed form
882.4E47619934M03061P66907r7351l36228l12080k267113j517563n95321R18808J035919
892.1E45618973J795730J872406L12043J94549j937637j322861R6245J602287J899109
900.8E50130844R49669R78355q53424k65121L67012J240234K402458L278466L156776
909.4E61385269K006416K404061j2436j470108l151703k598038r13543k283211j481438
918.1E53885269j240616q03642k417831m424553n000229m822197m163971m080162j551132
926.8E25380936j963120k327347k495803l870659l464280m454231l170471j478424
934.5E02156601j049156n78423m10576L3036o20537k036247k592812j435356j086998
943.2D92379532J0757O62422L01095N67092m26521r56459j571197r85794o53000m47045
$$ plain form
952.8 488880882 488651619 487224388 486558456 485248299 482691689 479441986 476230621 473701286 471384926
961.5 471384926 470214500 468928566 467601357 465083542 461268883 458020706 455421791 453187027
969.2 453187027 450375481 448278122 445998688 443113441 440221939 436104813 431694374 427786903
976.9 427786903 424410248 420452576 415489731 410746346 406322937 401354752 395802536 389988899
984.7 389988899 384324913 378924675 374008522 369606476 364325027 358603363 353335075 348258095
992.4 348258095 343155327 338218040 332580109 327476463 324171829 320419464 316893902 313099804
1000.1 313099804 309307232 306021690 302518921 299623508 297033501 295597858 294378891 293296528
1007.8 293296528 292016678 289929676 287615414 285390244 284035931 282233467 280820618 278931293
$$ packed form
952.8D88880882k29263j427231o65932j310157k556610l249703l211365k529335k316360
961.5D71384926j170426j285934j327209k517815l814659l248177k598915k234764
969.2D53187027k811546k097359k279434k885247k891502m117126m410439l907471
976.9D27786903l376655l957672m962845m743385m423409m968185n552216n813637
984.7C89988899n663986n400238m916153m402046n281449n721664n268288n076980
992.4C48258095n102768m937287n637931n103646l304634l752365l525562l794098
1000.1C13099804l792572l285542l502769k895413k590007j435643j218967j082363
1007.8B93296528j279850k087002k314262k225170j354313j802464j412849j889325
$$ plain form
1015.5 278931293 276142464 273623466 271005669 268589249 265486031 262686996 260048676 257543182
1023.2 257543182 254638443 252044773 250408669 248258438 246868248 245102253 243658676 241806602
1031 241806602 240073681 238741436 237227421 238163280 238314228 238426285 239069004 240258408 241968670
1039.6 241968670 242707748 243465881 243536015 244479980 245104713 245908890 246230068 245468597 245131779 243718891
1049.3 243718891 243362656 243167381 243505116 243006496 241700935 241727924 240696564 240032425 239597206
1058 239597206 239998703 240608234 242715759 245976372 247990265 250117207 251290226 253554020 255815506
1066.6 255815506 257717934 259576797 261075058 262641449 263546314 265556526 265966511 266453743 267480679
1075.3 267480679 267632637 268971901 270210476 271540108 272536640 274336185 275803604 276606789 277803955
$$ packed form
1015.5B78931293k788829k518998k617797k416420l103218k799035k638320k505494
1023.2B57543182k904739k593670j636104k150231j390190j765995j443577j852074
1031B41806602j732921j332245j514015R35859J50948J12057O42719J189404J710262
1039.6B41968670P39078P58133P0134R43965O24733Q04177L21178p61471l36818j412888
1049.3B43718891l56235j95275L37735m98620j305561K6989j031360o64139m35219
1058B39597206M01497O09531K107525L260613K013893K126942J173019K263794K261486
1066.6B55815506J902428J858863J498261J566391R04865K010212M09985M87232J026936
1075.3B67480679J51958J339264J238575J329632R96532J799545J467419Q03185J197166
$$ plain form
1084 277803955 279094410 280958023 282309113 284589500 286378708 288275528 290641556 292360897 294538422
1092.7 294538422 296078434 297939167 299670219 301554928 303425922 305359020 307500706 308596783
1100.4 308596783 310133400 311735268 313755550 315377026 317018909 319232254 320670357 322289009
1108.1 322289009 323111076 323735237 323900299 323727951 324686813 326227570 328248024 329268341 329452095
1116.8 329452095 329195175 328842621 328495064 327521439 327072449 327199249 327596169 328087425 329149780
1125.5 329149780 330199661 331272774 332913475 334353867 336034050 338167992 340943909 343601341
1133.2 343601341 346215172 348654823 350203018 352005997 354102249 355915222 357481766 359386940
1140.9 359386940 361863174 363643875 364356728 364945183 365262070 365231705 365518341 366235847 366884232
$$ packed form
1084B77803955J290455J863613J351090K280387J789208J896820K366028J719341K177525
1092.7B94538422J540012J860733J731052J884709J870994J933098K141686J096077
1100.4C08596783J536617J601868K020282J621476J641883K213345J438103J618652
1108.1C22289009Q22067O24161J65062j72348R58862J540757K020454J020317J83754
1116.8C29452095k56920l52554l47557r73625m48990J26800L96920M91256J062355
1125.5C29149780J049881J073113J640701J440392J680183K133942K775917K657432
1133.2C43601341K613831K439651J548195J802979K096252J812973J566544J905174
1140.9C59386940K476234J780701P12853N88455L16887l0365K86636P17506O48385
$$ plain form
1149.6 366884232 367356300 367951927 368363304 368099861 367119637 366401100 366118927 365483704 365173073 365215302
1159.2 365215302 364543610 363569527 363053055 363056068 363564415 364158554 365070686 367621231 370937881 373415833
1168.9 373415833 375376358 377269440 379426460 381640511 384131546 386929932 390095024 393094902
1176.6 393094902 395812950 398477745 400751953 403180237 404900780 406576080 408022499 409328079
1184.3 409328079 411417961 412850418 413687553 413955536 413648834 412742729 412278290 412127266 411347961
1193 411347961 410824051 410626869 410202179 408645935 406740036 404762688 402952347 401577339 400102844
1201.6 400102844 399322586 398739548 397854843 396270714 394127007 392296524 391203537 391096687 390894814
1210.3 390894814 390976601 391552391 392095566 392488976 392243958 392269402 391904449 391383934 391705322 392310295
$$ packed form
1149.6C66884232M72068N95627M11377k63443r80224p18537k82173o35223l10631M2229
1159.2C65215302o71692r74083n16472L013N08347N94139R12132K550545L316650K477952
1168.9C73415833J960525J893082K157020K214051K491035K798386L165092K999878
1176.6C93094902K718048K664795K274208K428284J720543J675300J446419J305580
1184.3D09328079K089882J432457Q37135K67983l06702r06105m64439j51024p79305
1193D11347961n23910j97182m24690j556244j905899j977348j810341j375008j474495
1201.6D00102844p80258n83038q84705j584129k143707j830483j092987j06850k01873
1210.3C90894814Q1787N75790N43175L93410k45018K5444l64953n20515L21388O04973
$$ plain form
1220 392310295 393184395 393717575 393797646 393460503 392935905 392283020 391506958 391008377 390437431 390140038
1229.6 390140038 390291328 390091133 388873405 387231941 386095772 385062408 384266701 384096985 384052467
1238.3 384052467 384142418 384293327 383836555 383129158 382305794 381004944 380160179 379719887 379472198 379352303
1247.9 379352303 378832245 378564224 378331375 377824745 376992416 376094856 375717010 375745201 376069565 375960388
1257.6 375960388 375897064 375828972 375364304 375133362 374848022 374772339 375225830 376384277 377327499 377995834
1267.2 377995834 378909607 379430122 379710808 379809189 380600128 382057076 383687019 385449104 387011185
1275.9 387011185 388305779 388936691 389697380 390907784 392272758 393825760 395682755 397785301 399942055
1284.6 399942055 401988525 403360138 404403648 405587387 406906700 408442650 410396957 412022247
$$ packed form
1220C92310295Q74100N33180Q0071l37143n24598o52885p76062m98581n70946k97393
1229.6C90140038J51290k00195j217728j641464j136169j033364p95707j69716m4518
1238.3C84052467Q9951J50909m56772p07397q23364j300850q44765m40292k47689j19895
1247.9C79352303n20058k68021k32849n06630q32329q97560l77846K8191L24364j09177
1257.6C75960388o3324o8092m64668k30942k85340p5683M53491J158447R43222O68335
1267.2C77995834R13773N20515K80686R8381P90939J456948J629943J762085J562081
1275.9C87011185J294594O30912P60689J210404J364974J553002J856995K102546K156754
1284.6C99942055K046470J371613J043510J183739J319313J535950J954307J625290
$$ plain form
1292.3 412022247 413200912 414415436 415628166 416362152 416349678 416886368 417518082 418361969 419550476
1301 419550476 420381737 421159897 421465836 421261635 420423317 420085411 420032005 419896507 420166130 420286293
1310.6 420286293 420400848 419708748 418782120 417958374 417555809 417783661 417771416 418422241 419367447 420540695
1320.3 420540695 421769676 422326126 422579842 423243256 424313545 424872932 425476379 426257019 427013397
1328.9 427013397 427073631 426573181 425815926 424750023 424113617 423713074 423863792 423728676 423695488 423718147
1338.6 423718147 423089294 423619499 423987198 424258118 424537506 425403938 426659927 427440338 428361282
1347.3 428361282 428537827 428438950 427869530 427566795 427274551 426944542 427468872 427471657 427285576 426356392
1356.9 426356392 425525055 424681664 423745232 423345947 422725792 422993660 422798538 423063278 423184929 422277489
$$ packed form
1292.3D12022247J178665J214524J212730P33986j2474N36690O31714Q43887J188507
1301D19550476Q31261P78160L05939k04201q38318l37906n3406j35498K69623J20163
1310.6D20286293J14555o92100r26628q23746m02565K27852j2245O50825R45206J173248
1320.3D20540695J228981N56450K53716O63414J070289N59387O03447P80640P56378
1328.9D27013397O0234n00450p57255j065903o36406m00543J50718j35116l3188K2659
1338.6D23718147o28853N30205L67699K70920K79388Q66432J255989P80411R20944
1347.3D28361282J76545r8877n69420l02735k92244l30009N24330K785j86081r29184
1356.9D26356392q31337q43391r36432l99285o20155K67868j95122K64740J21651r07440
$$ plain form
1366.6 422277489 421428719 419874763 418710136 418156166 418402863 418980408 419197922 418377762 417020149
1375.2 417020149 416789589 416319427 415795326 414987717 414820251 414566231 413521576 412200127 410213127
1383.9 410213127 408610382 406755409 404950409 402395782 401177368 400806465 399033928 397081070
1391.6 397081070 395090637 393212280 389701805 386197777 384522324 382816086 381892967 379054642
1399.3 379054642 376315651 374312172 372042046 370138741 367845688 364805832 362377205 361606216
1407.1 361606216 360604210 358815460 357133560 355128822 353534660 351948547 350499878 349578133
1414.8 349578133 348902054 348430023 347724113 347918282 346515503 346328278 347801514 348308067 348878670
1423.4 348878670 349313774 350741081 352133942 353071365 354396324 354845314 355566750 356391296 358117294
$$ packed form
1366.6D22277489q48770j553956j164627n53970K46697N77545K17514q20160j357613
1375.2D17020149k30560m70162n24101q07609j67466k54020j044655j321449j987000
1383.9D10213127j602745j854973j805000k554627j218414l70903j772537j952858
1391.6C97081070j990433j878357l510475l504028j675453j706238r23119k838325
1399.3C79054642k738991k003479k270126j903305k293053l039856k428627p70989
1407.1C61606216j002006j788750j681900k004738j594162j586113j448669r21745
1414.8C49578133o76079m72031p05910J94169j402779j87225J473236N06553N70603
1423.4C48878670M35104J427307J392861R37423J324959M48990P21436Q24546J725998
$$ plain form
1432.1 358117294 359828339 361476936 364170494 365893173 366681519 368393021 371330185 373111610
1439.8 373111610 374322891 376016579 377257538 379524307 381128464 382387238 383275681 383775711 384098396
1448.5 384098396 385052872 386927872 387979240 389492950 390871353 392718735 394370804 394675789 394428253
1457.2 394428253 393612022 397160492 398913918 401192398 403360863 405138817 407193642 406866226 408665962
1465.9 408665962 410803185 413457451 416152802 418784180 422156868 424665985 426678848 429216499
1473.6 429216499 433573685 436753502 438745956 441633606 445029297 448313637 450799866 452701111
1481.3 452701111 454439011 456429710 458051376 459644775 461212349 462099457 463403130 465578194
1489 465578194 465846825 465118256 465311890 464732704 463618507 462702217 462004280 457129745 456813850 455527954
$$ packed form
1432.1C58117294J711045J648597K693558J722679P88346J711502K937164J781425
1439.8C73111610J211281J693688J240959K266769J604157J258774Q88443N00030L22685
1448.5C84098396R54476J875000J051368J513710J378403J847382J652069L04985k47536
1457.2C94428253q16231L548470J753426K278480K168465J777954K054825l27416J799736
1465.9D08665962K137223K654266K695351K631378L372688K509117K012863K537651
1473.6D29216499M357186L179817J992454K887650L395691L284340K486229J901245
1481.3D52701111J737900J990699J621666J593399J567574Q87108J303673K175064
1489D65578194K68631p28569J93634n79186j114197r16290o97937m874535l15895j285896
$$ plain form
1498.7 455527954 451880722 450977783 448530769 446189232 444616661 444786110 444795837 440586281 436695862
1507.3 436695862 436655121 438697815 437854462 438487511 437727089 435799408 436194916 435631790 434908562
1516 434908562 432202797 430010185 431456413 432516975 430780373 428570709 429677353 431275253 433342209
1524.7 433342209 432933769 433758087 435541954 435928345 436563606 437883949 439791298 441314545 442221107
1533.4 442221107 442515221 445180130 447006226 448018227 449289474 444831810 445355453 448279076 450499382
1542.1 450499382 452651863 454254608 455285187 454425278 456217117 457170067 458563232 459164925 458821297
1550.7 458821297 460903549 461923065 462580872 459112015 458476105 459976997 461646881 460961342 446046104
1559.4 446046104 451162949 453311310 454575958 452816010 450802689 447529869 444255409 443011894
$$ packed form
1498.7D55527954l647232r02939k447014k341537j572571J69449R727m209556l890419
1507.3D36695862m0741K042694q43353O33049p60422j927681L95508n63126p23228
1516D34908562k705765k192612J446228J060562j736602k209664J106644J597900K066956
1524.7D33342209m08440Q24318J783867L86391O35261J320343J907349J523247R06562
1533.4D42221107K94114K664909J826096J012001J271247m457664N23643K923623K220306
1542.1D50499382K152481J602745J030579q59909J791839R52950J393165O01693l43628
1550.7D58821297K082252J019516O57807l468857o35910J500892J669884o85539j4915238
1559.4D46046104N116845K148361J264648j759948k013321l272820l274460j243515
$$ plain form
1567.1 443011894 440825539 439770927 430511360 428474503 426252899 421940117 418241615 414138298
1574.9 414138298 412287979 398521729 397352371 394196663 389716835 385634117 379271851 374790115
1582.6 374790115 368055344 363851509 358013344 353449974 348643494 342366905 338582840 331920090
1590.3 331920090 328256035 322156982 318300381 314027138 308801785 305573883 299635715 296890583
1598 296890583 291078568 288074436 283877296 279981251 277763424 273160515 272052307 267587566 265897541
1606.7 265897541 262554932 260634346 258842716 255477333 255761585 252726498 252508736 250011559 250449257
1615.4 250449257 250580330 244554729 246655979 245158367 246733723 245349941 246649246 246597557 244601727
1624 244601727 246498947 246044674 248716278 247476501 248978615 249344368 250351715 252328434 252874832
$$ packed form
1567.1D43011894k186355j054612r259567k036857k221604m312782l698502m103317
1574.9D14138298j850319j3766250j169358l155708m479828m082718o362266m481736
1582.6C74790115o734771m203835n838165m563370m806480o276589l784065o662750
1590.3C31920090l664055o099053l856601m273243n225353l227902n938168k745132
1598B96890583n812015l004132m197140l896045k217827m602909j108208m464741j690025
1606.7B65897541l342609j920586j791630l365383K84252l035087k17762k497177M37698
1615.4B50449257J31073o025601K101250j497612J575356j383782J299305n1689j995830
1624B44601727J897220m54273K671604j239777J502114L65753J007347J976719N46398
$$ plain form
1632.7 252874832 255775452 255665646 259507523 258185635 261344757 263518982 265360413 268882465
1640.4 268882465 269850159 273329868 273760681 276230545 278238297 277996407 280840988 280226994 285090618
1649.1 285090618 285628891 288687859 291138039 288694420 286308098 286877613 291792259 292576885 294846992
1657.8 294846992 295432644 296944103 298938389 300044346 303010521 303180599 307574062 310190449 314112930
1666.5 314112930 318202858 321130447 325467796 327466965 332960625 335739975 340675316 344798470
1674.2 344798470 349036674 354446030 358552513 364563141 368313980 373447304 377063255 382117958
1681.9 382117958 387891960 389886017 398318100 402781525 410010300 414972153 420786629 426879311
1689.6 426879311 431492043 437275352 442548752 448925667 454954453 460381889 463515091 470838814
$$ packed form
1632.7B52874832K900620j09806L841877j321888L159122K174225J841431L522052
1640.4B68882465R67694L479709M30813K469864K007752k41890K844581o13994M863624
1649.1B85090618N38273L058968K450180k443619k386322N69515M914646P84626K270107
1657.8B94846992N85652J511459J994286J105957K966175J70078M393463K616387L922481
1666.5C14112930M089928K927589M337349J999169N493660K779350M935341M123154
1674.2C44798470M238204N409356M106483O010628L750839N133324L615951N054703
1681.9C82117958N774002J994057Q432083M463425P228775M961853N814476O092682
1689.6D26879311M612732N783309N273400O376915O028786N427436L133202P323723
$$ plain form
1697.3 470838814 477446480 483291245 489107857 490186729 498480606 504850121 510199013 514198990
1705 514198990 517901497 521272316 524963264 529754295 533041611 536110764 540026855 544091072 547374153
1713.7 547374153 547941284 548461456 551847763 554407539 553087769 558374977 562895088 565829887 567932243
1722.4 567932243 569271202 570458641 572087021 573863716 575244217 577229042 579947090 581026802
1730.1 581026802 582526321 586622849 590325394 589312210 585249252 589280891 593706703 596236458
1737.8 596236458 599728241 601545677 601751518 606004906 608318901 608667107 610716515 614982185 618610764
1746.5 618610764 621253204 624441414 625986977 630329819 632212181 633781204 638451996 641641998
1754.2 641641998 645351257 648855057 650081711 652789459 655819016 657725296 660751114 660084457
$$ packed form
1697.3D70838814O607666N844765N816612J078872Q293877O369515N348892L999977
1705E14198990L702507L370819L690948M791031L287316L069153L916091M064217L283081
1713.7E47374153N67131N20172L386307K559776j319770N287208M520111K934799K102356
1722.4E67932243J338959J187439J628380J776695J380501J984825K718048J079712
1730.1E81026802J499519M096528L702545j013184m062958M031639M425812K529755
1737.8E96236458L491783J817436K05841M253388K313995L48206K049408M265670L628579
1746.5F18610764K642440L188210J545563M342842J882362J569023M670792L190002
1754.2F41641998L709259L503800J226654K707748L029557J906280L025818o66657
$$ plain form
1761.9 660084457 660588913 664756927 667098465 669699402 672023697 673694763 672514572 674536133
1769.7 674536133 678249893 677647247 676212463 676191711 681587143 684438705 683793106 686083527 686673965
1778.3 686673965 687814178 688002396 687759781 689600143 692037811 694485779 694393692 694696579 695785141
1787 695785141 696596832 696901016 698040390 699070587 700522156 700378799 699486542 702861252 703496246
1795.7 703496246 702946014 704595871 706699829 707585983 707177963 709942398 710192032 710774384 711939011
1804.4 711939011 712000122 712787704 712981186 713877487 715133209 716956787 716637726 717193985 718583908
1813 718583908 718508530 718823700 718386765 719737778 720704346 721977005 723550110 724046097 725078888
1821.7 725078888 723938370 724278717 724867401 723072662 724376678 727284775 729799957 729478149 726541748
$$ packed form
1761.9F60084457N04456M168014K341538K600937K324295J671066j180191K021561
1769.7F74536133L713760o02646j434784k0752N395432K851562o45599K290421N90438
1778.3F86673965J140213J88218k42615J840362K437668K447968r2087L02887J088562
1787F95785141Q11691L04184J139374J030197J451569j43357q92257L374710O34994
1795.7G03496246n50232J649857K103958Q86154m08020K764435K49634N82352J164627
1804.4G11939011O1111P87582J93482Q96301J255722J823578l19061N56259J389923
1813G18583908p5378L15170m36935J351013R66568J272659J573105M95987J032791
1821.7G25078888j140518L40347N88684j794739J304016K908097K515182l21808k936401
$$ plain form
1830.4 726541748 726945114 729032211 729218903 729377289 730377579 731729584 732969284 732639999 733457031
1839.1 733457031 733096085 733166199 733223267 733825531 734788971 731234207 734501877 737006989 736578674
1847.8 736578674 735727539 736151581 737097702 736883469 737796402 737945099 739095917 740184860 740088120
1856.4 740088120 740190048 739521713 739655380 739547806 740172043 740437469 741239395 742313080 742565308
1865.1 742565308 743280945 742244720 742056732 740777740 740479660 742152252 743160553 744594574 745126953
1873.8 745126953 745179825 744353714 744350433 744232788 744183960 744851837 745126877 746493607 746860504 747345734
1883.4 747345734 746971970 746347504 746423264 746137772 747444534 747102203 746248627 747290649 748302765
1892.1 748302765 748228302 747949371 747451401 746572418 748005371 748524094 749161682 749820480 749872208 750111389
$$ packed form
1830.4G26541748M03366K087097J86692J58386J000290J352005J239700l29285Q17032
1839.1G33457031l60946P0114N7068O02264R63440l554764L267670K505112m28315
1847.8G36578674q51135M24042R46121k14233R12933J48697J150818J088943r6740
1856.4G40088120J01928o68335J33667j07574O24237K65426Q01926J073685K52228
1865.1G42565308P15637j036225j87988j278992k98080J672592J008301J434021N32379
1873.8G45126953N2872q26111l281j17645m8828O67877K75040J366730L66897M85230
1883.4G47345734l73764o24466P5760k85492J306762l42331q53576J042022J012116
1892.1G48302765p4463k78931m97970q78983J432953N18723O37588O58798N1728K39181
$$ plain form
1901.8 750111389 749175339 749106750 748796692 749109955 749448929 749867630 751065292 751201172 750740051 749826050
1911.4 749826050 750165100 749646912 749750595 750420990 751163559 753298874 751727600 751193008 751880646
1920.1 751880646 751524200 751355972 750246277 750510483 751595230 752631226 752727203 752941360 752589722
1928.8 752589722 751933441 751671219 751008911 751513596 751822128 752763214 753400345 753130569 752810898 752296677
1938.4 752296677 752014542 751209106 752095184 751750412 750813751 752588348 753345490 753218842 752464676
1947.1 752464676 751918488 751398392 751416397 751829681 752367020 753233795 753316422 753102264 752250900 751572495
1956.7 751572495 750845413 750934677 751792755 752165909 752678528 752678375 752963486 752637863 752208557 751428528
1966.4 751428528 750087738 750390167 751279984 752552185 753007050 753253937 752925949 752102203 751583710
$$ packed form
1901.8G50111389r36050o8589l10058L13263L38974M18701J197662J35880m61121r14001
1911.4G49826050L39050n18188J03683O70395P42569K135315j571274n34592O87638
1920.1G51880646l56446j68228j109695K64206J084747J035996R5977K14157l51638
1928.8G52589722o56281k62222o62308N04685L08532R41086O37131k69776l19671n14221
1938.4G52296677k82135q05436Q86078l44772r36661J774597P57142j26648p54166
1947.1G52464676n46188n20096J8005M13284N37339Q66775Q2627k14158q51364o78405
1956.7G51572495p27082Q9264Q58078L73154N12619j53K85111l25623m29306p80029
1966.4G51428528j340790L02429Q89817J272201M54865K46887l27988q23746n18493
$$ plain form
1975.1 751583710 751017303 751056519 750783997 751736755 752539368 752649460 752695770 752017288 751766129 751085739
1984.7 751085739 751072006 750972443 751133270 751858826 752132339 752734375 751857300 750417480 750062637 750320816
1994.3 750320816 750206070 750298080 750794373 751081543 751932220 751539764 750922546 750165939 749570541 749432983
2004 749432983 749259720 750063095 750253372 750562973 750305634 749668198 749125519 748361130 748570938 748578033
2013.6 748578033 748856125 749188004 749544601 749123383 748580704 748617859 748119812 748198090 747974930 748287430
2023.3 748287430 748437653 748199310 748225403 747831268 747658463 746881332 746878891 746893997 747050400 747516479
2032.9 747516479 747387238 747598953 747247162 746982117 746297150 746086426 746211700 746031342 746016617 746019745
2042.6 746019745 746706772 746192932 745801010 745285034 744879913 745204468 745209045 745793228 745563278 745821991
$$ packed form
1975.1G51583710n66407L9216k72522R52758Q02613J10092M6310o78482k51159o80390
1984.7G51085739j3733r9563J60827P25556K73513O02036q77075j439820l54843K58179
1994.3G50320816j14746R2010M96293K87170Q50677l92456o17218p56607n95398j37558
2004G49432983j73263Q03375J90277L09601k57339o37436n42679p64389K09808P095
2013.6G48578033K78092L31879L56597m21218n42679L7155m98047P8278k23160L12500
2023.3G48287430J50223k38343K6093l94135j72805p77131k441J5106J56403M66079
2032.9G47516479j29241K11715l51791k65045o84967k10724J25274j80358j4725L128
2042.6G46019745O87027n13840l91922n15976m05121L24555M577N84183k29950K58713
$$ plain form
2052.2 745821991 745411377 745011292 745001144 744038696 744676437 744869080 745106964 745374908 745238647 744941254
2061.9 744941254 744389648 744718475 744168167 743949890 743997345 744387512 744717255 744673386 745066452 744583282
2071.5 744583282 744373550 743709641 743406677 743871841 744594879 745223465 744962158 745023727 744599838 744180069
2081.1 744180069 743142395 742766342 743094635 743076935 743864594 743651352 743597412 743263550 743031235 742842407
2090.8 742842407 742234116 742624054 742577515 743209076 743503571 743529129 743416138 742730103 742311478 741343079
2100.4 741343079 741008606 740822525 741480103 742026672 742067795 742321701 741724930 741490631 740918579 740628052
2110.1 740628052 740683670 741111755 741347275 741056366 741345291 740862503 740557709 740087357 739731598 739564362
2119.7 739564362 739808426 740662308 740698471 741098862 740626755 740055313 739488220 738935013 739343414 739568787
$$ packed form
2052.2G45821991m10614m00085j0148r62448O37741J92643K37884K67944j36261k97393
2061.9G44941254n51606L28827n50308k18277M7455L90167L29743m3869L93066m83170
2071.5G44583282k09732o63909l02964M65164P23038O28586k61307O1569m23889m19769
2081.1G44180069j037674l76053L28293j7700P87659k13242n3940l33862k32315j88828
2090.8G42842407o08291L89938m6539O31561K94495K5558j12991o86035m18625r68399
2100.4G41343079l34473j86081O57578N46569M1123K53906n96771k34299n72052k90527
2110.1G40628052N5618M28085K35520k90909K88925m82788l04794m70352l55759j67236
2119.7G39564362K44064Q53882L6163M00391m72107n71442n67093n53207M08401K25373
$$ plain form
2129.4 739568787 740148239 739945374 739989014 740287094 740302582 740032196 739335403 739298935 739047623 739449539
2139 739449539 739837646 740454330 740847168 740580292 740412903 739512711 739615097 739531097 739695282 740210876
2148.6 740210876 740206528 740295181 740100021 740401077 739806137 739643555 739571915 739362793 740000534 740202255
2158.3 740202255 740606232 740299454 740309982 740246811 740016403 740106506 740033112 740619431 740711212 741030350
2167.9 741030350 740794067 740402985 740260239 740115128 740475922 740009079 740134354 740444031 740948563 741344299
2177.6 741344299 741265106 741072159 740352478 740483017 740561142 740885010 741037369 741270447 741590271 741172867
2187.2 741172867 741132736 740697250 740841293 740714722 740668106 741028137 741063004 741486053 741149216 740855103
2196.9 740855103 740149002 740216599 740918655 741240845 741939545 741999054 742026215 741470718 741577988 741638565
$$ packed form
2129.4G39568787N79452k02865M3640K98080J5488k70386o96793l6468k51312M01916
2139G39449539L88107O16684L92838k66876j67389r00192J02386q4000J64185N15594
2148.6G40210876m348Q8653j95160L01056n94940j62582p1640k09122O37741K01721
2158.3G40202255M03977l06778J0528o3171k30408R0103p3394N86319R1781L19138
2167.9G41030350k36283l91082j42746j45111L60794m66843J25275L09677N04532L95736
2177.6G41344299p9193j92947p19681J30539P8125L23868J52359K33078L19824m17404
2187.2G41172867m0131m35486J44043j26571m6616L60031L4867M23049l36837k94113
2196.9G40855103p06101O7597P02056L22190O98700N9509K7161n55497J07270O0577
$$ plain form
2206.5 741638565 741070175 741300964 741720276 742582092 742549515 742602081 742564087 742106171 741894989 741697540
2216.1 741697540 741922226 741759109 742400742 742687607 742474213 742493134 742311249 741989212 741305161 741698074
2225.8 741698074 741808014 742264633 742994232 743075790 742970886 742255173 742070465 741487045 741634064 742020798
2235.4 742020798 742028351 742587891 742739334 743053513 742904739 742670059 741936340 741503677 741799240 741796951
2245.1 741796951 742099838 742312469 742865829 742632294 742243195 741621704 740934830 741373596 741372452 741809769
2254.7 741809769 742367859 742870407 742781677 742319565 741887817 741000061 740826263 740368500 740717545 741432571
2264.4 741432571 741896362 742004623 741366348 741442566 741089630 740830536 740596313 740875778 741408310 741245956
2274 741245956 741404572 741413574 741521225 740839767 740348053 740233154 740098724 740391006 740695877 741206360
$$ packed form
2206.5G41638565n68390K30789M19312Q61816l2577N2566l7994m57916k11182j97449
2216.1G41697540K24686j63117O41633K86865k13394J8921j81885l22037o84051L92913
2225.8G41698074J09940M56619P29599Q1558j04904p15713j84708n83420J47019L86734
2235.4G42020798P553N59540J51443L14179j48774k34680p33719m32663K95563k289
2245.1G41796951L02887K12631N53360k33535l89099o21491o86874M38766j144M37317
2254.7G41809769N58090N02548q8730m62112m31748q87756j73798m57763L49045P15026
2264.4G41432571M63791J08261o38275P6218l52936k59094k34223K79465N32532j62354
2274G41245956J58616R002J07651o81458m91714j14899j34430K92282L04871N10483
$$ plain form
2283.7 741206360 741030579 741005859 740133362 739479523 739365921 738669357 739035645 739127197 739719467 739696503
2293.3 739696503 739341583 739175110 738354187 738316498 737802353 738121414 738132401 738028717 738220367 737597656
2302.9 737597656 737231979 736163254 736071243 735768127 735484390 735700684 735898743 736225586 735109100
2311.6 735109100 734928360 733959579 733171082 733452835 733372498 733288498 732498245 732904282 732543869 732042542
2321.3 732042542 731216049 730280151 729856796 729009552 729867477 729388657 728635941 727501297 727113342
2329.9 727113342 727599258 726949692 726766510 725645294 726312866 726254272 726174698 726601028 725793915 725579071
2339.6 725579071 724920349 725338364 725115433 725754623 725371094 724494858 725690918 726156235 727015610
2348.3 727015610 727614365 727310944 725014420 723703995 723922043 723135452 722289124 721298447 722667160
$$ packed form
2283.7G41206360j75781k4720q72497o53839j13602o96564L66288R1552N92270k2964
2293.3G39696503l54920j66473q20923l7689n14145L19061J0987j03684J91650o22711
2302.9G37597656l65677j068725r2011l03116k83737K16294J98059L26843j116486
2311.6G35109100j80740r68781p88497K81753q0337q4000p90253M06037l60413n01327
2321.3G32042542q26493r35898m23355q47244Q57925m78820p52716j134644l87955
2329.9G27113342M85916o49566j83182j121216O67572n8594p9574M26330q07113k14844
2339.6G25579071o58722M18015k22931O39190l83529q76236J196060M65317Q59375
2348.3G27015610N98755l03421k296524j310425K18048p86591q46328r90677J368713
$$ plain form
2356.9 722667160 721612091 720960464 720811920 720513306 721349869 718696823 719366608 720987473 721855621
2365.6 721855621 720032883 718810196 721054382 721321106 722147064 722857056 723772202 723561401 723090134
2374.3 723090134 723217239 722718353 723138962 723315201 723968201 724526520 724924622 725283127 725062027 724825592
2383.9 724825592 724761276 725331268 725189972 724676819 724135513 724300766 724732437 724102325 723910294 723197784
2393.6 723197784 722537308 722367096 722288589 722109985 721686478 722034683 721917496 721516037 720960617 720699921
2403.2 720699921 720368881 719858017 720208588 720017471 719624176 718917847 718572769 718374481 717662735 717301102
2412.9 717301102 716944656 717239304 717366486 717264633 716818161 716141357 715743790 715209656 714823914 714122238
2422.5 714122238 714268723 714634171 714678421 714451370 713641129 713155365 712524643 712121124 711296005 710795822
$$ packed form
2356.9G22667160j055069o51627j48544k98614Q36563k653046O69785J620865Q68148
2365.6G21855621j822738j222687K244186K66724Q25958P09992R15146k10801m71267
2374.3G23090134J27105m98886M20609J76239O53000N58319L98102L58505k21100k36435
2383.9G24825592o4316N69992j41296n13153n41306J65253M31671o30112j92031p12510
2393.6G23197784o60476j70212p8507j78604m23507L48205j17187m01459n55420k60696
2403.2G20699921l31040n10864L50571j91117l93295p06329l45078j98288p11746l61633
2412.9G17301102l56446K94648J27182j01853m46472o76804l97567n34134l85742p01676
2422.5G14122238J46485L65448M4250k27051q10241m85764o30722m03519q25119n00183
$$ plain form
2432.2 710795822 710988388 710994492 711024857 710524063 710177460 709692993 709212875 708571091 708253174 708383942
2441.8 708383942 708021240 708050537 707731171 707223511 706345978 705771103 705446854 704575882 704494400 704332504
2451.5 704332504 704392319 704155121 703644104 703181763 702422791 702124252 701299973 700885315 700790558 700549316
2461.1 700549316 700231400 699683685 699496765 699255753 698789520 697766724 697256165 696913910 696886063 697247238
2470.7 697247238 696627960 696025543 695311890 694821014 694208832 693558044 693284149 693119125 693441010 692981720
2480.4 692981720 692130356 691081390 690514374 690457535 689925995 689731522 689358444 688431473 687685928 688060379
2490 688060379 687653961 686485138 686178360 685391846 684536209 684106522 684130249 684001694 683772430 683242569
2499.7 683242569 682096710 681364899 680675888 680319061 679878540 679752350 679783859 679425201 679248962 678442154
$$ packed form
2432.2G10795822J92566O104L0365n00794l46603m84467m80118o41784l17917J30768
2441.8G08383942l62702K9297l19366n07660q77533n74875l24249q70972q1482j61896
2451.5G04332504N9815k37198n11017m62341p58972k98539q24279m14658r4757k41242
2461.1G00549316l17916n47715j86920k41012m66233j022796n10559l42255k7847L61175
2470.7F97247238o19278o02417p13653m90876o12182o50788k73895j65024L21885m59290
2480.4F92981720q51364j048966n67016n6839n31540j94473l73078r26971p45545L74451
2490F88060379m06418j168823l06778p86514q55637m29687K3727j28555k29264n29861
2499.7F83242569j145859p31811o89011l56827m40521j26190L1509l58658j76239q06808
$$ plain form
2509.3 678442154 677529221 676613312 676342087 676386261 676014709 675583954 674925156 674548416 673772583 673177109
2519 673177109 672692261 672256393 671764908 670906296 670961456 670722580 670304871 669889984 669146194 668379364
2528.6 668379364 667887039 667904282 667639618 667636490 667102203 666310272 665658035 665107422 664950867 664202042
2538.2 664202042 663802490 663436127 663107300 662832565 662399368 662018127 661417923 661302719 660614624 659855347
2547.9 659855347 659685822 659708023 659415436 658708115 658315887 657733002 657551498 656928864 656126251 655823441
2557.5 655823441 655508347 655308685 654486694 653865051 653364487 653221207 653031082 652483444 652235794 651738663
2567.2 651738663 651516495 650732880 650235901 650225983 650028534 649759598 648633423 648031693 647722931 647380676
2576.8 647380676 646920547 646389847 646014633 645427322 645279236 644630890 643879395 643516083 643307495 643100128
$$ packed form
2509.3F78442154r12933r15909k71225M4174l71552m30755o58798l76740p75833n95474
2519F73177109m84848m35868m91485q58612N5160k38876m17709m14887p43790p66830
2528.6F68379364m92325J7243k64664l128n34287p91931o52237n50613j56555p48825
2538.2F64202042l99552l66363l28827k74735m33197l81241o00204j15204o88095p59277
2547.9F59855347j69525K2201k92587p07321l92228n82885j81504o22634q02613l02810
2557.5F55823441l15094j99662q21991o21643n00564j43280j90125n47638k47650m97131
2567.2F51738663k22168p83615m96979r918j97449k68936j126175o01730l08762l42255
2576.8F47380676m60129n30700l75214n87311j48086o48346p51495l63312k08588k07367
$$ plain form
2586.5 643100128 642707443 642439499 641773605 641349258 641015930 640631180 639897232 638983727 638731499 638177605
2596.1 638177605 637786102 637774849 637345772 636349182 635901527 635886307 635299034 634752274 634278831 634018745
2605.7 634018745 633435898 632684212 632140236 631701241 631252518 630638924 630625038 630043259 628815918 627879028
2615.4 627879028 627740631 627638779 626720772 626384468 626030540 625486374 624604073 623921013 624022865 623608322
2625 623608322 622943611 622033691 621454620 621032867 620560875 620126305 619621773 619326363 618276405 617365456
2634.7 617365456 616759453 616262894 616127548 615942802 615763435 615145836 614238815 613343124 613077698 612633743
2644.3 612633743 611882286 611517906 611071320 610617981 609966507 609855080 609645157 608942566 608128510 607444801
2654 607444801 607308235 606718941 606332016 606060829 605847855 605750999 605182648 604209709 603098106 602922020
$$ packed form
2586.5F43100128l92685k67944o65894m24347l33328l84750p33948r13505k52228n53894
2596.1F38177605l91503j1253m29077r96590m47655j5220n87273n46760m73443k60086
2605.7F34018745n82847p51686n43976m38995m48723o13594j3886n81779j227341r36890
2615.4F27879028j38397j01852r18007l36304l53928n44166q82301o83060J01852m14543
2625F23608322o64711r09920n79071m21753m71992m34570n04532k95410j049958r10949
2634.7F17365456o06003m96559j35346j84746j79367o17599r07021q95691k65426m43955
2644.3F12633743p51457l64380m46586m53339o51474j11427k09923p02591q14056o83709
2654F07444801j36566n89294l86925k71187k12974r6856n68351r72939j111603j76086
$$ plain form
2663.6 602922020 602697563 602515564 602459488 602172928 601882439 601066475 600611916 599978485 599425507 599275475
2673.3 599275475 599173546 599245605 599096451 598670921 597744255 597328606 596819763 596025848 595545998 595346642
2682.9 595346642 595493317 595124168 594898033 594500275 594149818 593661194 592857208 592609406 591994247 591659355
2692.5 591659355 591552200 591487656 591104660 590342255 589941902 589690056 589669113 589081879 588860397 588587074
2702.2 588587074 587954750 587848015 587429085 587053719 586698494 586581268 586044388 585447731 585056686 584288292
2711.8 584288292 584166374 583927536 583760452 583575630 583126373 582673111 582247353 582069511 581736031 581850281
2721.5 581850281 581709137 581304970 580776634 580404282 580390511 579897346 579635773 578957863 578375816 577970924
2731.1 577970924 577471771 577500496 577486572 577678528 577350044 576714363 576109924 576026039 576331749 575958977
$$ packed form
2663.6F02922020k24457j81999n6076k86560k90489q15964m54559o33431n52978j50032
2673.3E99275475j01929P2059j49154m25530r26666m15649n08843p93915m79850j99356
2682.9E95346642J46675l69149k26135l97758l50457m88624q03986k47802o15159l34892
2692.5E91659355j07155o4544l82996p62405m00353k51846k0943n87234k21482k73323
2702.2E88587074o32324j06735m18930l75366l55225j17226n36880n96657l91045p68394
2711.8E84288292j21918k38838j67084j84822m49257m53262m25758j77842l33480J14250
2721.5E81850281j41144m04167n28336l72352j3771m93165k61573o77910n82047m04892
2731.1E77970924m99153K8725j3924J91956l28484o35681o04439q3885L05710l72772
$$ plain form
2740.8 575958977 575700340 575458145 575426254 575298119 575141678 574919319 574143143 573706512 573488655 573409653
2750.4 573409653 572882805 572357826 572307549 572216339 572062149 571729851 571669731 571290245 570619354 570394402
2760 570394402 570551643 570029144 569314613 569422340 569033432 568476830 567999687 567576828 566980782 566317596
2769.7 566317596 566441803 566714668 566800461 566092911 565557823 565114861 564219475 563854294 563406906 563010941
2779.3 563010941 562700844 562527618 562108307 561505661 561038628 560264587 559626694 559093819 558941231 558275528
2789 558275528 557542686 557400360 556889648 556382751 555696297 555054283 554306107 553847618 553577347 553097916
2798.6 553097916 552557487 551316795 550658417 550082245 549025497 548023491 547329254 547171707 546491203
2807.3 546491203 545855217 545259056 544547806 543797302 542736244 541754532 540856247 540319405 539675064
$$ packed form
2740.8E75958977k58637k42195l1891j28135j56441k22359p76176m36631k17857p9002
2750.4E73409653n26848n24979n0277r1210j54190l32298o0120l79486o70891k24952
2760E70394402J57241n22499p14531J07727l88908n56602m77143m22859n96046o63186
2769.7E66317596J24207K72865Q5793p07550n35088m42962q95386l65181m47388l95965
2779.3E63010941l10097j73226m19311o02646m67033p74041o37893n32875j52588o65703
2789E58275528p32842j42326n10712n06897o86454o42014p48176m58489k70271m79431
2798.6E53097916n40429j240692o58378n76172j056748j002006o94237j57547o80504
2807.3E46491203o35986n96161p11250p50504j061058r81712q98285n36842o44341
$$ plain form
2816 539675064 538865318 538135834 537530403 536820602 535764198 534459305 533217163 532763901 532121468
2824.7 532121468 531289368 530467300 529456253 528578606 527452316 526639633 525787544 524902954 524047737
2833.3 524047737 522867737 521828003 520976639 519942932 518354340 517156067 515845299 514080048
2841.1 514080048 512422485 510706291 508920479 506508293 504398003 502535629 500337486 497883835
2848.8 497883835 495321198 493394241 491637421 490400810 489568062 488845940 488554916 488139725 487657738
2857.4 487657738 487575302 487531853 486900330 486422539 486232834 486062050 485358124 484162750 483381348 482352676
2867.1 482352676 481326866 480407753 479678726 479056625 478043556 476964455 475532265 474584923 474133606
2875.8 474133606 473604584 473123245 472493629 471512108 470050583 468850136 467839737 466938896 466403809
$$ packed form
2816E39675064q09746p29484o05431p09801j056404j304893j242142m53262o42433
2824.7E32121468q32100q22068j011047q77647j126290q12683q52089q84590q55217
2833.3E24047737j180000j039734q51364j033707j588592j198273j310768j765251
2841.1E14080048j657563j716194j785812k412186k110290j862374k198143k453651
2848.8D97883835k562637j926957j756820j236611q32748p22122k91024m15191m81987
2857.4D87657738q2436m3449o31523m77791j89705j70784p03926j195374p81402j028672
2867.1D82352676j025810r19113p29027o22101j013069j079101j432190r47342m51317
2875.8D74133606n29022m81339o29616r81521j461525j200447j010399r00841n35087
$$ plain form
2884.4 466403809 465896606 464779739 463515282 462949066 461852646 460214272 458861504 457842865 457009468
2893.1 457009468 456143303 455274773 454466896 454026794 453356209 452201958 450969353 450225182 449609070
2901.8 449609070 448904915 448379555 447125702 446174469 445491714 444525909 443407478 442001228 441241264
2910.5 441241264 439825974 437899818 436541748 435377960 433929901 431997643 430656013 429405251
2918.2 429405251 427923813 426489487 424923782 423238907 422121010 421754456 420863037 420079842 420026779
2926.9 420026779 420578156 420922546 420638390 420470657 420519943 420936890 421096840 421575317 422164726 422183342
2936.5 422183342 422649689 423406982 424142342 424974327 426105537 426910248 427642479 428476486 428925285
2945.2 428925285 429549866 429953957 430616798 431777229 432831535 433392563 433949203 434678230 434493561
$$ packed form
2884.4D66403809n07203j116867j264457n66216j096420j638374j352768j018639q33397
2893.1D57009468q66165q68530q07877m40102o70585j154251j232605p44171o16112
2901.8D49609070p04155n25360j253853r51233o82755r65805j118431j406250p59964
2910.5D41241264j415290j926156j358070j163788j448059j932258j341630j250762
2918.2D29405251j481438j434326j565705j684875j117897l66554q91419p83195n3063
2926.9D20026779N51377L44390k84156j67733M9286M16947J59950M78477N89409J8616
2936.5D22183342M66347P57293P35360Q31985J131210Q04711P32231Q34007M48799
2945.2D28925285O24581M04091O62841J160431J054306N61028N56640P29027j84669
$$ plain form
2953.9 434493561 434856606 435753021 435993118 436220703 436826820 437795677 438752174 439545288 439800911 439903030
2963.5 439903030 440180473 440912743 441836128 442225685 442617874 443314629 444348717 445057335 445802498
2972.2 445802498 446483803 446900902 447645912 447845421 448304596 449020119 449785271 450587349 450718803 451261559
2981.8 451261559 451776466 451972122 452328491 452617836 453028793 453283119 452968597 452801094 453130569 453448486
2991.5 453448486 453479233 452842102 452695618 452823296 452702980 452790337 452167282 451609612 450927696 450367279
3001.1 450367279 450237808 449706688 449635925 449433861 448766594 447667618 446545410 446123924 445883484
3009.8 445883484 445592232 445091553 444309502 443209763 442727127 442572670 441745377 440551262 439745064
3018.5 439745064 439574089 438807182 437922363 437152824 436188164 435156403 433730240 432972794 432493744
$$ packed form
2953.9D34493561L63045Q96415K40097K27585O06117R68857R56497P93114K55623J02119
2963.5D39903030K77443P32270R23385L89557L92189O96755J034088P08618P45163
2972.2D45802498O81305M17099P45010J99509M59175P15523P65152Q02078J31454N42756
2981.8D51261559N14907J95656L56369K89345M10957K54326l14522j67503L29475L17917
2991.5D53448486L0747o37131j46484J27678j20316Q7357o23055n57670o81916n60417
3001.1D50367279j29471n31120p0763k02064o67267j098976j122208m21486k40440
3009.8D45883484k91252n00679p82051j099739m82636j54457q27293j194115q06198
3018.5D39745064j70975p66907q84819p69539r64660j031761j426163p57446m79050
$$ plain form
3027.2 432493744 431840477 431282730 430238991 429186058 428691063 428022881 426812706 425744400 424964066
3035.9 424964066 424019775 422605629 421744690 421313858 420076370 418888054 418029556 417036972 416076927
3044.5 416076927 415347633 414369469 413454628 412633286 411261597 410406189 409680862 408992538 408311958
3053.2 408311958 406967506 405903244 405082932 404373589 403657455 402708626 401561966 400506439 399707832
3061.9 399707832 398869591 398117981 397160873 396289101 395369835 394458656 393801765 392701683 391719475
3070.6 391719475 391186371 390575180 389736595 389242439 388845558 388090096 387103271 385858688 385072479
3079.2 385072479 384709740 384139023 382963066 382168236 381995354 381187744 380101089 379204559 378778229
3087.9 378778229 378357620 377775154 376747780 375269508 374440956 373864899 373521423 372692223 371664810
$$ packed form
3027.2D32493744o53267n57747j043739j052933m94995o68182j210175j068306p80334
3035.9D24964066r44291j414146q60939m30832j237488j188316q58498r92584r60045
3044.5D16076927p29294r78164r14841q21342j371689q55408p25327o88324o80580
3053.2D08311958j344452j064262q20312p09343p16134r48829j146660j055527p98607
3061.9C99707832q38241p51610r57108q71772r19266r11179o56891j100082r82208
3070.6C91719475n33104o11191q38585m94156l96881p55462r86825j244583p86209
3079.2C85072479l62739n70717j175957p94830j72882q07610j086655q96530m26330
3087.9C78778229m20609n82466j027374j478272q28552n76057l43476q29200j027413
$$ plain form
3096.6 371664810 371449890 371075211 370407791 369664307 368831444 367634964 366735229 365784111 364696732
3105.3 364696732 364016304 362969704 362363815 361555672 360535164 360042152 359235992 358506012 358002853
3114 358002853 357313118 356276703 355712166 355029221 354066353 353415604 352325401 351309662 350502396
3122.6 350502396 349966011 349105148 347865067 346750259 345704117 345287209 344523811 343507080 342796211
3131.3 342796211 342131233 340941124 339598732 339400787 339214058 338431511 337301445 336319427 335326996
3140 335326996 334443970 334161758 333039970 331668854 330865669 330299072 329455261 328336983 327523041
3148.7 327523041 326769600 326362190 325597343 324421349 323511162 322888947 322062111 320708580 319531784
3157.4 319531784 318627548 318443184 317701836 316114349 315259228 314605942 313828030 312751980 311674385
$$ packed form
3096.6C71664810k14920l74679o67420p43484q32863j196480q99735r51118j087379
3105.3C64696732o80428j046600o05889q08143j020508m93012q06160p29980n03159
3114C58002853o89735j036415n64537o82945r62868o50749j090203j015739q07266
3122.6C50502396n36385q60863j240081j114808j046142m16908p63398j016731p10869
3131.3C42796211o64978j190109j342392j97945j86729p82547j130066r82018r92431
3140C35326996q83026k82212j121788j371116q03185n66597q43811j118278q13942
3148.7C27523041p53441m07410p64847j175994r10187o22215q26836j353531j176796
3157.4C19531784r04236j84364p41348j587487q55121o53286p77912j076050j077595
$$ plain form
3166 311674385 311021976 310668640 309831123 308475037 307531891 306930714 306566315 305586720 304282837 303540440
3175.7 303540440 303273697 302646255 301415863 300488300 299306908 298467083 297589016 296553230 295997448
3184.4 295997448 295018864 294338284 293756561 293274040 292422142 291382828 290943966 290025806 289271984
3193 289271984 288318901 287188435 286306553 285576401 285029678 283882980 283268070 283210983 282952538 282240047
3202.7 282240047 281307526 280640526 280003319 279336281 278581219 278480415 277887745 276744385 276356602
3211.4 276356602 275892620 275310535 274389095 273820133 273450508 272475338 271699467 271345043 271220913 270511761
3221 270511761 269756603 269471703 268780842 267758083 267097263 266648102 265805645 265227108 264877872 264439220
3230.7 264439220 264195442 263519726 262389736 261779671 261702137 261264095 260525379 260075512 259835529 259143600
$$ packed form
3166C11674385o52409l53336q37517j356086r43146o01177l64399r79595j303883p42397
3175.7C03540440k66743o27442j230392r27563j181392q39825q78067j035786n55782
3184.4B95997448r78584o80580n81723m82521q51898j039314m38862r18160p53822
3193B89271984r53083j130466q81882p30152n46723j146698o14910n7087k58445p12491
3202.7B82240047r32521o67000o37207o67038p55062j00804n92670j143360l87783
3211.4B76356602m63982n82085r21440n68962l69625r75170p75871l54424j24130p09152
3221B70511761p55158k84900o90861j022759o60820m49161q42457n78537l49236m38652
3230.7B64439220k43778o75716j129990o10065p7534m38042p38716m49867k39983o91929
$$ plain form
3240.3 259143600 258154545 257612534 257445908 257378635 257138443 256534653 255469437 254908485 254780750 254055920
3249.9 254055920 253571701 253181019 252736244 252448082 252149830 251792355 250609169 249368362 249017735
3258.6 249017735 249199104 248917999 247969112 247655888 247560139 247002773 246471272 245885162 245308113 244835567
3268.3 244835567 244308910 243829536 243295460 243034649 243132725 243139324 243116226 242581081 241729870 241208019
3277.9 241208019 240894585 240367641 239519043 239360332 239247971 238665123 238221569 237649727 237463341 237496204
3287.5 237496204 237223816 236933289 236749134 236369476 235609837 235058193 234744682 234385929 234005642 233694725
3297.2 233694725 233551922 233474884 233184853 232746353 232387905 231850624 231556759 231336060 230644646 230311050
3306.8 230311050 230141201 229677658 229327641 228725662 228056622 227981415 228028088 227648087 227082500 227011051
$$ packed form
3240.3B59143600r89055n42011j66626o7273k40192o03790j065216n60952j27735p24830
3249.9B54055920m84219l90682m44775k88162k98252l57475j183186j240807l50627
3258.6B49017735J81369k81105r48887l13224r5749n57366n31501n86110n77049m72546
3268.3B44835567n26657m79374n34076k60811R8076O599k3098n35145q51211n21851
3277.9B41208019l13434n26944q48598j58711j12361n82848m43554n71842j86386L2863
3287.5B37496204k72388k90527j84155l79658p59639n51644l13511l58753l80287l10917
3297.2B33694725j42803p7038k90031m38500l58448n37281k93865k20699o91414l33596
3306.8B30311050j69849m63543l50017o01979o69040p5207M6673l80001n65587p1449
$$ plain form
3316.5 227011051 226888485 225853691 224821301 224461231 224788551 224935360 224266758 223400497 222558155
3325.2 222558155 222061806 221434002 220548820 220031185 219823933 219548130 218689537 218251362 218181419 217549496
3334.8 217549496 216894875 216105003 215187225 214559040 214264355 213951206 213580971 213249722 212644711 212056637
3344.4 212056637 211500435 211055679 210645332 210321255 210351467 209898224 209170017 208706398 208514881 208431396
3354.1 208431396 207828979 207195854 206860123 206970882 207260513 206885281 206703510 206639099 206182766 205868473
3363.7 205868473 205461559 205195599 205085793 205008831 204696350 204049854 203899403 203858585 203655796 203505459
3373.4 203505459 203375282 203155346 202882977 202910023 202874928 202834930 202655811 202313976 202110672 201740742
3383 201740742 201369457 201252346 201623707 201963768 202104130 202159786 201872902 201655025 201495533 201078377
$$ packed form
3316.5B27011051j22566j034794j032390l60070L27320J46809o68602q66261q42342
3325.2B22558155m96349o27804q85182n17635k07252k75803q58593m38175o9943o31923
3334.8B17549496o54621p89872r17778o28185k94685l13149l70235l31249o05011n88074
3344.4B12056637n56202m44756m10347l24077L0212m53243p28207m63619j91517q3485
3354.1B08431396o02417o33125l35731J10759K89631l75232j81771o4411m56333l14293
3363.7B05868473m06914k65960j09806p6962l12481o46496j50451m0818k02789j50337
3373.4B03505459j30177k19936k72369K7046l5095l9998j79119l41835k03304l69930
3383B01740742l71285j17111L71361L40061J40362N5656k86884k17877j59492m17156
$$ plain form
3392.7 201078377 200462341 200629025 200926991 200898533 201181259 200875530 200908012 201061440 200629368 200426540
3402.3 200426540 200352592 200770836 201008186 200667839 200233803 200265999 200760994 201092720 201296539 201116142
3412 201116142 200985184 200813847 200764790 201206284 201511421 201600361 201447048 201560040 201781731 202208157
3421.6 202208157 202990761 203452911 203512974 203404026 203785248 204139786 204142323 204219494 204906082 205746193
3431.2 205746193 205966816 206414261 206816845 207202454 207145290 207107525 207739868 207812653 207745781 207558689
3440.9 207558689 208213730 209403782 209935417 210602264 211095810 211864948 211987324 211973381 212808228 213527279
3450.5 213527279 214264221 214953251 215366478 215411396 216020107 216733932 217282314 217874413 218124409 219050083
3460.2 219050083 219497280 219742832 220586662 221549435 222635365 223350964 224253139 224755898 225117187
$$ packed form
3392.7B01078377o16036J66684K97966k8458K82726l05729L2482J53428m32072k02828
3402.3B00426540p3948M18244K37350l40347m34036L2196M94995L31726K03819j80397
3412B01116142j30958j71337m9057M41494L05137Q8940j53313J12992K21691M26426
3421.6B02208157P82604M62150O0063j08948L81222L54538K537P7171O86588Q40111
3431.2B05746193K20623M47445M02584L85609n7164l7765O32343P2785o6872j87092
3440.9B07558689O55041J190052N31635O66847M93546P69138J22376j3943Q34847P19051
3450.5B13527279P36942O89030M13227M4918O08711P13825N48382N92099K49996R25674
3460.2B19050083M47197K45552Q43830R62773J085930P15599R02175N02759L61289
$$ plain form
3468.8 225117187 225508118 226368542 228022747 228756905 229267883 229863586 230777397 231703529 232159328
3477.5 232159328 233132648 234074783 235063629 235978546 236521683 237075806 238073788 239327641 240309486
3486.2 240309486 241424942 242023258 242222958 242893333 244276905 245896416 246716938 247087269 247917557
3494.9 247917557 249263344 250004978 250724831 251752148 252735538 253984394 255134983 256611004 257602997
3503.6 257602997 257853718 258785095 260000172 260624523 261370354 262741375 264111996 265856438 267026215
3512.2 267026215 267559738 268185711 269140282 270715370 271861935 273200169 274416771 275252991 276613369
3520.9 276613369 278030968 279358597 280111694 281448288 283404179 284471817 284622059 284992199 286542244
3529.6 286542244 288803082 290499706 291459770 292476673 293596840 295659676 297250233 297692127 299300518
$$ packed form
3468.8B25117187L90931Q60424J654205P34158N10978N95703R13811R26132M55799
3477.5B32159328R73320R42135R88846R14917N43137N54123R97982J253853R81845
3486.2B40309486J115456N98316J99700O70375J383572J619511Q20522L70331Q30288
3494.9B47917557J345787P41634P19853J027317R83390J248856J150589J476021R91993
3503.6B57602997K50721R31377J215077O24351P45831J371021J370621J744442J169777
3512.2B67026215N33523O25973R54571J575088J146565J338234J216602Q36220J360378
3520.9B76613369J417599J327629P53097J336594J955891J067638J50242L70140J550045
3529.6B86542244K260838J696624R60064J016903J120167K062836J590557M41894J608391
$$ plain form
3538.3 299300518 300930023 302174072 303377781 305256767 307365322 308800640 309663506 310610924 312838326
3547 312838326 313911819 315567169 317804794 319975986 322211418 321860847 323161011 325407372 327803040
3555.6 327803040 330423203 331493912 333439789 335315247 336482124 338074493 340606384 341586380
3563.4 341586380 342737885 346553802 347497826 350017281 351199303 351060905 354614716 357115479 359617386
3572 359617386 361804581 363901405 365890541 368009834 370452576 371413460 373852959 376210594 378322601
3580.7 378322601 380620537 382487335 384627609 386818886 391403847 393802681 393789902 396356544 396715355
3589.4 396715355 399519882 402713776 405716476 407647285 409248772 412642479 413579597 416852646
3597.1 416852646 420346413 421932793 425727119 427767067 429307671 431803017 434243927 437418747
$$ packed form
3538.3B99300518J629505J244049J203709J878986K108555J435318Q62866R47418K227402
3547C12838326J073493J655350K237625K171192K235432l50571J300164K246361K395668
3555.6C27803040K620163J070709J945877J875458J166877J592369K531891R79996
3563.4C41586380J151505L815917R44024K519455J182022j38398L553811K500763K501907
3572C59617386K187195K096824J989136K119293K442742R60884K439499K357635K112007
3580.7C78322601K297936J866798K140274K191277M584961K398834j2779K566642L58811
3589.4C96715355K804527L193894L002700J930809J601487L393707R37118L273049
3597.1D16852646L493767J586380L794326K039948J540604K495346K440910L174820
$$ plain form
3604.8 437418747 440901146 443771095 444151535 448099403 449747810 451075745 458699265 460496292
3612.5 460496292 459695702 464112129 465094376 470243950 475051270 476299400 479304619 480771675 482998695
3621.2 482998695 485831108 488779564 492034340 495850677 499377708 502162590 507635002 508196297
3628.9 508196297 503342247 508720627 514054756 519976883 522795334 523073807 527187500 531418419
3636.6 531418419 534306946 536525993 539174118 542221794 545942230 548528900 549847527 553285980
3644.4 553285980 558241043 565038795 566224365 564174385 570596771 572056198 570205612 571027985
3652.1 571027985 577423897 582641335 586689682 591807671 586347237 589564972 595498352 597789726
3659.8 597789726 600691185 602474442 605586700 607034225 608766060 611456337 612827644 617579422
$$ packed form
3604.8D37418747L482399K869949L80440L947868J648407J327935P623520J797027
3612.5D60496292q00590M416427R82247N149574M807320J248130L005219J467056K227020
3621.2D82998695K832413K948456L254776L816337L527031K784882N472412N61295
3628.9E08196297m854050N378380N334129N922127K818451K78473M113693M230919
3636.6E31418419K888527K219047K648125L047676L720436K586670J318627L438453
3644.4E53285980M955063O797752J185570k049980O422386J459427j850586Q22373
3652.1E71027985O395912N217438M048347N117989n460434L217735N933380K291374
3659.8E97789726K901459J783257L112258J447525J731835K690277J371307M751778
$$ plain form
3667.5 617579422 620671463 621414795 622370911 616236458 619578819 629283333 639820442 639569626 621519127
3676.2 621519127 624398155 633113518 638673363 636916924 637531013 640685959 643021164 644619217
3683.9 644619217 645728683 646658096 650814209 657605896 648922882 647125473 655417099 648622742
3691.6 648622742 649117889 655295563 656873322 658591461 658965530 659067764 660676346 661316452 664361267
3700.3 664361267 667402191 661895370 660699997 665974960 667780762 667366333 667577133 671018295 675241013
3709 675241013 668190918 671752625 676492233 664397354 669091034 673494110 673430710 674220200 676626282
3717.7 676626282 678735428 675771713 676373291 682686768 679946976 674678192 679122162 680471725
3725.4 680471725 680654297 678254166 677783585 681358414 683320847 690215530 687927246 678900757 687291183
$$ packed form
3667.5F17579422L092041P43332R56116o134453L342361R704514J0537109k50816j8050499
3676.2F21519127K879028Q715363N559845j756439O14089L154946K335205J598053
3683.9F44619217J109466R29413M156113O791687q683014j797409Q291626o794357
3691.6F48622742M95147O177674J577759J718139L74069J02234J608582O40106L044815
3700.3F64361267L040924n506821j195373N274963J805802m14429K10800L441162M222718
3709F75241013p050095L561707M739608j2094879M693680M403076o3400P89490K406082
3717.7F76626282K109146k963715O01578O313477k739792n268784M443970J349563
3725.4F80471725J82572k400131m70581L574829J962433O894683k288284r026489Q390426
$$ plain form
3734 687291183 688393097 679238205 678855820 682262344 684081345 686349258 689175186 684981308 688630447
3742.7 688630447 701898727 691928253 673988419 684436111 691490021 697464066 692375031 682698212
3750.4 682698212 694627609 688829269 681230545 688024368 692936172 695481262 690223312 693202133
3758.2 693202133 698633575 690298233 689555130 693883896 694814606 694987411 698413391 696575470 692815094
3766.8 692815094 696347351 701101303 701346588 692569351 694491119 697970123 698008804 698367310 697935486
3775.5 697935486 699179840 699579468 702285767 702510452 694983292 697602081 699530334 700895233 703444138
3784.2 703444138 700026474 699492035 701515808 701766281 701431503 701610489 702395248 702436523 702834091
3792.9 702834091 702585526 703866653 706768265 702286072 697808762 700255814 705311813 711071243
$$ packed form
3734F87291183J101914r154892l82385L406524J819001K267913K825928m193878L649139
3742.7F88630447J3268280r970474j7939834J0447692P053910N974045n089035r676819
3750.4F82698212J1929397n798340p598724O793823M911804K545090n257950K978821
3758.2F93202133N431442q335342p43103M328766R30710J72805L425980j837921l760376
3766.8F92815094L532257M753952K45285q777237J921768L479004L8681L58506m31824
3775.5F97935486J244354L99628K706299K24685p527160K618789J928253J364899K548905
3784.2G03444138l417664n34439K023773K50473l34778J78986P84759M1275L97568
3792.9G02834091k48565J281127K901612m482193m477310K447052N055999N759430
$$ plain form
3800.6 711071243 702834015 693791733 698285599 701480255 706974106 712054672 701881790 698620529
3808.3 698620529 703488235 705301437 705388947 705757523 705909958 707416840 712762680 708972549 694330292
3817 694330292 700547943 706728592 711242294 713657761 695807800 697243423 703482666 706352844
3824.7 706352844 709494095 709543533 705151062 705693665 707908859 710759583 711900101 703326416 705742035
3833.4 705742035 712590332 706543732 706911926 716082993 708879318 702762299 708160629 703160324
3841.1 703160324 704218445 711863403 709716873 705537643 708043213 708970261 709218063 711298218 710378113
3849.8 710378113 712761841 719748306 714760818 713987198 698530197 699571915 709605103 707890930
3857.5 707890930 705604706 707882538 711014862 714127502 708361282 708782043 715639496 709846802
$$ packed form
3800.6G11071243q237228r042282M493866L194656N493851N080566j0172882l261261
3808.3F98620529M867706J813202Q7510L68576J52435J506882N345840l790131j4642257
3817F94330292O217651O180649M513702K415467j7849961J435623O239243K870178
3824.7G06352844L141251M9438m392471N42603K215194K850724J140518q573685K415619
3833.4G05742035O848297o046600L68194R171067p203675o117019N398330n000305
3841.1G03160324J058121P644958k146530m179230K505570R27048K47802K080155r20105
3849.8G10378113K383728O986465m987488p73620j5457001J041718J0033188j714173
3857.5G07890930k286224K277832L132324L112640n766220M20761O857453n792694
$$ plain form
3865.2 709846802 703689346 706611404 712031403 719213638 712871475 702258224 705747986 712612610
3872.9 712612610 715245819 704455566 705361710 709305038 709900208 712776947 716731491 710133667
3880.6 710133667 703494263 710178528 711624451 712916870 717029495 703319702 705288239 709926147
3888.3 709926147 710633392 715297089 714561691 705461349 706940079 710466156 708713226 709771423 711380386
3897 711380386 713841324 716199951 707102051 711347809 713357086 708402100 712834320 709168243 707873764
3905.7 707873764 709228516 710090332 712004929 711484299 711314621 711222610 711126633 711139603 711110687 711831665
3915.3 711831665 713523788 710873489 707482681 711765823 712004929 708471603 710909653 713132172
3923.1 713132172 713816452 710845795 707959976 709487686 711534805 713127747 710951614 709751282
$$ packed form
3865.2G09846802o157456K922058N419999P182235o342163j0613251L489762O864624
3872.9G12612610K633209j0790253R06144L943328N95170K876739L954544o597824
3880.6G10133667o639404O684265J445923J292419M112625j3709793J968537M637908
3888.3G09926147P07245M663697p35398r100342J478730L526077j752930J058197J608963
3897G11380386K460938K358627r097900M245758K009277m954986M432220l666077j294479
3905.7G07873764J354752Q61816J914597n20630j69678r2011r5977J2970k8916P20978
3915.3G11831665J692123k650299l390808M283142K39106l533326K438050K222519
3923.1G13132172O84280k970657k885819J527710K047119J592942k176133j200332
$$ plain form
3930.8 709751282 712982101 711896744 710137558 710777130 710346832 710723419 710709229 710388718 710765533
3939.5 710765533 710355530 711639252 713096237 709562225 708377457 709887390 710577545 710716782 709228668
3948.1 709228668 710266495 710434952 708810196 710622330 711067276 710857468 710955658 710455246 710349655
3956.8 710349655 710243988 710858536 710600815 711768188 713032074 711351471 710666885 710884018 710558701
3965.5 710558701 709815598 709832916 710204315 710605011 711151276 711199341 710724564 709994888 710332947 710262527
3975.1 710262527 710099030 710607224 710789490 711392899 711908722 711886292 711676559 711517944 710655212 710466003
3984.8 710466003 710965500 710973206 711493149 711576233 711937256 711753998 710924225 710744476 710681000 711351929
3994.4 711351929 711199722 710872040 711132736 711543579 711895447 711244736
$$ packed form
3930.8G09751282L230819j085357j759186O39572m30298L76587j4190l20511L76815
3939.5G10765533m10003J283722J456985l534012j184768J509933O90155J39237j488114
3948.1G09228668J037827J68457j624756J812134M44946k09808R8190n00412j05591
3956.8G10349655j05667O14548k57721J167373J263886j680603o84586K17133l25317
3965.5G10558701p43103J7318L71399M00696N46265M8065m74777p29676L38059p0420
3975.1G10262527j63497N08194J82266O03409N15823k2430k09733j58615q62732j89209
3984.8G10466003M99497P706N19943Q3084L61023j83258q29773j79749o3476O70929
3994.4G11351929j52207l27682K60696M10843L51868o50711
$$ plain form
4000.2 711244736
$$ packed form
4000.2G11244736
##END=$$ End of the data block
