##TITLE=$$ Begin of the data block
##JCAMP-DX=5.00 $$ ACD/SpecManager v 10.08
##SPECTROMETER/DATA SYSTEM=Varian
##DATE=08 Jan 2013 15:50:36
##DATA TYPE=INFRARED SPECTRUM
##DATA CLASS=XYDATA
##ORIGIN=
##OWNER=
##NPOINTS=3735
##FIRSTX=399.26403809
##LASTX=4000.35498047
##MAXX=4000.35498047
##MINX=399.26403809
##MAXY=75.46961212
##MINY=20.03033447
##XFACTOR=1.0000000000
##YFACTOR=0.000000100000000
##FIRSTY=43.35309982
##DELTAX=0.96440572
##XUNITS=1/CM
##YUNITS=TRANSMITTANCE
##XYDATA=(X++(Y..Y))
399.3D33530998O194420Q271370N427475K98538O3095o945114o848945R2620j51825
407.9D39932632k213249l904495M486160N871582Q82912p45773j852417k433129o928749
416.6D33095474q757591p773056J2553711R212723k216988k547340O17256k949715
424.3D31234474m635124M237595O196327L902283k508622l706474K568626K60239k971535
433D34577789m969330j133956K713089P83615K136O45637K689400r89303k920380o037026
442.7D25361671l297538R003372M813881J34048r56535m827652j666298L332138J983833
451.3D33880920l050270m042167J936302L590736q41903Q14819M458618n533981k760544
460D28452530K13470k637367J499596J497993l869133j515770l663978k335434R06906
$$ y = [433530998, 439725418, 447996788, 453424263, 453722801, 453785896, 446840782, 439991837, 440084457, 439932632, 437719383, 433814888, 438301048, 444172630, 445055542, 444309769, 442457352, 440024223, 433095474, 424337883, 416564827, 429118538, 438331261, 436114273, 433566933, 434184189, 431234474, 426599350, 430836945, 437033272, 440935555, 438426933, 434720459, 437289085, 437549324, 434577789, 429608459, 428474503, 431187592, 431971207, 431973343, 432618980, 435308380, 434319077, 431398697, 425361671, 422064133, 431067505, 435881386, 436015434, 435058899, 430231247, 428564949, 431897087, 433880920, 430830650, 426788483, 428724785, 432315521, 431473618, 432288437, 436747055, 431213074, 428452530, 428666000, 426028633, 427528229, 429026222, 425157089, 423641319, 419977341, 417641907, 418548813]
468.7D18548813k456780M053574P112274p55234o153335m80805J053887j070786q68110
477.4D18983498j855240j172638k924500j969795L543434K567940l190346j886596
485.1D12095757J147575k623367j22490m9935m463K311058k990227o75430r3269k91558
494.7D08703651N02282j277161M640427J614074n120392k581024j626320K9831L222084
503.4D08107452N82581k38037K11487j524887j216927k712212k427597o22749L35693
512.1D00494804M09127o24276K087403N08423j467972k834397l281974Q29658n21354
520.8C95599442o46859q4839l36151J236840J32293j776924j618194M9057O77147J056709
530.4C94288521J273384M90494l99781j218261M96216j46561j531449r21402j302108
$$ y = [418548813, 416092033, 420145607, 427257881, 426502647, 420349312, 419868507, 420922394, 419851608, 418983498, 417128258, 415955620, 413031120, 411061325, 414604759, 417172699, 413982353, 412095757, 413243332, 410619965, 410497475, 410447540, 410443077, 412754135, 409763908, 409088478, 408995209, 408703651, 409205933, 407928772, 412569199, 414183273, 409062881, 406481857, 404855537, 404885368, 408107452, 408690033, 408451996, 408663483, 407138596, 405921669, 403209457, 400781860, 400159111, 400494804, 400903931, 400279655, 402367058, 402875481, 401407509, 398573112, 395291138, 396120796, 395599442, 394952583, 394867744, 394531593, 395768433, 395900726, 394123802, 392505608, 392554665, 393231812, 394288521, 395561905, 396052399, 395652618, 394434357, 394930573, 394784012, 393252563, 392331161, 391029053]
539.1C91029053n59883J337738J937523p36161k801628j792946j338005j856308R1057
547.8C85310440K125359K377548J752663j764374l552704k559128j068458P90367R37004
556.5C84348717R96246P28226n57556j786538j221389m66423j226082O06956J253434
565.1C82675591J63154J298332R61495o65474p51686m42581k539216j998710J000290
573.8C79701195P23686N32951M32740j233826j016922L17535o37550j812973l74565
582.5C76632271Q11539K172431J734276J8769p0000q63876o257P10412K89382M56963
592.1C81885910Q56972J889457J73913j034432p88994p70912k08321j09901J318169
600.8C83211861R67979O95686J66169k223168j998863j216393j93634j9073l16811
$$ y = [391029053, 390469170, 391806908, 393744431, 393008270, 390206642, 388413696, 387075691, 385219383, 385310440, 387435799, 389813347, 391566010, 389801636, 386248932, 383689804, 382621346, 383411713, 384348717, 385344963, 386073189, 385515633, 383729095, 382507706, 382041283, 380815201, 381422157, 382675591, 382838745, 384137077, 385098572, 384433098, 383681412, 383238831, 380699615, 378700905, 379701195, 380424881, 380957832, 381390572, 380156746, 379139824, 379457359, 378819809, 377006836, 376632271, 377443810, 379616241, 381350517, 381369286, 381299286, 380435410, 380429153, 381139565, 381428947, 381885910, 382742882, 384632339, 384806252, 383771820, 382982826, 382211914, 382003593, 381893692, 383211861, 384179840, 384875526, 385041695, 382818527, 380819664, 379603271, 379409637, 379390564, 379073753]
609.5C79073753P83692J037254O7330j249695n13954j109887k124214r56993N82466
618.2C75589752K493439J175537N9242K31972k78397k04277J06659J598130J913261
626.9C82685318K171478K753907J275749J63879K72980m02908J75132K733879K316895
635.5C94146309J519165L017082K466278Q45337l11432r08699Q7395J540337K154769
644.2D04556541K378350L522682K157021j262284r87739J33400k25907k47879N44434
652.9D10568619J930008L436012K543602n65758j729965j510582o71844m81530M273
661.6D13522835J487427J000137O25648Q98018J260414K99874r200783J274834M197006
670.3D15365410L178406K051468J074485Q37250K23503j92947k04849J57928R75990
$$ y = [379073753, 379857445, 380894699, 380962029, 379712334, 379198380, 378088493, 375964279, 375007286, 375589752, 378083191, 379258728, 379317970, 379549942, 379271545, 379067268, 379173927, 380772057, 382685318, 384856796, 387610703, 388886452, 389050331, 389323311, 388920403, 389095535, 391829414, 394146309, 395665474, 398682556, 401148834, 401994171, 401682739, 400774040, 400861435, 402401772, 404556541, 406934891, 410457573, 412614594, 411352310, 410364571, 410497971, 410272064, 410024185, 410568619, 412498627, 415934639, 418478241, 417912483, 416182518, 414671936, 414000092, 413518562, 413522835, 415010262, 416010399, 416636047, 417534065, 418794479, 419094353, 409893570, 411168404, 415365410, 418543816, 420595284, 421669769, 422507019, 422730522, 422537575, 422332726, 422490654, 423466644]
678.9D23466644J933022K796593K777442K215310J409416J81312l13453K28805J391297
687.6D36086388K289047J506042J615219J520653N01824M40864m89082o01540r7046
696.3D42772369J554833K865524J269722R08470Q12569l7918k93427L51487L83682
705D50587311J47095J604614K217827K185249J604767L3912j439819q65707J200256
713.7D57275505J664848J735382J861420J727677N73539m67643o86722k99874Q19550
722.3D64203682J254082K485809K353630J321411N83077l38478l5859N14069J136322
731D73477745M03976J293335J935349J645775J540375p33300n21660p04574k04315
739.7D78132706J107406J217118K152671J693879J119499o25992j4648K78320o82373
$$ y = [423466644, 425399666, 428196259, 430973701, 433189011, 434598427, 434779739, 434466286, 434695091, 436086388, 438375435, 439881477, 441496696, 443017349, 443519173, 443960037, 443470955, 442869415, 442772369, 444327202, 447192726, 448462448, 449370918, 450183487, 450145569, 449852142, 450203629, 450587311, 450734406, 452339020, 454556847, 456742096, 458346863, 458380775, 456940956, 456075249, 457275505, 458940353, 460675735, 462537155, 464264832, 464838371, 464370728, 463684006, 463384132, 464203682, 465457764, 467943573, 470297203, 471618614, 472201691, 471863213, 471827354, 472341423, 473477745, 473881721, 475175056, 477110405, 478756180, 480296555, 479563255, 479041595, 478337021, 478132706, 479240112, 480457230, 482609901, 484303780, 485423279, 484797287, 484782639, 485060959, 484378586]
748.4D84378586N02281P83958L253365K983932M93622m54483q07724n92766o07032
757.1D89933739J602096K275620K566948K615890J769600J193237p5454m97742j453361
765.7D99930573M15992K080765J937180J857338R42802K25601j646347j894417j270332
774.4E02579155K10266J184807J862602K226524K67373m96178j620445o23741p17545
783.1E04872818r38225J921196K025147K281646K093048J088295j281509k679939j338654
791.8E08043823n14793K38876Q92105K161560M53987q78868k156906l251648r34372
800.5E04053764j258316r89647q35533j662140j339950j046601k310447l950768l076668
809.1D87583694k774086k80456R94072j019783j309662j166115j610260l278007l434182
$$ y = [484378586, 484880867, 485664825, 488918190, 491902122, 492395744, 491941261, 491133537, 490540771, 489933739, 491535835, 493811455, 496378403, 498994293, 500763893, 501957130, 501881676, 501383934, 499930573, 500346565, 502427330, 504364510, 506221848, 507164650, 507390251, 505743904, 503849487, 502579155, 502789421, 503974228, 505836830, 508063354, 508330727, 507834549, 506214104, 505590363, 504872818, 503934593, 505855789, 507880936, 510162582, 512255630, 513343925, 512062416, 509382477, 508043823, 507529030, 507767906, 508660011, 510821571, 511275558, 510396690, 508239784, 504988136, 504053764, 502795448, 501805801, 500970268, 499308128, 497968178, 496921577, 494611130, 490660362, 487583694, 484809608, 484529152, 485523224, 484503441, 483193779, 482027664, 480417404, 477139397, 473705215]
817.8D73705215j876335N38483J326828J117287K666053K096634L64228J22337J842804
826.5D81903534J538086J847229M884796M857941M551811L490257K315941J958962
834.2E07348557K359085K274170J389923L212165L585778L503265K819061K477150
841.9E28969154J310883j27411J597290J688538K553787J845436K651405L802529J543503
850.6E45835114R88121M29763J312676O03294J862221L688087L285790L300819J022072
859.3E62327957M73709l55987n27230n86509J010933K444610R19724J193542o55556
868E66245193o85043j737404k993850j885148j712074M35829R37615N49698j278076
876.7E57876740k803193l855934l246574L49312P47108L87879L49960P92236J03455
$$ y = [473705215, 471828880, 472367363, 473694191, 474811478, 477477531, 479574165, 479938393, 480060730, 481903534, 483441620, 485288849, 490173645, 495031586, 499583397, 503073654, 505389595, 507348557, 509707642, 511981812, 513371735, 516583900, 520169678, 523672943, 526492004, 528969154, 530280037, 530152626, 531749916, 533438454, 535992241, 537837677, 540489082, 544291611, 545835114, 546823235, 547252998, 548565674, 549168968, 551031189, 554719276, 558005066, 561305885, 562327957, 562801666, 562445679, 561918449, 561331940, 562342873, 564787483, 565707207, 566900749, 566245193, 565560150, 563822746, 560828896, 558943748, 557231674, 557667503, 558605118, 559154816, 557876740, 555073547, 551217613, 547971039, 548320351, 549067459, 549455338, 549805298, 550597534, 550700989]
885.3E50700989n37758j445084k879524j115951n48745L78228J229209K080651J799164
894E49661179J32560k23007j763954p82929M99115J426926J328850R62372J442489
902.7E52683601k1591n7297k23960J325721K142144K630233L186989J269646J496582
911.4E64432068j92108j416626j979141k007943j689605k002869q65555j406402j181870
920E51689949l351440m744568m175492m733162l992729l480262j456032j200714k015114
928.7E22540436l320770m429970l720055m263496l054123j560059n86471j02654l68652
937.4E01134186n91164j268654j700325k207374j321068j145821m83055M17786J69525
946.1D93004036Q93555K33841r50966j803704j138649m23469m19884o9466j049385
$$ y = [550700989, 550163231, 548718147, 545838623, 544722672, 544173927, 544552155, 545781364, 547862015, 549661179, 549793739, 549570732, 547806778, 547023849, 547522964, 548949890, 550278740, 551241112, 552683601, 552662010, 552604713, 552380753, 553706474, 555848618, 558478851, 561665840, 562935486, 564432068, 564239960, 562823334, 560844193, 558836250, 557146645, 555143776, 554278221, 552871819, 551689949, 548338509, 543593941, 539418449, 534685287, 530692558, 527212296, 525756264, 524555550, 522540436, 519219666, 514789696, 511069641, 506806145, 503752022, 502191963, 501605492, 501502838, 501134186, 500543022, 499274368, 497574043, 495366669, 494045601, 492899780, 492416725, 492834511, 493004036, 493897591, 494131432, 493180466, 491376762, 490238113, 489814644, 489394760, 489325294, 488275909]
954.8D88275909j535072j872864k408714l335991l370170k605362j780854r42115j379281
963.4D69045486j621894k758789l370972l395653l026733k271500k286682j254730
971.2D49058533j683579k532196l498115m460678m368554m733657l859826l414230
978.9D20507698m248276m905929m797554n311623n770531n559616n951614n311089
986.6C78651466n099907n249252m644661m830971n576782n763092n184097m348145
994.3C37954559m600525m732551m057808l967362l859958l834801l371372m019966
1002C05510216l559876k148990k709809k246189j543197n76001j304168k445946j747303
1010.7B87228737j018829j571389l077163j705819j512603k000485j747093k404671
$$ y = [488275909, 486740837, 484867973, 482459259, 479123268, 475753098, 473147736, 471366882, 470424767, 469045486, 467423592, 464664803, 461293831, 457898178, 454871445, 452599945, 450313263, 449058533, 447374954, 444842758, 441344643, 436883965, 432515411, 427781754, 423921928, 420507698, 416259422, 411353493, 406555939, 401244316, 395473785, 389914169, 383962555, 378651466, 373551559, 368302307, 363657646, 358826675, 353249893, 347486801, 342302704, 337954559, 333354034, 328621483, 324563675, 320596313, 316736355, 312901554, 309530182, 305510216, 301950340, 299801350, 297091541, 294845352, 293302155, 292726154, 291421986, 288976040, 287228737, 286209908, 284638519, 281561356, 279855537, 278342934, 276342449, 274595356, 272190685]
1018.4B72190685l179550m121342k642135k419090k576142k630958k166024q16574
1026.1B51638870j783237k660008k728481m79279j397991k532615j316338r11655M16660
1034.8B38245926m92325N09453M79584Q00018J720715J191921K344246O17733L30276
1043.5B45747547K38056J08033M75711k20337l81755j553231j216621j199055j76010
1052.2B41822338R5425k50473l09410j200982m84886m26712J687851J805020J482868
1060.9B44221039J907539J509972K252865J595077K547474K138138K078552J569786
1068.6B59820442J090317K592125J682815O04058p7915J876220J229611k21939P73353
1077.2B69369087J162472K120094O22959P88193J061115J889019J968251M52404J496143
$$ y = [272190685, 269011135, 264889793, 262247658, 259828568, 257252426, 254621468, 252455444, 251638870, 249855633, 247195625, 244467144, 243987865, 242589874, 240057259, 238740921, 237829266, 238245926, 237753601, 238263054, 238742638, 239542656, 241263371, 242455292, 244799538, 245417271, 245747547, 245985603, 246093636, 246569347, 246349010, 245967255, 244414024, 243197403, 241998348, 241822338, 241917763, 241667290, 241357880, 240156898, 239672012, 239245300, 240933151, 242738171, 244221039, 246128578, 247638550, 249891415, 251486492, 254033966, 256172104, 258250656, 259820442, 260910759, 263502884, 265185699, 265789757, 265711842, 267588062, 268817673, 268595734, 269369087, 270531559, 272651653, 273274612, 274062805, 275123920, 277012939, 278981190, 279433594, 280929737]
1085.9B80929737J435299K846241K819595K209797J478157L20874J444072J737347
1093.6B95221119K544861J827659J846638K230187J910991K026425J458225J784801
1101.4C10850906Q94452J670284K523479K043209J667500N77526R94377J485024J280746
1110C23987503L36151Q00476Q52318K30713J506576J328545P50122J9989m13551o30150
1119.7C28768692r51881o16417J35002J411934M61387L45955Q38280Q06313J738929
1128.4C32938194J951256K256088K142105K292443K269783J967315K259598K216950
1136.1C50293732J745300J828270K181511J728096K217674K434349J301308O01501
1143.8C64331741N99633O49795K27394J03264M28848O01540N75829O50215M84085m24004
$$ y = [280929737, 282365036, 285211277, 288030872, 290240669, 291718826, 292039700, 293483772, 295221119, 297765980, 299593639, 301440277, 303670464, 305581455, 307607880, 309066105, 310850906, 311745358, 313415642, 315939121, 317982330, 319649830, 320227356, 321221733, 322706757, 323987503, 324323654, 325124130, 325976448, 326207161, 327713737, 329042282, 329792404, 329812393, 329398842, 328768692, 327816811, 327200394, 327335396, 328747330, 329208717, 329554672, 330392952, 331199265, 332938194, 334889450, 337145538, 339287643, 341580086, 343849869, 345817184, 348076782, 350293732, 352039032, 353867302, 356048813, 357776909, 359994583, 362428932, 363730240, 364331741, 364931374, 365581169, 365808563, 365911827, 366340675, 366942215, 367518044, 368168259, 368652344, 368228340]
1153.4C68228340j163101p50389r0523l69987k39029j25275p98988q93364o06003M9210
1163.1C63240891K02140L88260J402588K276383K424888K174683K762298K457657K262993
1171.8C79592781K793427K672691K673225L068276K803268K184677K601853K691841
1179.5D01082039K123985J574516J352768J251450J516571J693077J670532J345063
1187.2D13610001J87225n6267n05409n73883l52020o61164m72145k63710j78871j297417
1196.8D09436340k154884k109032j712494j269493j565208j205902n53971n98640j167030
1205.5C97099686j616097j709289j650277o70204n1574q1559M85764L75061j85280
1214.2C91996231j42975j38778m56696r2926N56183O60858Q32100P85103J31874n40466
$$ y = [368228340, 367065239, 366314850, 366224327, 365854340, 365615311, 365490036, 364691048, 363797684, 363191681, 363240891, 363443031, 363831291, 365233879, 367510262, 369935150, 372109833, 374872131, 377329788, 379592781, 382386208, 385058899, 387732124, 390800400, 393603668, 395788345, 398390198, 401082039, 403206024, 404780540, 406133308, 407384758, 408901329, 410594406, 412264938, 413610001, 413797226, 413740959, 413235550, 412661667, 412309647, 411648483, 411176338, 410912628, 410733757, 409436340, 407281456, 405172424, 403459930, 402190437, 400625229, 399419327, 398865356, 398266716, 397099686, 395483589, 393774300, 392124023, 391453819, 391402245, 391320686, 391806450, 392181511, 391996231, 391853256, 391714478, 391257782, 391164856, 391721039, 392381897, 393213997, 393999100, 394130974, 393590508]
1223.8C93590508q11577r76105m85878p4310k39640k87246o22979n54695p78923j368484
1233.5C87390671j066780q53691p08390n34515J45225N75181k36550n95627q10547
1242.2C83304977q65593j012039r11979k27280l99666k27623k3498k16675n48516r18808
1251.8C77953300q40301q20541l65258K91176N10750j39580m06532m10194p25899M8103
1261.4C75095024L51448J69335K92663P45201R77745Q41561Q62274N41878L36685L65600
1271.1C80579414Q63762J176605J341057J642876J433372J164475R36394R36393R23882
1279.8C90998230J300659J803131K024689K325668K222100J670417J325150J170120
1287.5D04840164Q57315J441269J759758J287689J559525J900177J070900O05621R34334
$$ y = [393590508, 392778931, 391802826, 391316948, 391242638, 391002998, 390715752, 390092773, 389538078, 388759155, 387390671, 386323891, 385470200, 384761810, 384227295, 384372520, 384947701, 384711151, 384115524, 383304977, 382439384, 381427345, 380515366, 380288086, 379888420, 379660797, 379637299, 379420624, 378872108, 377953300, 377112999, 376292458, 375927200, 376218376, 376729126, 376589546, 376183014, 375772820, 375046921, 375095024, 375446472, 375615807, 375908470, 376653671, 377631416, 378472977, 379335251, 379877129, 380213814, 380579414, 381443176, 382619781, 383960838, 385603714, 387037086, 388201561, 389137955, 390074348, 390998230, 392298889, 394102020, 396126709, 398452377, 400674477, 402344894, 403670044, 404840164, 405697479, 407138748, 408898506, 410186195, 411745720, 413645897, 414716797, 415322418, 416256752]
1296.2D16256752P76405O71692N29480J027184J080360P10716N56641k81258m96826
1304.8D20831146k97203K39029J07727R7160J53351l66401k24762n88608o23818r31015
1314.5D18396606q26644j41602J66435Q34770R48334J537666J596528Q00399n8632
1323.2D23253860p476R95559Q28019P41119Q22906O92101l5934m35448o67801j403542
1332.8D24783363r92927k08512K90833o4430J93939N51681j17836l12652l6659P37533
1342.4D24824333K81296N47028J244278R84916Q53577O7139p0343m66309j53923l9139
1352.1D28072853n2299J35421p30934n39665o42853m08249n92422o14624o86150p77130
1361.7D23163948K21443n03959M38423k62146j085053o74705j245957o67190o09284
$$ y = [416256752, 417033157, 417704849, 418234329, 419261513, 420341873, 421052589, 421609230, 421327972, 420831146, 420533943, 420772972, 420880699, 420977859, 421131210, 420764809, 420540047, 419951439, 419327621, 418396606, 417569962, 417428360, 417594795, 418429565, 419377899, 420915565, 422512093, 423312492, 423253860, 423246384, 424241943, 425069962, 425811081, 426633987, 427326088, 427290154, 426854706, 426186905, 424783363, 423790436, 423581924, 423872757, 423808327, 424002266, 424553947, 424436111, 424123459, 424086800, 424824333, 425105629, 425652657, 426896935, 427881851, 428735428, 428802567, 428732224, 428265915, 428111992, 428072853, 428020554, 428155975, 427425041, 426885376, 426242523, 425834274, 425241852, 424627228, 423941078, 423163948, 423385391, 422881432, 423319855, 423057709, 421972656, 421297951, 420051994, 419384804, 418775520]
1370.4D18775520q1329R6703K06832m62722j049805r4109q09364o75125r21097o4354
1380.1D14921150q5830r31130r41467k292443j875801j342849j188355k759895j905174
1388.7D01598206m60930j600571j949043k086678j567955l246231m167366j795082
1396.4C84724350j614342j093559l465233k456856j190071k623443k437439j836472
1404.2C68006935k699470k459870j045799j295776j770783j539459j339340j458016
1411.9C54398422k106666j438141r68170o99730l65067p11479K20947j549453J3122
1420.6C46793785J404839N23109R34677K00272J100883J275292R28192J636009O15082
1429.2C55412140O13785O29501J640358K134018J930885K382126J202011O85501K319832
$$ y = [418775520, 418694191, 418790894, 418997726, 418535004, 417485199, 417391090, 416581726, 415906601, 414985504, 414921150, 414835320, 413904190, 412962723, 410670280, 408794479, 407451630, 406263275, 403503380, 401598206, 401137276, 399536705, 397587662, 395500984, 393933029, 390686798, 386519432, 384724350, 383110008, 382016449, 378551216, 376094360, 374904289, 372280846, 369843407, 368006935, 365307465, 362847595, 361801796, 360506020, 358735237, 357195778, 355856438, 354398422, 352291756, 350853615, 349885445, 349185715, 348820648, 348109169, 348330116, 346780663, 346793785, 348198624, 348721733, 349656410, 349856682, 350957565, 352232857, 353161049, 354797058, 355412140, 356025925, 356655426, 358295784, 360429802, 362360687, 364742813, 365944824, 366630325, 368950157]
1437.9C68950157K992554J751747J092262J590119J586761K157555J192550J371422
1445.6C82685127J064339N55916M54941J136322J738281P24335J355361J232605J697884
1454.3C92645111J608734R32121M90304j343995L415413J940041K218933J745758J739883
1463D05392303K305756J59378J556473J431961K595215K793312K837486L325577K187385
1471.7D24584846L329888K061691L971481L189698J910515L435974L157043L044624
1479.4D48685760K709961K134285J851426J929321J512527J157036J214485J066513
1487.1D62261314J470681K228927P08122j037292o0005l59039j533356j401482m77333
1495.8D61800537m404678K2812j198883m135476r47723j921577k186966j697121L40385
$$ y = [368950157, 371942711, 373694458, 374786720, 376376839, 377963600, 380121155, 381313705, 382685127, 383749466, 384305382, 384760323, 385896645, 387634926, 388359261, 389714622, 390947227, 392645111, 394253845, 395185966, 395676270, 394332275, 397747688, 399687729, 401906662, 403652420, 405392303, 407698059, 407857437, 409413910, 410845871, 413441086, 416234398, 419071884, 422397461, 424584846, 427914734, 429976425, 433947906, 437137604, 439048119, 442484093, 445641136, 448685760, 451395721, 453530006, 455381432, 457310753, 458823280, 459980316, 461194801, 462261314, 463731995, 465960922, 466669044, 465631752, 465571747, 465212708, 463679352, 462277870, 461800537, 457395859, 457418671, 456219788, 452084312, 451136589, 449215012, 447028046, 445330925, 445671310]
1504.5D45671310q51020o628304j275902o4888J841202l94592N01861j091308j389771
1513.1D36318588K33116j031150q6556j672058k714996J084518J320152k412185k906304
1521.8D28133125K625695J558570J713486k14653J046944R05456K07177J844482J635666
1530.5D39455948J669693J093330O77872P05643K431259J682319R13125J481666k688217
1539.2D47422638o17256K916183K612190O15120J356926J912156o18935J784172R57184
1547.9D58340378Q22105L45688M1618J723977J001319R76372k952919k78816J119728
1556.5D61139450K36778l749389r405785N592995P75146R32656j817055j692543l763275
1565.2D48248978l824997q43735j930695p75337r589844k125778j905250m585152l857574
$$ y = [445671310, 444820290, 438191986, 436916084, 436851196, 438692398, 438297806, 438799667, 437708359, 436318588, 436551704, 435520554, 435433998, 433761940, 431046944, 432131462, 433451614, 431039429, 428133125, 430758820, 432317390, 434030876, 433816223, 434863167, 435768623, 435975800, 437820282, 439455948, 441125641, 442218971, 442896843, 443602486, 446033745, 447716064, 448629189, 450110855, 447422638, 446805382, 449721565, 452333755, 452948875, 454305801, 456217957, 455599022, 457383194, 458340378, 459162483, 459508171, 459549789, 461273766, 462275085, 463251457, 460298538, 460019722, 461139450, 461376228, 457626839, 448221054, 453814049, 454589195, 455521851, 453704796, 452012253, 448248978, 444423981, 443580246, 441649551, 440874214, 431284370, 429158592, 427253342, 422668190, 418810616]
1573.9D18810616l849373j309548j3414688j767731l390731m727631m347382o373367
1581.6C79630165m391441o718979m209824n956535m674378m461021n875282l867951
1589.3C39474754o816635l775596o420365m242477m539757n316715l155155n542221
1597B99665833k128983n308857l091011m640274m219284k635365m792537r59607m096336
1605.7B67793579j441021l550415j864967j867543l421859L01056l092423K91214k225742
1614.4B50921879O3782m85039n893593K324600j649208J549397j318150J381989l09506
1623.1B46586151j927395K152748o37397K310791j691475K049465J016350J226577
1630.8B51085815J552258K232K724437n53512M466877o36196L122921K245006J679192
$$ y = [418810616, 414961243, 413651695, 400237007, 398469276, 395078545, 390350914, 386003532, 379630165, 375238724, 368519745, 364309921, 358353386, 353679008, 349217987, 343342705, 339474754, 332658119, 328882523, 322462158, 318219681, 313679924, 308363209, 305208054, 299665833, 297536850, 292227993, 289136982, 284496708, 280277424, 277642059, 272849522, 271889915, 267793579, 266352558, 262802143, 260937176, 259069633, 255647774, 255948830, 252856407, 253147621, 250921879, 250985661, 250500622, 244607029, 246931629, 245282421, 246831818, 245513668, 246895657, 246586151, 244658756, 246811504, 246174107, 248484898, 246793423, 248842888, 249859238, 251085815, 252638073, 252640305, 255364742, 254811230, 259278107, 258641911, 261764832, 264009838, 265689030]
1639.5B65689030L425579Q35647L515969P08141K619476J561146n52788L809395j498642
1648.1B80112953M616909P83787L047676J923390l085518K664890q44784L812237J01147
1656.8B93132687K087001P91340J596737K006645J237526L684769o7005L785763K619152
1665.5C10874615L884277L792286K993164M995537J496582N429344K755127M579582
1673.2C40800514L867684L884468O197052M279861N876846L716469M850045L519020
1680.9C76991959N587577O272660Q99124Q875046N077514P115212N152359N412063
1688.6D21383514N772667M692955N831719N593757O787339O122245N780869L668709
1696.4D65633774O113167N846595N100975N016213L310242Q398017O541710N238266
$$ y = [265689030, 269114609, 269950256, 273466225, 274174366, 276793842, 278354988, 277802200, 281611595, 280112953, 284729862, 285513649, 288561325, 290484715, 287399197, 290064087, 289219303, 293031540, 293132687, 295219688, 296011028, 297607765, 299614410, 300851936, 304536705, 304469700, 308255463, 310874615, 314758892, 318551178, 321544342, 326539879, 328036461, 333465805, 336220932, 340800514, 344668198, 348552666, 354749718, 359029579, 364906425, 368622894, 373472939, 376991959, 382579536, 388852196, 389751320, 398626366, 403703880, 410819092, 415971451, 421383514, 427156181, 431849136, 437680855, 443274612, 450061951, 456184196, 461965065, 465633774, 471746941, 477593536, 482694511, 487710724, 491020966, 499418983, 505960693, 511198959]
1704.1E11198959L562622M030800L901100L515015M578476L448677L222542L661156
1711.8E41119347L696518L384513J003342P90672M174118L177338l281631M566421
1719.5E58630638M719315L301010K396240J344910P91282J643372K002716J401024
1727.2E76230507J906662K433700J050492J879997M298439L874664j460876m657097
1734.9E85556488M104080M429016K709694L671990J782493J78070M369393K559738
1742.7F09360962N08652K023582M113159L288117K507400L171692J853409M974937
1750.4F31801910K202874R59320M367180L268356L938980L805313J028595K103043
1758.1F53475571L168792K280426K928849m33808R05533L896103J885758K264099K537384
$$ y = [511198959, 514761581, 518792381, 522693481, 526208496, 530786972, 534235649, 537458191, 541119347, 544815865, 548200378, 549203720, 549994392, 554168510, 557345848, 554064217, 558630638, 563349953, 566650963, 569047203, 570392113, 571183395, 572826767, 574829483, 576230507, 578137169, 580570869, 581621361, 583501358, 587799797, 591674461, 590213585, 585556488, 589660568, 594089584, 596799278, 600471268, 602253761, 602431831, 606801224, 609360962, 609869614, 611893196, 616006355, 619294472, 621801872, 624973564, 626826973, 631801910, 634004784, 634964104, 639331284, 642599640, 646538620, 650343933, 651372528, 653475571, 656644363, 658924789, 661853638, 661419830, 662325363, 666221466, 668107224, 670371323, 672908707]
1766.8F72908707J979751j608200J821289L585739m52728o82144J04980N293351K843780
1775.4F85794525o51932J873932K75574J394348O16760l31268J506195K674790K604599
1784.1F95757523l24021K13394J066819P62176L17154J631393J286622P41729k50320
1792.8G01202469l29590L590012P13348o92444J223297J757202P92923k29263K991333
1801.5G11019287N3024N61524J339187k74963O16303M77447R82819J219558J660691
1810.2G17654877k74887R94033J382142j53885N15136j24740J387481O75583J199723
1818.8G23255463J331939L31116R51920j205292Q17795N85937k033157J280517K614136
1827.5G27930374K789459K14234l065567K27966J927109L3493K19574R85794J150055
$$ y = [672908707, 674888458, 673280258, 675101547, 678687286, 678234558, 677552414, 677657394, 682950745, 685794525, 685142593, 687016525, 687292099, 688686447, 689303207, 688971939, 690478134, 693152924, 695757523, 695433502, 695646896, 696713715, 697475891, 697793045, 699424438, 700711060, 701452789, 701202469, 700872879, 704462891, 705176239, 704483795, 705707092, 707464294, 708257217, 708027954, 711019287, 711072311, 711633835, 712973022, 712698059, 713314362, 713791809, 714774628, 715994186, 717654877, 717379990, 718374023, 719756165, 719602280, 720117416, 719992676, 721380157, 722055740, 723255463, 724587402, 724918518, 725870438, 724665146, 725482941, 726068878, 724035721, 725316238, 727930374, 730719833, 730934067, 727868500, 728096466, 730023575, 730057068, 730276642, 731262436, 732412491]
1836.2G32412491J199112k64969J098785j24359j2359J08184M64859N36118l560104
1844.9G31857758L405761K591553q0338n74798N8441N57480l80859P07244L43247J331329
1854.5G39816818R28192R7886L99017n01557J20545o48270L58353Q49914J252442J021271
1864.2G43694611K73666P62253j033478L662j632156j114121J735764J360016J143493
1872.8G45193710L93524P12281p58896m32510j53046K15530Q45719J12686J268005
1881.5G47397003J62888N04303p3014q99734j93405n1956J763305k75802j228943J034088
1891.2G48138733J286468M60434j37786p34406j220474J099090O24009P55386O15845
1899.8G50887299m2496K79007p02210j05285l37754L17765J77993J31684J023407N19943
$$ y = [732412491, 733611603, 733346634, 734445419, 734321060, 734308701, 734416885, 734881744, 735417862, 731857758, 735263519, 737855072, 737774734, 737199936, 737258377, 737815857, 737434998, 738142242, 738485489, 739816818, 740745010, 740842896, 741241913, 740740356, 740860901, 740212631, 740570984, 741420898, 742673340, 743694611, 743968277, 744730530, 743697052, 743700714, 742068558, 740954437, 742690201, 744050217, 745193710, 745587234, 746299515, 745540619, 745108109, 744955063, 745170593, 746016312, 746128998, 747397003, 747559891, 748064194, 747991180, 747091446, 746898041, 746846085, 748609390, 748333588, 747104645, 748138733, 749425201, 749885635, 749747849, 749013443, 747792969, 748892059, 749516068, 750271454, 750887299, 750844803, 751123810, 750421600, 750316315, 749978561, 750296326, 750474319, 750606003, 751629410, 752149353]
1909.5G52149353j75934j196136K88315k66114J48621O33774N95474J993179j495895
1918.2G52674637p80106O08826k76566l00064r80529O11190J226578J037674n6229
1926.8G53765411q9264l13186m16489j93939m22897L53622J96610J317825M98428o06384
1936.5G54089737o06537o88019M2801m51507R65957l49426j001434J734237P90787
1945.2G54526596n17883j038971n036j07650J9073K15531J60598Q63495M14505n3406
1954.8G54476852r00878n97001p12661k29874P08008M57916O03027J98365L01971o13327
1964.5G53692398m96292m03214j167678n9891P17087J350021M91867K72141k70768
1973.1G54125671q44421p13348p41578P5608J4496J147384Q86307K93808r4986j023941
$$ y = [752149353, 751973419, 750777283, 751065598, 750799484, 750948105, 751581879, 752177353, 754170532, 752674637, 751894531, 752503357, 752226791, 751926727, 750946198, 751557388, 752783966, 753821640, 753765411, 753676147, 753362961, 752946472, 752752533, 752329636, 752683258, 752879868, 754197693, 754696121, 754089737, 753483200, 752795181, 752837982, 752386475, 753352432, 753003006, 752001572, 753735809, 754526596, 754008713, 752969742, 752964706, 752857056, 752876129, 753091660, 753252258, 754115753, 754530258, 754476852, 753575974, 752978973, 752266312, 752036438, 752744446, 753202362, 753805389, 754003754, 754305725, 753692398, 753196106, 752792892, 751625214, 751565323, 752282410, 753632431, 754124298, 754396439, 754125671, 753281250, 752567902, 751826324, 751901932, 751916428, 753063812, 753950119, 754243927, 754148941, 753125000]
1982.8G53125000o06918q06504Q3924j45569L85208P49207J15966R04618l88489j080780
1992.4G52335663q16727k36282k08664K63519R32617K02561N32074m39759n72204p45773
2002.1G51247025n58548K05459j65176M24270K19345M62876m14810p22428m07867n31540
2011.7G49758606P5378o48727K69928P27234N10864k16064o72226p0725m59976M2038
2021.3G49316330k91824K75650M12750L4561K04010m86526m21524p37839o11k25524
2031G48079453n7297M89044j51825J30234l10593k63977o46133j23597P2937m27551
2040.6G46790695o5841L86581J091614n63507o60782o56128n52216N30930J93786N05753
2050.3G47000885j90277K80304k33536o65054k95563l72543P66678j87836J22604J25809
$$ y = [753125000, 752518082, 751711578, 751795502, 751649933, 752035141, 752784348, 752900314, 753804932, 753416443, 752335663, 751518936, 751282654, 751073990, 751337509, 752270126, 752472687, 753004761, 752565002, 751992798, 751247025, 750688477, 750893936, 750728760, 751153030, 751372375, 751835251, 751420441, 750698013, 750290146, 749758606, 749833984, 749185257, 749455185, 750182419, 750693283, 750477219, 749804993, 749734268, 749274292, 749316330, 749024506, 749300156, 749712906, 749747467, 749951477, 749464951, 749043427, 748305588, 748304977, 748079453, 748022156, 748511200, 748359375, 748489609, 748179016, 747915039, 747268906, 747145309, 747218246, 746790695, 746724854, 747111435, 748203049, 747639542, 746978760, 746322632, 745770416, 746301346, 746495132, 747000885, 746810608, 747090912, 746857376, 746192322, 745896759, 745524216, 746290894, 746103058, 746225662, 746351471]
2059.9G46351471J83411K65655q72345k78244p29828k46200K67486N98755M23584K42844
2069.6G46206589L55530p58515p7972n91965l05099L92227K08435L93982r8572K93426
2079.2G46018066n05523o04401o73141m38614J93863L70102R78469k3803N0354m39453
2088.9G44925919n15442l00293n06363J23749j12000P56531R2163q240K0371p17240
2098.5G43759155k73056o04629p3777l54156L03879O50253r1858n3329m18167j70746
2108.1G42673569n60227l11432q7661O40564O25686k15072P6294p32422m30298m34189
2117.8G41244812k10114J9074J55029P37458p0801J09100m59442m29840k21100k51389
2127.4G40622787J19172k40555M44717M00696N59692n7220o09512j80817j59836q8425
$$ y = [746351471, 746534882, 746800537, 745928192, 745649948, 744920120, 744673920, 744941406, 745540161, 745963745, 746206589, 746562119, 745803604, 745725632, 745133667, 744828568, 745220795, 745429230, 745823212, 745724640, 746018066, 745512543, 744908142, 744235001, 743796387, 743990250, 744360352, 745338821, 745315018, 745365372, 744925919, 744410477, 744110184, 743603821, 743727570, 743615570, 744372101, 744464264, 744456024, 744476395, 743759155, 743486099, 742881470, 742807693, 742453537, 742757416, 743407669, 743315811, 743262482, 742844315, 742673569, 742113342, 741801910, 741714249, 742354813, 742980499, 742765427, 742841721, 742109299, 741679001, 741244812, 741034698, 741053772, 741208801, 741946259, 741875458, 741984558, 741525116, 741095276, 740874176, 740622787, 740741959, 740501404, 740946121, 741346817, 741906509, 741849289, 741239777, 741058960, 740899124, 740810699]
2137.1G40810699l89633L10517J95694O12106L29895l77731j11237o53686K65808J42593
2146.7G41135025K65732J99509J4038M13894m16946p1564m20532j53809j39541J8234
2156.4G40844040M76990k22779K50244O6605K80228m64325o39496K30942K53525Q44573
2166G41920547L63160R5672k97775o8970n00564o13480M08096j52053M44030L82157
2175.6G41980820J33896Q2855j03836k94953n06439K71607P400M27322J58387M55856
2185.3G42612915O58340m41360j42746n48859j21536J13754K75345J66016J5488K76260
2194.9G42863617l00293N6381p78274o2409N58472K85568P12891j64795K3727l89023
2204.6G42805862p019n3329k24533N57403J65100M70124j06659q3923k03705k84043
$$ y = [740810699, 740421066, 740731583, 740927277, 741539383, 741869278, 741491547, 741380310, 740726624, 740992432, 741135025, 741400757, 741600266, 741614304, 742028198, 741611252, 741539688, 741119156, 740965347, 740825806, 740844040, 741321030, 741098251, 741348495, 741415100, 741695328, 741231003, 740591507, 740822449, 741075974, 741920547, 742283707, 742379379, 742081604, 742012634, 741512070, 740898590, 741306686, 741154633, 741598663, 741980820, 742114716, 742197571, 742093735, 741798782, 741292343, 741563950, 741571350, 741998672, 742157059, 742612915, 743271255, 742829895, 742687149, 742138290, 742016754, 742130508, 742405853, 742571869, 742587357, 742863617, 742563324, 742619705, 741841431, 741779022, 742337494, 742623062, 743335953, 743171158, 743194885, 742805862, 742798843, 742745514, 742520981, 743078384, 743243484, 743713608, 743606949, 743523026, 743319321, 743035278]
2214.2G43035278M502j23825M26101n9967K76642L33557K24381N5618k43454l03879
2223.9G43624954n32760L38440r7275Q9798K89077K75879J27945m27322J72958p57675
2233.5G43104019l38745L00446N18035M68598j70746J57623n68237j93405m01764n9357
2243.2G42816467M36096l10592J82495M98123Q86231k44141n66711p31583q38394J64184
2252.8G42292175P4616P45010M51050M06189k41242p40509k84271n07583K30865k45819
2262.4G42180481J08719M80041M73557J33591o15159j11694p42340k68021L53623M55932
2272.1G42448730l4256k09045M97131k8305k84500p54776J54343p0419n12467M41513
2281.7G41647949L93906M71954l70178j98288o17294o51627k36664k28653N12696k88468
$$ y = [743035278, 743039780, 742915955, 743342056, 743282089, 743558731, 743892288, 744116669, 744172287, 743928833, 743624954, 743092194, 743430634, 743333359, 743423157, 743712234, 743988113, 744116058, 743688736, 743861694, 743104019, 742765274, 743065720, 743583755, 744052353, 743881607, 744039230, 743470993, 743277588, 742875824, 742816467, 743252563, 742941971, 743124466, 743622589, 744508820, 744264679, 743697968, 742966385, 742127991, 742292175, 742366791, 743111801, 743562851, 743969040, 743727798, 742987289, 742703018, 742195435, 742426300, 742180481, 742289200, 742769241, 743242798, 743376389, 742761230, 742649536, 741907196, 741639175, 741992798, 742448730, 742414474, 742205429, 742702560, 742674255, 742389755, 741634979, 741789322, 741718903, 741206436, 741647949, 742041855, 742513809, 742143631, 741945343, 741328049, 740676422, 740439758, 740211105, 740723801, 740435333]
2291.4G40435333N07050j00708n53131k74582q07572K83204k92511j69755m58145J83106
2301G38752289M69589o23627p3394p39212l72010l72543Q2092j84707j04218Q04901
2310.7G37639160p88269j28631j142273q01316L75214p19986o87409j056823K49099
2319.3G32938766P25174J50300j837082j241608k441m68522J447220J71967p58515
2328G31125259j847229j228561p44019r46884J199646K35367R86176n64804p43943
2336.7G27471008K00272q52127j30234m24881k95257o37742J275483J89132k89001
2345.4G26506653R56344j05590M41131J54648k52380j795884j390991k60849L1510
2354.1G24284592L34549j572800k16751j960755o48727L68576J043778K211685j531601
$$ y = [740435333, 740942383, 740841675, 740288544, 740013962, 739206390, 739489594, 739197083, 739027328, 738569183, 738752289, 739221878, 738598251, 738524857, 737785645, 737413635, 737041092, 737123184, 736938477, 736834259, 737639160, 736850891, 736722260, 735579987, 734778671, 735153885, 734433899, 733746490, 732689667, 732938766, 733663940, 733814240, 731977158, 730735550, 730733109, 730264587, 731711807, 731883774, 731125259, 729278030, 728049469, 727305450, 726358566, 727558212, 727793579, 728779755, 728214951, 727471008, 727671280, 726819153, 726688919, 726264038, 725968781, 725331039, 726606522, 726795654, 726506653, 727462997, 727357407, 727798538, 727953186, 727700806, 725904922, 724513931, 724253082, 724284592, 724619141, 723046341, 722829590, 720868835, 720220108, 720588684, 721632462, 723844147, 722312546]
2362.7G22312546m81720q83560K71225j330796K11869K437591l67203J606217M17862
2371.4G24194031j99356j4115J16577K55127n47561L78418N69534N05524R8724R25217
2381.1G26282120M93011m79889k29873m55933K18658J94016L41263j37940k37198M0741
2390.7G26028976p70187m75769o63452l34702j67617J61056J48468k93426J3961o03103
2400.3G23044205l23715p51801l76205j32599m91410M04740p0267M2648m54025m33578
2410G20457993k80304r15451n41687m53949J45416J61285O1722n12466l72620j42517
2419.6G17607422r54437o97937o04706K93960n569k73438K2049l70712k97546q65250
2429.3G13853836n63660q40530k51541J36947j66091L34396m95682m43802r34143p55768
$$ y = [722312546, 721830826, 720947266, 721218491, 719887695, 720099564, 722537155, 722169952, 723776169, 724194031, 723994675, 723980560, 724097137, 724352264, 723804703, 724183121, 724752655, 725258179, 725356903, 726282120, 726775131, 726295242, 726065369, 725609436, 725828094, 726022110, 726363373, 726225433, 725988235, 726028976, 725258789, 724783020, 724119568, 723784866, 723617249, 723778305, 723926773, 723633347, 723647308, 723044205, 722720490, 721968689, 721592484, 721459885, 720968475, 721373215, 721302948, 721345596, 720891571, 720457993, 720177689, 719262238, 718720551, 718266602, 718412018, 718573303, 718635025, 718122559, 717749939, 717607422, 716652985, 715955048, 715350342, 715644302, 715638733, 715365295, 715387344, 715016632, 714719086, 713853836, 713290176, 712449646, 712198105, 712335052, 712168961, 712503357, 712007675, 711563873, 710629730, 709873962]
2438.9G09873962k96630l41874J77460k67029q8348n75180n21774m17939m59060l80936
2448.6G06702652q14590n0965k74277k30484k15606j77155j00021o35910o48041j113281
2458.2G02442322m01612l1890J37405j03531n49240j13220q17032q49838q28400l79410
2467.8F98505554j66702l27911k2889m68597m08936p78884n64423m30908o07148k86865
2477.5F94442291j80893J19095l63998o02646q93555q08182p27386m75540K52228l05405
2487.1F90456009o42014o44912j18256n81436r29871l36609n89065l14636l88642l11432
2496.8F85599136m66232m07715p15637j225891l66974m74243k40936l37983l85284
2505.5F80978241k52686n65490k56501o42852p42264r22165l35465j07650n35279j79214
$$ y = [709873962, 709577332, 709235458, 709412918, 709145889, 709057541, 708482361, 707960587, 707542648, 707083588, 706702652, 705888062, 705837097, 705562820, 705332336, 705116730, 704939575, 704839554, 704203644, 703555603, 702442322, 702040710, 702008820, 702146225, 702042694, 701493454, 701380234, 700563202, 699713364, 698884964, 698505554, 698338852, 698010941, 697988052, 697519455, 697110519, 696331635, 695767212, 695336304, 694729156, 694442291, 694261398, 694380493, 694016495, 693413849, 692520294, 691712112, 690984726, 690509186, 690761414, 690456009, 689813995, 689169083, 689050827, 688469391, 687539520, 687202911, 686613846, 686299210, 685910568, 685599136, 685132904, 684725189, 684009552, 682783661, 682416687, 681942444, 681701508, 681363525, 680978241, 680725555, 680160065, 679903564, 679260712, 678518448, 677596283, 677260818, 677153168, 676617889, 676438675]
2515.1F76438675j82648k67257j132889q80280n87005n38865j72271m02146k2049n35202
2524.7F71718063l30047j73340p12280o18134n67017m30068k50855Q5526r10111q61893
2534.4F66949844j52664l76816n49545p18536L3264j65253l60718m43039l39355l37219
2544F63539963j071244p74993q11692j50680l0518k47040k96630p77054k30713l20206
2553.7F58829193l04565o16684l43247j48926n72052k71987p19605n57785p96890m42581
2563.3F54054871o2867l53698j83640n98221l86352o97098m85382m53491l14102J47476
2573F50667496o18286n78309n66482J84402m71344j039886j18790o62765m18396n46494
2582.6F45831146p06100n77011k03934m2954n45578n00335j040116k52304Q9493m46701
$$ y = [676438675, 676256027, 675988770, 674855881, 673975601, 673388596, 672849731, 672677460, 672275314, 672253265, 671718063, 671388016, 671214676, 670502396, 669884262, 669317245, 668887177, 668636322, 668721848, 667811737, 666949844, 666797180, 666420364, 665870819, 665152283, 665185547, 665020294, 664659576, 664216537, 663877182, 663539963, 662468719, 661693726, 660882034, 660731354, 660700836, 660453796, 660157166, 659380112, 659149399, 658829193, 658524628, 657907944, 657564697, 657415771, 656843719, 656571732, 655852127, 655294342, 654497452, 654054871, 653992004, 653638306, 653454666, 652856445, 652470093, 651772995, 651287613, 650834122, 650520020, 650667496, 650049210, 649470901, 648904419, 649088821, 648617477, 647577591, 647458801, 646796036, 646377640, 645831146, 645125046, 644548035, 644344101, 644301147, 643755569, 643255234, 642215118, 641962814, 642052307, 641605606]
2592.2F41605606n62820p92923m25606n28717j92413j73607n88951r30176n66902J11007
2601.9F36954498m58793o43006q13369p02782m64821k56042m37851q58651l40347k92816
2611.5F31686020j35117n46074r32655p67441p00531l24402l49273l28636o26679l65944
2621.2F26609268m42161n85671j06315n39971p29942r33647o94046n86815n31311m74510
2630.8F20984879p34292l61480p53479n30701l25699o03561l48587l27072l59803n53283
2640.5F16086922n47867r42383p61604m41590n36651l27187m87480m66003m26255j35612
2650.1F11014290m61350o67495m00200p07207o35643l55530n4817m56047j79787p0076
2659.8F07026138r31320r26895o53000j71585l30772l36266l21464k51427j47858p32574
$$ y = [641605606, 641042786, 640249863, 639824257, 639295540, 639103127, 638929520, 638340569, 637410393, 636843491, 636954498, 636495705, 635852699, 635039330, 634336548, 633871727, 633615685, 633177834, 632319183, 631978836, 631686020, 631550903, 631004829, 630072174, 629304733, 628604202, 628279800, 627930527, 627601891, 626975212, 626609268, 626167107, 625581436, 625475121, 624935150, 624205208, 623271561, 622577515, 621990700, 621459389, 620984879, 620250587, 619889107, 619135628, 618604927, 618279228, 617675667, 617327080, 617000008, 616640205, 616086922, 615539055, 614596672, 613835068, 613393478, 612856827, 612529640, 612042160, 611576157, 611149902, 611014290, 610552940, 609885445, 609485245, 608778038, 608142395, 607786865, 607732048, 607276001, 607096214, 607026138, 606094818, 605167923, 604514923, 604343338, 604012566, 603676300, 603354836, 603103409, 602955551, 602222977]
2669.4F02222977n68467n71403k53830l70407m01306Q1100k1820l433r78127q23822
2679E98311462l55415n91431m00657l46642j01890m32892l45001j95504l87649p35932
2688.7E94418449m39338K7427n79605l13987l04947l60146m44374j59569K35634o90384
2698.3E91389160n60112o02074n60417l34434o35643l56674J0910j03684r16672l85475
2708E86944885J20545j84899k75383l59306l34663o95382l48510j68763l83987o05049
2717.6E83709488l43094j9951j01585N0468q71544o45599j20277j70212q4000o48804
2727.3E80754890m48036m59747m02336m16069N1994J80245o16913k15798q6364m1123
2736.9E78300743o07185n96161r4566k27967r3078q03757k12212M00353Q7280P629
$$ y = [602222977, 601654510, 601083107, 600829277, 600458870, 600057564, 600138664, 600116844, 600113411, 599135284, 598311462, 597956047, 597364616, 596963959, 596617317, 596515427, 596082535, 595737534, 595542030, 595154381, 594418449, 593979111, 594006538, 593426933, 593112946, 592807999, 592447853, 592003479, 591843910, 592079544, 591389160, 590829048, 590226974, 589666557, 589332123, 588696480, 588339806, 588350716, 588247032, 587330360, 586944885, 587065430, 586880531, 586605148, 586245842, 585911179, 585215797, 584867287, 584698524, 584314537, 583709488, 583366394, 583346443, 583244858, 583295326, 582423782, 581778183, 581657906, 581487694, 581403694, 580754890, 580306854, 579847107, 579444771, 579028702, 579080696, 579260941, 578644028, 578428230, 578341866, 578300743, 577693558, 577097397, 577002831, 576774864, 576681786, 575878029, 575665817, 576066170, 576153450, 576161079]
2746.5E76161079l34091n03273m82979l26652p72019j66091Q3084l25814l43589p26319
2756.2E72263336o637k7047l04832m32243n13077k07520k79884k4986n21660l72353
2765.8E69573097k24075o06613l59001m90761m66843o4545L00827m24652o75544n05982
2775.5E66055908o94542l66516o08139m82330k08740l18718l95241l62587o88629r27086
2785.1E61003380o98776p00798J99890K7961p09037o16303p00912m63486p46231p77435
2794.8E55818253q44689p17506j84784n00946r05304q90312n59464m95949m95796q54225
2804.4E49369278n73654k82822r51958p01103l59535m84161j224556j183663q14209
2813.1E42793617j204605p40509m48341o33240j000404n23110m37660j101990q10623
$$ y = [576161079, 575826988, 575323715, 574840736, 574514084, 573742065, 573575974, 573659058, 573333244, 572989655, 572263336, 572256699, 572229652, 571924820, 571492577, 570979500, 570771980, 570492096, 570467110, 569945450, 569573097, 569349022, 568742409, 568383408, 567892647, 567425804, 567361259, 567662086, 567237434, 566561890, 566055908, 565361366, 564994850, 564386711, 563904381, 563695641, 563376923, 562981682, 562619095, 561930466, 561003380, 560304604, 559603806, 559803696, 559831657, 559122620, 558506317, 557805405, 557341919, 556595688, 555818253, 554973564, 554256058, 554071274, 553570328, 552665024, 551774712, 551215248, 550719299, 550223503, 549369278, 548795624, 548512802, 547560844, 546859741, 546500206, 546016045, 544791489, 543607826, 542793617, 541589012, 540848503, 540400162, 539766922, 538766518, 538243408, 537805748, 536703758, 535893135]
2821.8E35893135r49249r28383r75189j046830j026878q01697l74946j121445j138802
2830.4E27529716q10585j029739p99293o36292j124992j282006j104164j436271j321106
2839.1E17985268j555214j673241j523247j690063j908608k232475j838989j980896
2846.8E03582535k133370k258529k524147k168465j892014j265029r01604n00908l31993
2855.5D89606476n28488p39632m01192M68712P5340m91142q36410o27861p30820q09937
2865.2D84985046n89714j314850q96682j110955j143760p65496j139335o37360r09843
2873.8D76477051p26395o37436p12776l79028r28879j062965r11065p28263j200600
2882.5D69189644j407433r72061n61790n72586j447640r51271o57616j482276j195870
$$ y = [535893135, 534943886, 534015503, 533040314, 531993484, 530966606, 530164909, 529789963, 528668518, 527529716, 526719131, 525689392, 524890099, 524253807, 523128815, 521846809, 520742645, 519306374, 517985268, 516430054, 514756813, 513233566, 511543503, 509634895, 507402420, 505563431, 503582535, 501449165, 499190636, 496666489, 494498024, 492606010, 491340981, 490439377, 489938469, 489606476, 489077988, 488338356, 487937164, 488405876, 488481216, 487990074, 487153664, 486525803, 485794983, 484985046, 484395332, 483080482, 482183800, 481072845, 479929085, 479163589, 478024254, 477386894, 476477051, 475750656, 475113220, 474400444, 474021416, 473092537, 472029572, 471118507, 470390244, 469189644, 467782211, 466810150, 466248360, 465675774, 464228134, 463276863, 462619247, 461136971, 459941101]
2891.2D59941101n07202p77779j262779r48296o10580q43544j270065q30345n34440
2899.9D52356071q34846j135445j175003o21185o07872n18684j002160j370849r67217
2908.6D44122810r81826o47431j456108k049675j323814j200219j627807j787949j637115
2917.2D31410866j647835j438675j594543j356507j189155j132126m20952p19490p86247
2925.9D21125336m54369j32561J99776M56085L97148p9040J49727r4757n4589O96488
2935.6D22209244R15718M85649L40424Q02345R34486J044350P71789J202774R90944
2944.2D29697723J43700O08864M27132N84030J023941J213684P63969M25453O97861
2952.9D35586357o4125K51617N54810M53529L92762M84314J145515M03366L50990R07364
$$ y = [459941101, 459433899, 458656120, 457393341, 456445045, 455834465, 454990921, 453720856, 452890511, 452356071, 451521225, 450385780, 449210777, 448589592, 447981720, 447463036, 446460876, 445090027, 444122810, 443140984, 442493553, 441037445, 438987770, 437663956, 436463737, 434835930, 433047981, 431410866, 429763031, 428324356, 426729813, 425373306, 424184151, 423052025, 422631073, 421911583, 421125336, 420670967, 420538406, 420738182, 421194267, 421591415, 421512375, 421662102, 421567345, 421512756, 422209244, 423124962, 423610611, 423951035, 424753380, 425687866, 426732216, 427504005, 428706779, 429697723, 429841423, 430450287, 430877419, 431461449, 432485390, 433699074, 434463043, 434888496, 435586357, 435522232, 435773849, 436328659, 436782188, 437174950, 437659264, 438804779, 439208145, 439559135, 440466499]
2962.6D40466499Q15697N68314L54652L07312L73650Q33244P95250Q00629N91926Q27904
2972.2D46735077R80720L34168O05736O53724O46973L78494N33753R92546L70674J48926
2981.8D52380791m7188J64184M95339J83792N1765L07045K45705r8610L65524P82242
2991.5D54830589M05579o35948o99616o7520J34697K14081n30853q44078o02532j82724
3001.1D52021675k59399n30472m35715r73930q19855q58002p00187j58882m63067l45192
3010.8D46476974k76565n63545r24149r16481p43332o37550p62558q29506n72739p44552
3020.4D39505997o62041p87849o99387p24487j031533q51936j267166j140518p54433
3029.1D31586647n38063n53589n78461o01883j233367r77898j095924j467629j109314
$$ y = [440466499, 441282196, 441850510, 442205162, 442512474, 442886124, 443719368, 444514618, 445315247, 445907173, 446735077, 447715797, 448049965, 448655701, 449309425, 449956398, 450334892, 450868645, 451861191, 452231865, 452380791, 452333603, 452497787, 452993126, 453176918, 453228683, 453535728, 453781433, 453682823, 454048347, 454830589, 455236168, 454600220, 453900604, 453833084, 453967781, 454181862, 453651009, 452806931, 452204399, 452021675, 451762276, 451231804, 450796089, 449822159, 449002304, 448144302, 447444115, 447285233, 446822166, 446476974, 446200409, 445636864, 444712715, 443796234, 443052902, 442415352, 441652794, 440823288, 440250549, 439505997, 438843956, 438056107, 437356720, 436632233, 435600700, 434748764, 433481598, 432341080, 431586647, 431048584, 430494995, 429916534, 429314651, 428081284, 427103386, 426007462, 424539833, 423430519]
3037.8D23430519m81415m02488j038514j106987j334457p01027l71132j103401j139450
3046.5D15751648j070633p93877p85217p07168q18635j154289j277542j333923r88846
3055.1D06821518j121826j038552p99102p36962o34765p57332j039162r67178o75774
3063.8C99050865j181755q31566p27081q48122k76260r81941j274605r26857p72591
3072.5C91230087q85353n97534k19879p27615o43464q07685o94275l89519r78851j063767
3082.1C84222145p13158m12483o11229j035804j437455r91363k27928o08216q14666
3090.8C77369843q02956r90982r50394q28476q34465o69098l76053o72836r28650m07638
3100.5C69908295n17845j173707o44760n99517j044846p47452l12729m43191j431389
$$ y = [423430519, 422949104, 422546616, 421508102, 420401115, 419066658, 418365631, 417994499, 416891098, 415751648, 414681015, 413887138, 413101921, 412394753, 411576118, 410421829, 409144287, 407810364, 406821518, 405699692, 404661140, 403862038, 403125076, 402490311, 401732979, 400693817, 399726639, 399050865, 397869110, 397037544, 396310463, 395462341, 395186081, 394204140, 392929535, 392002678, 391230087, 390344734, 389747200, 389527321, 388799706, 388156242, 387348557, 386654282, 386264763, 385285912, 384222145, 383508987, 383096504, 382485275, 381449471, 380012016, 379020653, 378792725, 378184509, 377369843, 376566887, 375575905, 374625511, 373797035, 372962570, 372293472, 371917419, 371244583, 370315933, 369908295, 369390450, 368216743, 367571983, 366972466, 365927620, 365180168, 364867439, 364424248, 362992859]
3109.1C62992859j153412o20193q74444p36885o16645o90499j160049p58209l89252
3117.8C55993271o64978q17795j242485j214409q82683o46743q23288o22330p84531
3126.5C48294029j322593o79512n23072r33456j013260m78973n67551j193047j002159
3135.2C40580406q92143q84361r31549n89257j151619j308860k53411p78236j290131
3143.9C32500839j215324o17409l58810r63555q80851o47393n22117q92830r67407
3152.5C25435143p40319q14705r17625r67865j135445j396160o14853n22384r98745
3161.2C17327042r29509p53822o83136r88064m94747p28302j118412q70914q63247
3169.9C09896889o48995j132526j191425r46351r58004r51862o18000l32546j052323
$$ y = [362992859, 361839447, 361219254, 360344810, 359607925, 358991280, 358300781, 357140732, 356382523, 355993271, 355328293, 354510498, 353268013, 352053604, 351170921, 350524178, 349700890, 349078560, 348294029, 346971436, 346291924, 345768852, 344835396, 343822136, 343343163, 342775612, 341582565, 340580406, 339688263, 338803902, 337872353, 337283096, 336131477, 334822617, 334569206, 333790970, 332500839, 331285515, 330668106, 330309296, 329345741, 328464890, 327817497, 327295380, 326402550, 325435143, 324694824, 323880119, 322962494, 321994629, 320859184, 319463024, 318848171, 318325787, 317327042, 316397533, 315643711, 314960575, 313972511, 313477764, 312749462, 311631050, 310760136, 309896889, 309247894, 308115368, 306923943, 305977592, 305019588, 304067726, 303449726, 303117180, 302064857]
3178.6C02064857j014156o24752m64458p35436j109848p36599p13081j026840j111679
3187.3B94528008n95913o85902q84972p83024r59262o76060j028633j022740o56871
3195.9B87234631n88017k49443n87482j179867p60460j95007j055508q10185k00862
3204.6B81607800q07019p37819q87413q19989p70454m21753J70040n88055r17415o76022
3214.3B75151901n57308m49676n25990o00376n94578o19926n40619o65074r68418n16662
3223.9B69113274n93052r40857l59726j5278o54488j135502m79278k15645l27015m92534
3233.5B63899899n75867l80173p22542q85238q23288n36595n59730m54750l2597l91922
3243.2B58537197m21924o73600o30550j23425p72342j065026k62508k83909j075172
$$ y = [302064857, 301050701, 300425949, 299961491, 299226055, 298116207, 297379608, 296666527, 295639687, 294528008, 293932095, 293246193, 292361221, 291578197, 290618935, 289942875, 288914242, 287891502, 287234631, 286646614, 286397171, 285809689, 284629822, 283869362, 283674355, 282618847, 281808662, 281607800, 280800781, 280062962, 279175549, 278355560, 277585106, 277163353, 277333393, 276745338, 275827923, 275151901, 274594593, 274144917, 273618927, 273018551, 272423973, 271804047, 271263428, 270598354, 269629936, 269113274, 268520222, 267579365, 267219639, 267204361, 266549873, 265414371, 264935093, 264719448, 264392433, 263899899, 263324032, 262943859, 262221317, 261336079, 260512791, 259976196, 259416466, 258961716, 258929119, 258537197, 258115273, 257441673, 256811123, 256687698, 255915356, 254850330, 254587822, 254303913, 253228741]
3251.9B53228741o70185k40288m09756k98443l51581o05355q02173m16165j06582m39739
3261.5B48888474p53232n94883l03783K9011k04010q04024m31995o06461n55038k96040
3271.2B44368019m91695J17702l65791m50497j14097o44322k72484k07443r30157q93592
3280.8B40115643J76162j6575p55558m74300m56123n41306n34859o3705N3825j20277
3290.4B37382927k23312q49266n94788k74048l66001l4313k49520q75530m63695J51271
3300.1B33603725k57587p16610m50439j72615l54805j33477l66649k86274K08721p99351
3309.7B30274639p70187l71762j57241L85208n66731j107082o17275j65291l66764
3318.4B26537514q27618n04227K15168j2817j110935r41143o24371o31046l55873o15101
$$ y = [253228741, 252558556, 252318268, 251908512, 251610069, 251258488, 250653133, 249850960, 249434795, 249328213, 248888474, 248135242, 247540359, 247236576, 247265587, 247061577, 246257553, 245825558, 245219097, 244664059, 244368019, 243876324, 243994026, 243628235, 243177738, 243063641, 242419319, 242146835, 241939392, 241009235, 240115643, 240291805, 240275230, 239519672, 239045372, 238589249, 238047943, 237513084, 237449379, 237503204, 237382927, 237159615, 236310349, 235715561, 235441513, 235075512, 235041199, 234791679, 233916149, 233452454, 233603725, 233346138, 232629528, 232179089, 232006474, 231651669, 231518192, 231151543, 230865269, 231073990, 230274639, 229504452, 229132690, 228975449, 229360657, 228793926, 227686844, 227069569, 226904278, 226537514, 225709896, 225205669, 225420837, 225408020, 224297085, 223355942, 222731571, 222100525, 221744652, 221129551]
3328.1B21129551m87537l26615o46686o08158k31267n35259o30798j01795l76702p46517
3337.7B16438217p41291q09002r36966m05826k56462o94657j21746n9357k66475l01247
3347.3B11845188o03008o72989n72872k34738m56791m91561m09565m81987j91651j77402
3357B07552624J62334K02275k99893n15480m54121m40864m90627m3774J43146n0354
3366.6B05765266n6152m21581o40068r7714j60179p34577m13094L18566K55069n86757
3376.3B03228779m24767L3531J62316N38215k13966o61659q5106m3716o27575p67956
3385.9B01138096K42634P30686j42098n33504K95620L81908j40953l31344n03254l15972
3395.6B00821819K80724O64921o1531l13225l53470n25303K14825K11029P9288N7144
$$ y = [221129551, 220642014, 220315399, 219668713, 219060555, 218829288, 218294029, 217663231, 217561436, 217184734, 216438217, 215696926, 214887924, 213950958, 213545132, 213288670, 212594013, 212472267, 212412910, 212146435, 211845188, 211242180, 210569191, 209996319, 209761581, 209304790, 208813229, 208403664, 207921677, 207730026, 207552624, 207714958, 207917233, 207617340, 207101860, 206647739, 206206875, 205716248, 205672474, 205815620, 205765266, 205709114, 205287533, 204647465, 204549751, 204389572, 203654995, 203241901, 203560467, 203815536, 203228779, 202804012, 202837543, 202999859, 203538074, 203324108, 202662449, 202577343, 202533627, 201906052, 201138096, 201380730, 202111416, 201969318, 201435814, 201731434, 202113342, 201972389, 201641045, 201137791, 200821819, 201102543, 201767464, 201705933, 201392708, 201039238, 200513935, 200728760, 200939789, 201019077, 201076221]
3405.2B01076221K43130K54994l87917j97010k87495N8442J02272n59292J95904P01713
3414.8B01200962M87671K39391J23596J2894K38247K72694k38762L32146M33902J19820
3424.5B03222561M04777L45898J41926K6646J37081L54500M35562M76150M81415L84903
3434.1B06411419L46775N31502P03411L7899m9191N82257J72004O87466P65495J49365
3443.8B10338402L20072J03188O70261L85094N83229J009349J13640M17996N75657
3452.5B14516888P51438Q13141L26996M16984O74858O75659L76912R47361J072425
3461.1B20572662N51072L46622M01630O75221R11636J247864N40142K88830O23741
3469.8B26159420R06982J098767N44090O08673Q79173J275654Q37708L09868P66258
$$ y = [201076221, 201319351, 201574345, 201186428, 200989418, 200701923, 200760365, 200862637, 200303345, 200499249, 201200962, 201688633, 201928024, 202051620, 202064514, 202302761, 202575455, 202336693, 202668839, 203102741, 203222561, 203627338, 203973236, 204115162, 204141808, 204278889, 204633389, 205068951, 205545101, 206026516, 206411419, 206758194, 207289696, 207993107, 208031006, 207981815, 208564072, 208736076, 209423542, 210189037, 210338402, 210658474, 210761662, 211431923, 211817017, 212400246, 213409595, 213523235, 213941231, 214516888, 215268326, 216081467, 216408463, 216825447, 217500305, 218175964, 218552876, 219500237, 220572662, 221123734, 221470356, 221871986, 222547207, 223458843, 224706707, 225246849, 225535679, 226159420, 227066402, 228165169, 228709259, 229317932, 230197105, 231472759, 232310467, 232620335, 233386593]
3478.5B33386593O90136O66504R67560J118450M15477Q00000J140899O69060J390076
3487.2B41244755R23805M08611R65042J511898J201802N03521Q95920Q30078J178398
3495.8B49663830J037922O38237Q45356P68718J115532Q77362J104393J368522J105881
3504.5B58525753J099510J118584J248779R57852O60762M37298J167050J003742P40738
3513.2B66960068J657276J499329J621818J648216J179829P04937L90644J054344J479263
3521.9B78195724J169358J082210J630459J202469J172543J607666J248188J190586
3529.6B88499203J537170J435433O43844R87854J326523J684208J664562J185646J855278
3538.3C00819721J335316J492252J592293R47743J062488J753960K359752J099224
$$ y = [233386593, 234076729, 234743233, 235710793, 236829243, 237244720, 238044720, 239185619, 239854679, 241244755, 242168560, 242577171, 243542213, 245054111, 246255913, 246759434, 247655354, 248485432, 249663830, 250701752, 251339989, 252185345, 252954063, 254069595, 254946957, 256051350, 257419872, 258525753, 259625263, 260743847, 261992626, 262950478, 263611240, 264048538, 265215588, 266219330, 266960068, 268617344, 270116673, 271738491, 273386707, 274566536, 275271473, 275662117, 276716461, 278195724, 279365082, 280447292, 282077751, 283280220, 284452763, 286060429, 287308617, 288499203, 290036373, 291471806, 292115650, 293103504, 294430027, 296114235, 297778797, 298964443, 300819721, 302155037, 303647289, 305239582, 306187325, 307249813, 309003773, 311363525, 312462749]
3546C12462749J148205J500740J775818J548653K095756K801743L69072J308784K080346
3554.7C27091866K158546J968079J314582K545243J646881J389236J235123K397461
3562.4C41747017K060699J054154M119491P76177L04870J732369J339378L918457J798249
3571.1C58850861J755104J938247K033882K259484K412185K881089P92351K162055
3578.8C75085258K285614J865731K901001K576942J786385J371498M531212K746200
3586.5C95149841L52249K817879O0158K788582L101044L375091K451973J730309M271659
3595.2D16098785J22834K144851L984948J827354L574562J877213J609726K613410
3602.9D33853683K303582L091697L899308L841209Q32367K962761J28212J354217Q023148
$$ y = [312462749, 313610954, 315111694, 316887512, 318436165, 320531921, 323333664, 323702736, 325011520, 327091866, 329250412, 331218491, 332533073, 335078316, 336725197, 338114433, 339349556, 341747017, 343807716, 344861870, 348981361, 349757538, 350062408, 351794777, 353134155, 357052612, 358850861, 360605965, 362544212, 364578094, 366837578, 369249763, 372130852, 372923203, 375085258, 377370872, 379236603, 382137604, 384714546, 386500931, 387872429, 392403641, 395149841, 395502090, 398319969, 398380127, 401168709, 404269753, 407644844, 410096817, 411827126, 416098785, 416221619, 418366470, 422351418, 424178772, 427753334, 429630547, 431240273, 433853683, 436157265, 439248962, 443148270, 446989479, 447821846, 450784607, 450912819, 452267036, 460290184]
3611.6D60290184K444458j63841M425430P48329M248581M451027J953049K953262N36194
3620.3D81886673J879463L415146K964554L059883M538651M493370L512878N428276
3628E11178894N96542m627380M483223M720650N692405K999802M54407L920402M060364
3636.6E33479309K849007J882782K565689L675880L845253K109413J167145L908539
3644.4E55483017N784035O879959p64199l325653P406884J708564j208038K114754
3652.1E74079323O345215N038337L979683N058098n615845L181382N864486J980629
3659.8E99911308K919312J701622L231354K269821K123680K441254J463012N351601
3667.5F21412964L104935J15547Q62045n810814L298569Q723831Q856354k127228j5019760
$$ y = [460290184, 462734642, 462570801, 466996231, 467744560, 471993141, 476444168, 478397217, 481350479, 481886673, 483766136, 487181282, 490145836, 493205719, 497744370, 502237740, 505750618, 511178894, 511775436, 507148056, 511631279, 516351929, 522044334, 525044136, 525498543, 529418945, 533479309, 536328316, 538211098, 540776787, 544452667, 548297920, 550407333, 551574478, 555483017, 561267052, 568147011, 567382812, 564057159, 571464043, 573172607, 571964569, 574079323, 580424538, 585462875, 589442558, 594500656, 588884811, 592066193, 597930679, 599911308, 602830620, 604532242, 607763596, 610033417, 612157097, 614598351, 616061363, 621412964, 624517899, 624633446, 625495491, 619684677, 622983246, 631707077, 640563431, 638436203, 623416443]
3676.2F23416443M788055Q887406N482788k475205L82843L396530K425919J814652
3683.9F48119431J002883M06876L613434O559677q180618j788254Q156586o527481
3691.6F51362534N10711N758133J184158J737290Q91876N96314J481628K32849K824097
3700.3F66579590L620605n017852j867066M973602J983719L36762N84869L372879M051514
3709F78618622q199005L905563N275574j3543320M981918N146408M5472Q32214K847061
3717.7F79910507J552277l628006J497421O443100l978729n273819N899963J816559
3725.4F84239273j567459k745590K97241L951263J783600O381302j275864q628768
3733.1F82434998P683105R95331r522247p8507L997879K179108K166366J793824m590149
$$ y = [623416443, 628204498, 637091904, 642574692, 640099487, 640482330, 643878860, 646304779, 648119431, 649122314, 649529190, 653142624, 659702301, 651521683, 649733429, 657890015, 651362534, 651873245, 657631378, 658815536, 660552826, 661444702, 662041016, 663522644, 663755493, 666579590, 670200195, 665182343, 663315277, 668288879, 670272598, 670609360, 671194229, 674567108, 678618622, 670419617, 674325180, 679600754, 666057434, 671039352, 676185760, 676231232, 677063446, 679910507, 681462784, 677834778, 679332199, 685775299, 681796570, 676522751, 682422714, 684239273, 682671814, 679926224, 680223465, 684174728, 685958328, 692339630, 691063766, 682434998, 690118103, 691113434, 681591187, 681512680, 685510559, 687689667, 689856033, 691649857, 687059708]
3741.8F87059708M824905J4262619j1256943j9821014J0616913P375030P056351k327347
3749.5F97790222r447784J0696335p033158p493896P020874M832153K727585n579681
3757.2F93512650K773361N636825q567352n22842M469833R11331K49787L136901k622528
3765.9F98977966m331588L668594N421982N23529r936066J424790L736496P38449J037063
3774.5G01261215L1738J584778O9733J806412n36576p610702L229446K527542J338044
3783.2G03701630K049789l487930k2583K020340M19235N19714J77536R3232k43531
3791.9G05227432K83432m1427K196502L909531n309677n381622K804336M466324N489120
3800.6G13643951o895065j0181732M368057L760681N232315M476624j0716171k815247
$$ y = [687059708, 691884613, 706147232, 694890289, 675069275, 685686188, 693061218, 700117569, 697790222, 688342438, 699038773, 692005615, 684511719, 691532593, 696364746, 699092331, 693512650, 696286011, 701922836, 693355484, 692832642, 697302475, 698213806, 698463593, 701600494, 698977966, 694646378, 698314972, 703736954, 704260483, 694324417, 695749207, 699485703, 700224152, 701261215, 701292953, 702877731, 702947464, 704753876, 704217300, 696606598, 699836044, 702363586, 703701630, 705751419, 702263489, 702240906, 704261246, 704680481, 705200195, 705377731, 705470963, 705227432, 705510864, 705469437, 707665939, 711575470, 706265793, 700884171, 703688507, 708154831, 713643951, 706748886, 696567154, 700935211, 704695892, 709928207, 714404831, 703688660, 700873413]
3808.3G00873413N535965J964340Q316K32086P1640J843415N458450l362045j3714371
3817F98911209N614853O076889N177918P32574j9318695L403091O475525K405167K522507
3825.7G12001038r5292m076385M15726K249145L004151J503753q372497K728500P121735
3834.3G16479874p163468l3722Q849869p852020m416580N925750o331253M49372P482757
3843G13390579k122879l669281K821808J599808Q22296J984940j405564J898270O991958
3851.7G22311935o006393l451462j4763794L579178J0590973j609116j511993K638321
3859.4G11777649K728653K660980n825043N40238O567077n969543n410995L761749
3867.1G10830765N719146N583954r696350q481903M677735O703033L344345j0733108
$$ y = [700873413, 706409378, 708373718, 708382034, 708614120, 708685760, 710529175, 715987625, 712625580, 698911209, 704526062, 710602951, 715780869, 716513443, 697194748, 700597839, 707073364, 709478531, 712001038, 711905746, 707829361, 708245087, 710494232, 713498383, 715002136, 706629639, 709358139, 716479874, 709316406, 709282684, 718132553, 710280533, 705863953, 711789703, 705458450, 705907822, 713390579, 711267700, 707598419, 710420227, 712020035, 712842331, 714827271, 713421707, 715319977, 722311935, 716305542, 712854080, 698090286, 701669464, 712260437, 710651321, 709139328, 711777649, 714506302, 717167282, 711342239, 711882477, 718449554, 712480011, 707069016, 710830765, 716549911, 722133865, 712437515, 703955612, 708633347, 715336380, 718680725, 707947617]
3874.8G07947617Q70513M180222K51770K876587L943253o787568o983642O922073K427292
3883.5G15648117J541290L604355j4524231J618271M313278J153412M881439j662674
3891.2G16573257q755645J762771L751602j262054J356277J499939J767960K422028
3898.9G19116135q794632L912277J432571m950103O422042j893692l296737O027R77936
3907.6G12931824J106643p09533O24466J17645k87857m76227N66254J607895J475448
3916.3G16956558k948761l372879L960266m50134l431091K646637K416458Q81729l509369
3925G13149414k771378J962204J983490J060257k306747r11560K835541j372986j371384
3933.7G12256851J618576k78091n82962K70843L9063r4910p2861J722107J054459l565064
$$ y = [707947617, 708818130, 712998352, 713250122, 716126709, 720069962, 713282394, 706298752, 713220825, 715648117, 717189407, 720793762, 706269531, 707887802, 712201080, 713354492, 718235931, 716573257, 707817612, 709580383, 713331985, 712069931, 713426208, 714926147, 716694107, 719116135, 710321503, 714233780, 715666351, 710716248, 717138290, 715244598, 711947861, 711953888, 712931824, 714038467, 713328934, 713953400, 714071045, 713783188, 713306961, 713873215, 715481110, 716956558, 714007797, 710634918, 714595184, 714145050, 710713959, 713360596, 715777054, 716658783, 713149414, 710378036, 712340240, 714323730, 715383987, 713077240, 712165680, 715001221, 713628235, 712256851, 713875427, 713597336, 713014374, 713285217, 713324280, 713229370, 713156509, 714878616, 715933075, 712368011]
3943.3G12368011m03518R50928L96499J112442k211380Q14514J023331k057037J617584
3952G13611374N28030j5564N0583o70166k67410r92584K17666m043R81979O97250r16442
3962.6G13220673J4190j89056M93011j27105N7983O70013n85708k94495N14527k02179
3972.2G13571854j468735k96936Q392K42233J214676J129151R34219o28967j265640
3980.9G13440247n27344N73044K02331O027L61176l15857Q9951l17460M85611M42582
3990.6G14440308o93055K68708K66571J16043o28891k34986L28599J72882J70593p31888
4000.2G13474884
$$ y = [712368011, 711964493, 712915421, 713311920, 714424362, 712212982, 713027496, 714050827, 711993790, 713611374, 714139404, 714123840, 714174423, 713504257, 713236847, 712244263, 712461929, 712457886, 713439865, 714137115, 713220673, 713234863, 713045807, 713538818, 713411713, 713469696, 714139709, 713554001, 713259506, 713774033, 713571854, 712103119, 711806183, 711814575, 712056808, 713271484, 714400635, 715334854, 714705887, 713440247, 712912903, 713485947, 713688278, 713694305, 714055481, 713739624, 713829575, 713512115, 713997726, 714440308, 713747253, 714015961, 714282532, 714398575, 713769684, 713534698, 713863297, 714036179, 714206772, 713474884]
##END=$$ End of the data block
