##TITLE=$$ Begin of the data block
##JCAMP-DX=5.00 $$ ACD/SpecManager v 10.08
##SPECTROMETER/DATA SYSTEM=Varian
##DATE=08 Jan 2013 15:50:32
##DATA TYPE=INFRARED SPECTRUM
##DATA CLASS=XYDATA
##ORIGIN=
##OWNER=
##NPOINTS=3735
##FIRSTX=399.26403809
##LASTX=4000.35498047
##MAXX=4000.35498047
##MINX=399.26403809
##MAXY=75.58617401
##MINY=20.06589890
##XFACTOR=1.0000000000
##YFACTOR=0.000000100000000
##FIRSTY=43.91759872
##DELTAX=0.96440572
##XUNITS=1/CM
##YUNITS=TRANSMITTANCE
##XYDATA=(X++(Y..Y))
399.3D39175987J0448685M38499J909218j820602n363426o519814j610184k39982m484215
$$ 439175987 449624672 450063171 451972389 450151787 444788361 438268547 436658363 436418381 431934166
407.9D31934166K240677R245148M634437o606750J383819N044098k439461r57756m067611
$$ 431934166 434174843 443419991 448054428 441447678 442831497 447875595 445436134 444478378 440410767
416.6D40410767m528618j0456887l272705P214775K884675M803581J968460l280182
$$ 440410767 435882149 425425262 422152557 429367332 432252007 437055588 439024048 435743866
424.3D35743866o045990N0240L685646m85993J08986K223511Q85773k801476n747299
$$ 435743866 429697876 429748116 433433762 432947769 433056755 435280266 436166039 433364563 427617264
433D27617264n851021J053047M836540M746666Q46291j499939l88756k830353Q36373
$$ 427617264 421766243 422819290 427655830 432402496 433248787 431748848 431360092 428529739 429366112
441.7D29366112r71680k120590M483719J442756K062035M99001k60087q5487l693809
$$ 429366112 428394432 426273842 430757561 432200317 434262352 434761353 434501266 434415779 430721970
450.4D30721970j479950j615334r06982K985840N00450k153435j841469J867523J714974
$$ 430721970 429242020 427626686 426719704 429705544 430205994 428052559 426211090 428078613 429793587
459.1D29793587m216538k344436J724357k03247K263451j707649k540589J01128p14112
$$ 429793587 425577049 423232613 424956970 424753723 427017174 425309525 422768936 422870064 422155952
467.7D22155952J042099l138084o34766K347680N09834j517983m293823l209762K16636
$$ 422155952 423198051 420059967 419425201 421772881 422282715 420764732 416470909 413261147 413477783
476.4D13477783L305779j173668l343277J178322K694397K526970O01844l627166o918564
$$ 413477783 416783562 415609894 412266617 413444939 416139336 418666306 419268150 415640984 408722420
485.1D08722420l293648K431450L489342j457329j689301J734810k592735l195915
$$ 408722420 405428772 407860222 411349564 409892235 408202934 409937744 407345009 404149094
492.8D04149094j188889J110420M956742L883094J368790k734680k428436J978988
$$ 404149094 402960205 404070625 409027367 412910461 414279251 411544571 409116135 411095123
500.5D11095123J390534m650154k752800J117401P8201J086235j188850q87833J546135
$$ 411095123 412485657 407835503 405082703 406200104 406278305 407364540 406175690 405287857 406833992
509.2D06833992r16786j685677k101135j319122K211151K881241n26467j420059l196068
$$ 406833992 405917206 404231529 402130394 400811272 403022423 405903664 405377197 403957138 400761070
517.9D00761070m505539q05092r87892P7095K341690J265068J319390m32282k729034
$$ 400761070 396255531 395450439 394462547 394539642 396881332 398146400 399465790 399033508 396304474
526.6C96304474j480103o27746m70619J137733J430740j149368q06885K04125j076660
$$ 396304474 394824371 394196625 393726006 394863739 396294479 395145111 394338226 394542351 393465691
535.2C93465691j396523j582107j255036J244621J685982J301155O93474j933479k533264
$$ 393465691 392069168 390487061 389232025 390476646 392162628 393463783 394157257 392223778 389690514
543.9C89690514l103867j381187K132492M24881j93329M41513m09546N47256m87518
$$ 389690514 386586647 385205460 387337952 387762833 387569504 388011017 387601471 388148727 387661209
552.6C87661209k881241k128067r45968o68335N8899J198005J923561J245423p33185
$$ 387661209 384779968 382651901 381705933 381037598 381096497 382294502 384218063 385463486 384730301
561.3C84730301j967316j154785n31540o01539J230468K473793L5973p37839N48515
$$ 384730301 382762985 381608200 381076660 380475121 381705589 384179382 384215355 383477516 384026031
570C84026031o05049j523361j944389r75533J948052J175804m51698r93157j641731
$$ 384026031 383420982 381897621 379953232 378977699 380925751 382101555 381649857 380656700 379014969
578.6C79014969r7199l99131j220017K05956K37426J134491K188836M64515l4981r59167
$$ 379014969 378917770 378518639 377298622 377504578 377742004 378876495 381065331 381529846 381494865 380535698
588.3C80535698j525459M26712k3308M35257L510933K836609j93253j299133j050263
$$ 380535698 379010239 379436951 379413643 379848900 383359833 386196442 386003189 384704056 383653793
597C83653793m98314K09694k6436L28713J79329L75595N58891j130104j525955j376877
$$ 383653793 383155479 383365173 383338737 383667450 383846779 384222374 384781265 383651161 382125206 380748329
606.6C80748329o83098l96614l44124J226006R01298k53448j136131j398354j778679
$$ 380748329 380065231 379668617 379324493 380550499 381451797 381198349 380062218 378663864 376885185
615.3C76885185j330795J04561K53334K040863J207237m99077O57730L47672k32239
$$ 376885185 375554390 375658951 375912285 377953148 379160385 378661308 379319038 379666710 379434471
624C79434471O7558O04630O13480J544494K969895K085723N85633P83348J417312K12174
$$ 379434471 379502029 380106659 380720139 382264633 385234528 387320251 387905884 388689232 390106544 390318718
633.6C90318718R51805L103294K479744K236252K067719J272964J096421J4991j406440
$$ 390318718 391270523 394373817 396853561 399089813 401157532 402430496 403526917 403541908 402135468
642.3D02135468m06647K447891K576981J921424J835938P69882q21342j502152O67877
$$ 402135468 401728821 404176712 406753693 408675117 410511055 411280937 410459595 408957443 409625320
651D09625320J135674M63753J578369K365417K170410J280709r12934k907142p00836
$$ 409625320 410760994 411224747 412803116 415168533 417338943 418619652 417706718 414799576 414098740
659.7D14098740M10080M14390J282044R05990J660004K38685n32074k248954j0162354
$$ 414098740 414508820 414923210 416205254 417111244 418771248 419009933 418477859 416228905 406066551
668.3D06066551N603714M253578K562256K083206J625596M03823o97250J058540J301804
$$ 406066551 411670265 415923843 418486099 420569305 422194901 422598724 421901474 422960014 424261818
677D24261818Q00896J145782J594925J880379K008133K361755Q42361m53681l00065
$$ 424261818 425062714 426208496 427803421 429683800 431691933 434053688 434896049 434442368 434142303
685.7D34142303J95199J748619K596321J006851R92088J620064N97687L05481k19574
$$ 434142303 434337502 436086121 438682442 439689293 440681381 442301445 442899132 443204613 442985039
694.4D42985039K06222N41764J205635K379646J883774J323852L77770K44293j227112
$$ 442985039 443191261 443733025 444938660 447318306 449202080 450525932 450903702 451147995 449920883
703.1D49920883j078605J183586J104774K652664K979927J716462O10351q79555j522522
$$ 449920883 448842278 450025864 451130638 453783302 456763229 458479691 459090042 458210487 456687965
711.7D56687965r29412J743812K916679K340088J629944R96781k41661p82433l11966
$$ 456687965 455758553 457502365 460419044 462759132 464389076 465385857 465144196 464361763 464049797
720.4D64049797j258507j36985K205696L284187K072830J079979J128616k97660j36719
$$ 464049797 462791290 462654305 464860001 468144188 470217018 471296997 472425613 472127953 471991234
729.1D71991234J66473k23350N52292K724418L032685K333717J778641j094590j181411
$$ 471991234 472157707 471934357 472486649 475211067 478243752 480577469 482356110 481261520 480080109
737.8D80080109j402626l38631K109413J476631K420044J780968J25198o63833o70128
$$ 480080109 478677483 478338852 480448265 481924896 484344940 486125908 486251106 485587273 484917145
746.5D84917145n68657n61791J292382J938553K262649K239304J584015K899j011696
$$ 484917145 484348488 483786697 485079079 487017632 489280281 491519585 493103600 493106499 492094803
755.1D92094803q61969o69441J555099K329254K784767K676697J893540J125106o84471
$$ 492094803 491232834 490563393 492118492 494447746 497232513 499909210 501802750 502927856 502243385
763.8E02243385r68818q78716J287804J755256J279870K017974Q53653K61650r41162
$$ 502243385 501274567 500395851 501683655 503438911 504718781 506736755 507590408 507852058 506910896
772.5E06910896j181450j053695m95491O06537R17549J781120J276970m8332j279221
$$ 506910896 505729446 504675751 504180260 504786797 505704346 507485466 508762436 508714104 507434883
781.2E07434883r63249p96890m18206R58672J854095K466317J629448J047172j103020
$$ 507434883 506471634 505674744 505256538 506215210 508069305 510535622 512165070 513212242 512109222
789.9E12109222j955452j010589j043892L54156J705018J526374m4250m16718k584839
$$ 512109222 510153770 509143181 508099289 508453445 510158463 511684837 511640587 511223869 508639030
798.5E08639030l098373j442642j414147K83051r47151j392937j329498k491532l178825
$$ 508639030 505540657 504098015 502683868 502966919 502019768 500626831 499297333 496805801 493626976
807.2D93626976l210487j396027k997627j538010O61583r76295r40018j061134j687890
$$ 493626976 490416489 489020462 486022835 484484825 485146408 484170113 483230095 482168961 480481071
815.9D80481071k659187k415199j723251l95813Q24661J111336J912689J763916J400375
$$ 480481071 477821884 475406685 473683434 473287621 474112282 475223618 477136307 478900223 480300598
824.6D80300598M08516J116142K233086L019676L903580L352089M156799L614273L373032
$$ 480300598 480709114 481825256 484058342 487078018 490981598 494333687 498490486 502104759 505477791
833.3E05477791K605324J359520J965141K221107K806321K992706M602623L479957
$$ 505477791 508083115 509442635 511407776 513628883 516435204 519427910 524030533 527510490
841E27510490K122345J632920L73268J750221J238594J963577L016739L720436K944565
$$ 527510490 529632835 531265755 531639023 533389244 534627838 536591415 539608154 543328590 546273155
849.6E46273155J111565R89609l64991M38614Q70705K539978L386650L131561L438340
$$ 546273155 547384720 548374329 548009338 548447952 549318657 551858635 555245285 558376846 561815186
858.3E61815186J184883M94728m83094k28157n81665J187516K369499L62778J578865
$$ 561815186 563000069 563494797 563011703 562783546 562201881 563389397 565758896 566121674 567700539
867E67700539l1968j408882l019714k915878j700936j425781P56264J45340M46510
$$ 567700539 567668571 566259689 563239975 560324097 558623161 557197380 557953644 558098984 558545494
875.7E58545494j533012k638626j664544j724090o87103j417122N9166Q75358R05724
$$ 558545494 557012482 554373856 552709312 550985222 550298119 548880997 548940163 549815521 550721245
884.4E50721245M13475j178093j891785j942520m24385o32553J38931J092682K431603
$$ 550721245 551134720 549956627 548064842 546122322 545697937 545065384 545204315 546296997 548728600
893E48728600J695709q80242N3215p18383j058274l929J769676J694565O99196J192436
$$ 548728600 550424309 549544067 549597282 548878899 547820625 547816696 549586372 551280937 551980133 553172569
902.7E53172569K53830k65960q53043J322212K226257K692452L337707J717377K439346
$$ 553172569 553426399 553160439 552307396 553629608 555855865 558548317 561886024 563603401 566042747
911.4E66042747J3123k131805l017197k146683o85539j549072r47418k185364k244072
$$ 566042747 566055870 563924065 560906868 558760185 558074646 556525574 555578156 553392792 551148720
920E51148720k642899l631553m559021n205651m331856l944168j294860j287079k371674
$$ 551148720 548505821 544874268 540315247 535109596 530777740 526833572 525538712 524251633 521879959
928.7E21879959l078804l698120l002815m112397l303108j880951p53631j74790k64434
$$ 521879959 518801155 515103035 512100220 507987823 504684715 502803764 502050133 501875343 501610909
937.4E01610909l59269j243019j830139k547569j912117j486321L26538J330376K12364
$$ 501610909 501251640 500008621 498178482 495630913 493718796 492232475 492559013 493889389 494101753
946.1D94101753N5199j447067j510315j406975p05299J84097j29776J48430q45185
$$ 494101753 494156952 492709885 491199570 489792595 489087296 489271393 489141617 489290047 488444862
954.8D88444862q93440j717071l232918l750839l118058k014656j976089j430969j258431
$$ 488444862 487551422 485834351 482601433 478850594 475732536 473717880 471741791 470310822 469052391
963.4D69052391j636620l013000l087273k682380l502808k899933k155075j638412
$$ 469052391 467415771 464402771 461315498 458633118 455130310 452230377 450075302 448436890
971.2D48436890j931687k386970l384934m310951m279175m374351l881188m382515
$$ 448436890 446505203 444118233 440733299 436422348 432143173 427768822 423887634 419505119
978.9D19505119m089012l552246m251900n287246o441117o116218n827141n547066
$$ 419505119 415416107 411863861 407611961 402324715 395883598 389767380 383940239 378393173
986.6C78393173m795265n082970n393905n181389n042343m845276n212250n329628
$$ 378393173 373597908 368514938 363121033 357939644 352897301 348052025 342839775 337510147
994.3C37510147n114098m490737l710823l482399l273964l795128l486576l885022
$$ 337510147 332396049 327905312 324194489 320712090 317438126 313642998 310156422 306271400
1002C06271400l830127k882633k757378j387005j201324j120358j303081j745720j909542
$$ 306271400 302441273 299558640 296801262 295414257 294212933 293092575 291789494 290043774 288134232
1010.7B88134232k062436j979732k538757j458550j626968k251702k690220k606372
$$ 288134232 286071796 284092064 281553307 280094757 278467789 276216087 273525867 270919495
1018.4B70919495k165394l367977k964783l181019j978798j940040k244969j091213
$$ 270919495 268754101 265386124 262421341 259240322 257261524 255321484 253076515 251985302
1026.1B51985302k778988k171535j918335j391659j330700k037544j395188j323547
$$ 251985302 249206314 247034779 245116444 243724785 242394085 240356541 238961353 237637806
1033.8B37637806J00250L83053P67097J35632Q38299J812153J034889J411037R63631
$$ 237637806 237738056 238121109 238888206 239023838 239862137 241674290 242709179 244120216 245083847
1042.5B45083847J245098k17972n85327k65846J00250L95756j875153q18519L3378
$$ 245083847 246328945 246110973 245525646 245259800 245360050 245755806 243880653 243062134 243095512
1051.2B43095512J04027o43635q16364J42021K2888N5523j669788j27106J412125K239342
$$ 243095512 243199539 242555904 241739540 241881561 241904449 241959972 240290184 240163078 241575203 243814545
1060.9B43814545J955146J133671K626496J869182K577286K067928J515141J837520
$$ 243814545 245769691 246903362 249529858 251399040 253976326 256044254 257559395 259396915
1068.6B59396915K183800K387657Q30689J458053N53208K42004L53031M60358J724033
$$ 259396915 261580715 263968372 264799061 266257114 266810322 267052326 267405357 267865715 269589748
1077.2B69589748J720009J374798J40247J061879J137809J260872J279202R40475K051029
$$ 269589748 271309757 272684555 272824802 273886681 275024490 276285362 277564564 278505039 280556068
1085.9B80556068J724339K712765K175693J523342J400891J870327J894169P19490
$$ 280556068 282280407 284993172 287168865 288692207 290093098 291963425 293857594 294577084
1093.6B94577084K416706K497425K938041K126694J030274J745338J124229J836625
$$ 294577084 296993790 299491215 302429256 304555950 305586224 307331562 308455791 310292416
1101.4C10292416J901855J993694J187230J743888K641602R88064J368828J295509
$$ 310292416 312194271 314187965 315375195 317119083 319760685 320748749 322117577 323413086
1109.1C23413086J068420O49987K71148M32740M53758J552276Q97828j33057J01509
$$ 323413086 324481506 325131493 325402641 325835381 326289139 327841415 328739243 328606186 328707695
1117.7C28707695L29857n16968o76155j75972p3929Q22373P42149J162529Q75740L70064
$$ 328707695 329037552 328520584 327844429 327668457 327594528 328416901 329159050 330321579 331197319 331567383
1127.4C31567383J020279J588096K407074K369118K686882K230339K237702K603759
$$ 331567383 332587662 334175758 336582832 338951950 341638832 343869171 346106873 348710632
1135.1C48710632J885758J733436J592026J870880J912728K137069K143479J224632
$$ 348710632 350596390 352329826 353921852 355792732 357705460 359842529 361986008 363210640
1142.8C63210640R34296O16989K72789N20248R30100R45243K24762j81617M24041N28527
$$ 363210640 364144936 364761925 365034714 365554962 366485062 367430305 367655067 367473450 367897491 368426018
1152.5C68426018k18582n02129m95720q28438r69810j64795K8419q67347r19037o53687
$$ 368426018 368207436 367705307 367209587 366381149 365411339 365246544 365274963 364407616 363488579 362834892
1162.1C62834892n7373O03791P08770J477738K312545K294732K628975L188858K510566
$$ 362834892 362777519 363381310 364090080 365567818 367880363 370175095 372804070 375992928 378503494
1170.8C78503494J939087J984558K215538K424279L083305K926521K735329L351135
$$ 378503494 380442581 382427139 384642677 387066956 390150261 393076782 395812111 399163246
1178.5C99163246K360077J906929J768761J380920J081429J173820J640129J163063
$$ 399163246 401523323 403430252 405199013 406579933 407661362 408835182 410475311 411638374
1186.2D11638374J117211R44061J51825p46460n78995k33841n39169p41348o60019
$$ 411638374 412755585 413699646 413851471 413105011 412526016 412292175 411753006 411011658 410351639
1194.9D10351639l33367j353263j657448j346131j608009j425400j363525j202164
$$ 410351639 410018272 408665009 407007561 405661430 404053421 402628021 401264496 400062332
1202.6D00062332j118393q59413j359749k027550j430358r61419m91485k14157j63536
$$ 400062332 398943939 398084526 396724777 394697227 393266869 392305450 391813965 391599808 391436272
1211.3C91436272J16768L67240J43548j46676M90876r7924m82902M51546N60569N46646
$$ 391436272 391553040 391920280 392063828 391917152 392408028 392310104 391827202 392278748 392839317 393385963
1220.9C93385963L82920L16543J7739o99120j093445p16667M7684l04833o88820k93655
$$ 393385963 393768883 394085426 394103165 393404045 392310600 391593933 391641617 391336784 390647964 390354309
1230.6C90354309l50685j118469j436959j145858j209031m30145L14598j74217l8452
$$ 390354309 390003624 388885155 387448196 386302338 385093307 384663162 384977760 384803543 384765091
1239.3C84765091J04217o41860j209717j226158j093026n89027n1231K6741M96l76969
$$ 384765091 384869308 384227448 383017731 381791573 380698547 380109520 380058289 380085030 380085526 379708557
1248.9C79708557o46744o25801n18036o44950q15735k73285J47209p9727j21765L19900
$$ 379708557 379061813 378436012 377917976 377273026 376457291 376184006 376331215 376251488 376129723 376449623
1258.5C76449623q9111m35791k19345j53275J86653L30353J047669J076660N78155
$$ 376449623 376360512 375924721 375705376 375552101 375738754 376069107 377116776 378193436 378771591
1267.2C78771591N53703M45862L84941N1651R98002J568908J273155J563836J609458
$$ 378771591 379325294 379771156 380156097 380207748 381205750 382774658 384047813 385611649 387221107
1275.9C87221107J256180P43485R86786J127510J384468J808319J895027K171288K054672
$$ 387221107 388477287 389220772 390207558 391335068 392719536 394527855 396422882 398594170 400648842
1284.6D00648842J656837J400376J284675J182938J171341J217499J894073K100144
$$ 400648842 402305679 403706055 404990730 406173668 407345009 408562508 410456581 412556725
1292.3D12556725J430816Q79784Q21991R69200O24390O06422O03600R99336Q38737
$$ 412556725 413987541 414867325 415689316 416658516 417282906 417889328 418492928 419492264 420331001
1301D20331001N67131O80085J09520J79023l93142m97399m29840l54347M38232K55509
$$ 420331001 420898132 421578217 421687737 421866760 421473618 420976219 420546379 420192032 420630264 420885773
1310.6D20885773j2284o58722q69293q62198n49125Q5983K29988O71120R12094J341476
$$ 420885773 420873489 420214767 419345474 418483276 417934151 418020134 418250122 418921242 419833336 421174812
1320.3D21174812J048394Q46862M50669P1144Q41827R02672J061287O37245L35808
$$ 421174812 422223206 423070068 423520737 423591881 424433708 425336380 426397667 427034912 427370720
1328.9D27370720j4038l89557l68843j164475q78601k39982j2322k85949J57241M46778
$$ 427370720 427356682 426967125 426598282 425433807 424555206 424315224 424302902 424016953 424174194 424620972
1338.6D24620972k68708J5717l42484M16565Q43201J105957J296730L93639N92155
$$ 424620972 424352264 424367981 424025497 424442062 425285263 426391220 427687950 428081589 428673744
1347.3D28673744K99835R3689m36935n68695k53372K2926M59633m33197m49181m07066
$$ 428673744 428973579 429067268 428630333 428061638 427808266 427831192 428290825 427857628 427408447 427001381
1356.9D27001381l71399o65092o79360m49066o79169R5864p81479M1504N4855r71298
$$ 427001381 426629982 425964890 425285530 424836464 424157295 424253159 423471680 423513184 423568039 422596741
1366.6D22596741r00536j261368o69021k80838K15759j53732l52784l33442q69179
$$ 422596741 421696205 420434837 419765816 419484978 419700737 419547005 419194221 418860779 417991600
1375.2D17991600K5787o92901r90486p41120j63841l14140r81522j230659j823121
$$ 417991600 418017387 417324486 416334000 415592880 415429039 415114899 414133377 412902718 411079597
1383.9D11079597j527328j855850j747475k526474j696091n98678j266976j618232
$$ 411079597 409552269 407696419 405948944 403422470 401726379 401127701 399860725 398242493
1391.6C98242493k404290j909637k976227m166107j599617j581078j871070l001252
$$ 398242493 395838203 393928566 390952339 386786232 385186615 383605537 381734467 378733215
1399.3C78733215k149162j292267k126465k671547k435569l105889k345886o04896
$$ 378733215 376584053 375291786 373165321 370493774 368058205 364952316 362606430 362001534
1407.1C62001534j233788j581574j262359j871033j722450j704254j353226p39479
$$ 362001534 360767746 359186172 357923813 356052780 354330330 352626076 351272850 350533371
1414.8C50533371m45519n53894r68971J21346j231385j90J213150K40631O09665M88357
$$ 350533371 350087852 349533958 348564987 348686333 347454948 347454758 348667908 348908539 349518204 350006561
1424.4C50006561J528092J418037O83060J324081P79267Q58497Q51479J727714J808129
$$ 350006561 351534653 352952690 353635750 354959831 355739098 356597595 357449074 359176788 360984917
1433.1C60984917J744079K316437J312866J387329J989060K505455J359978J210289
$$ 360984917 362728996 365045433 366358299 367745628 369734688 372240143 373600121 374810410
1440.8C74810410J856231J375046K117920J352463J352272J229553P33452L5438R48830
$$ 374810410 376666641 378041687 380159607 381512070 382864342 384093895 384827347 384862785 385811615
1449.5C85811615J755142J001778J772499R80301J621246J703377Q28323J458969j522331
$$ 385811615 387566757 388568535 390341034 391321335 392942581 394645958 395474281 396933250 395410919
1458.2C95410919K960510J698456K257729J722870J458397K301941k05040K003555
$$ 395410919 398371429 400069885 402327614 404050484 405508881 407810822 407605782 409609337
1465.9D09609337J838722K227669K838669L203239L792534K592239K635079J714744
$$ 409609337 411448059 413675728 416514397 419717636 423510170 426102409 428737488 430452232
1473.6D30452232L775330L499527K213707K981262L120346L039437K655029K113342
$$ 430452232 434227562 437727089 439940796 442922058 446042404 449081841 451736870 453850212
1481.3D53850212J761551J797943J424751J620102K001191J346397J301155K296829
$$ 453850212 455611763 457409706 458834457 460454559 462455750 463802147 465103302 467400131
1489D67400131K9984j934319J76621j19553j088600q82416p29599n128212L69797j507263
$$ 467400131 467430115 465495796 465672417 465552864 464464264 463581848 462852249 457724037 458093834 456586571
1498.7D56586571m708672q90922j957703k186241j737175M10423j69639m831048l308448
$$ 456586571 451877899 450986977 449029274 446843033 445105858 445516281 445346642 440515594 437207146
1507.3D37207146j00518K199021j206970N55343n95779j448555M08668q99582m73442
$$ 437207146 437106628 439305649 438098679 438654022 438058243 436609688 437018356 436118774 435645332
1516D35645332k254104k169800J067696J054077r70497l528252J086540K068367K151642
$$ 435645332 433391228 431221428 432289124 433343201 432372704 428844452 429930992 431999359 434151001
1524.7D34151001L58925J097488R65920L21541J535873J336403J556740J869583J946297
$$ 434151001 434509926 435607414 436573334 436894875 438430748 439767151 441323891 443193474 445139771
1533.4D45139771n48249J716309J698990J058197J959533l286323j374664M283409
$$ 445139771 444591522 446307831 448006821 449065018 451024551 447738228 446363564 450646973
1541.1D50646973K809944J340217J176033R15261r89647J645927Q34351J137543O48460
$$ 450646973 453456917 454797134 455973167 456888428 455898781 457544708 458379059 459516602 460165062
1549.8D60165062j55029J743049R68628R19113k668342J72615J731224J092911m649659
$$ 460165062 460010033 461753082 462721710 463640823 460972481 461145096 462876320 463969231 459319572
1558.5D59319572j1972312P109642O58607Q88214j486664k211456m301643l191147
$$ 459319572 447347260 454456902 455115509 456003723 454517059 452305603 448003960 444812813
1566.2D44812813n12772j993789j196175q841782k088813k428399m448471l514213
$$ 444812813 444300041 442306252 441110077 432268295 430179482 427751083 423302612 419788399
1573.9D19788399m028626k170257j3613205j140557l134651m627609m461708o620979
$$ 419788399 415759773 413589516 399976311 398835754 395701103 391073494 386611786 379990807
1581.6C79990807m551049o596260m006386o050415n065879m524308n753631m134712
$$ 379990807 375439758 368843498 364837112 358786697 353720818 349196510 343442879 339308167
1589.3C39308167o993599l515320n807076l795852m754067n638885k910996n450096
$$ 339308167 332314568 328799248 322992172 319196320 314442253 308803368 305892372 300442276
1597C00442276k687836n820751k941341l921624l903541k901707m857712r62791m244022
$$ 300442276 297754440 291933689 288992348 285070724 281167183 278265476 273407764 272444973 268200951
1605.7B68200951j820870m027691k033920j583080l026390L57456l144951J56879k018871
$$ 268200951 266380081 262352390 260318470 258735390 255709000 256066456 252921505 253078384 251059513
1614.4B51059513L88603j131210o758003L007927j238118J616860j441021J203766
$$ 251059513 251448116 250316906 243558903 246566830 245328712 246945572 245504551 246708317
1622.1B46708317l01590j618767K070770n71880K482872j241608K033806K54345R02386
$$ 246708317 246406727 244787960 246858730 246286850 248769722 247528114 249561920 249816265 250718651
1630.8B50718651J797504J73321L125839o4754L526459r34659L409901K123833J563320
$$ 250718651 252516155 252689476 255815315 255750561 259277020 258342361 261752262 263876095 265439415
1639.5B65439415L506699Q62140L573437Q61664K478771J489296p36179M009456m16851
$$ 265439415 268946114 269808254 273381691 274243355 276722126 278211422 277475243 281484699 281067848
1648.1B81067848M247036O62899L260632J499576o756668L649731J149425M139214
$$ 281067848 285314884 285977783 289238415 290737991 283981323 287631054 288780479 292919693
1655.9B92919693K56004K152062Q41408J968402K331868J270561L005180k43358M192638
$$ 292919693 293175697 295327759 296169167 298137569 300469437 301739998 304745178 304501820 308694458
1664.5C08694458K533798L736611L763237K925758M904671J695251N751610L202972
$$ 308694458 311228256 314964867 318728104 321653862 326558533 328253784 334005394 337208366
1672.3C37208366M922600L982125L921813N701371L869362N919990L962212M912529
$$ 337208366 342130966 346113091 350034904 355736275 359605637 365525627 369487839 374400368
1680C74400368L644600N664520O470489J811257P348709M843445P189560M698677N117187
$$ 374400368 378044968 383709488 390179977 391991234 399339943 404183388 411372948 416071625 421188812
1688.6D21188812O152230N431518O156960N118560O218911O268768O290588L640786
$$ 421188812 427341042 432772560 438929520 444048080 450266991 456535759 462826347 466467133
1696.4D66467133O434440O293793N459747M377022K375908Q816376O470985N130310
$$ 466467133 472901573 479195366 484655113 489032135 491408043 500224419 506695404 511825714
1704.1E11825714L936310L732490L102112L632317M785004L495750L189545L869094
$$ 511825714 515762024 519494514 522596626 526228943 531013947 534509697 537699242 541568336
1711.8E41568336M075737L313714R78431J390190M312516K917099l763237M577751
$$ 541568336 545644073 548957787 549936218 551326408 555638924 558556023 554792786 559370537
1719.5E59370537M889030L398323K331620J427841Q27446J352920J729088J505470
$$ 559370537 564259567 567657890 569989510 571417351 572244797 573597717 575326805 576832275
1727.2E76832275K195435K641449Q90579J258354M278984L964234k597084m125366
$$ 576832275 579027710 581669159 582559738 583818092 588097076 592061310 589464226 585338860
1734.9E85338860M855079M704323L012161L804817J981583L8147L930588K309227P05566
$$ 585338860 590193939 594898262 597910423 601715240 603696823 603734970 607665558 609974785 610680351
1743.6F10680351K020912L850022L381996L120575L421211J879501M764710J077995
$$ 610680351 612701263 616551285 619933281 623053856 626475067 628354568 633119278 634197273
1751.3F34197273R46503M717026L525734M178619L657227J157302K397233L095703
$$ 634197273 635143776 639860802 643386536 647565155 651222382 652379684 654776917 657872620
1759F57872620K130050L161011n49087N51071M186706J885300K156982K500153K100296
$$ 657872620 660002670 663163681 662614594 663165665 667352371 669237671 671394653 673894806 675995102
1767.7F75995102j368637J790848L610992p97577p09305K30561N263290K646179q53653
$$ 675995102 674626465 676417313 680028305 679230728 678521423 678751984 684015274 686661453 685807800
1776.4F85807800K031708J75247J375351P20749K40173J626358K030793K498703k72293
$$ 685807800 687839508 688014755 689390106 690110855 690351028 691977386 694008179 696506882 696234589
1785.1F96234589K45056J171951Q88443M13132J462250J437530M18625o80313M9820
$$ 696234589 696479645 697651596 698540039 698953171 700415421 701852951 702271576 701591263 701641083
1793.8G01641083L645401Q72802m90798J356201J721649O55594l73154K990646J76697
$$ 701641083 705286484 706159286 705668488 707024689 708746338 709401932 709028778 712019424 712196121
1802.4G12196121L55454J499786J72348M86908O4163R68552J475372K020188l46146
$$ 712196121 712551575 714051361 714223709 714710617 714774780 715743332 717218704 719238892 718892746
1811.1G18892746M00467J334457q3847M32816r3765J481552O70318J170578J543579
$$ 718892746 719293213 720627670 720543823 720976639 720882874 722364426 723034744 724205322 725748901
1819.8G25748901Q7357P36160r64889P65762N03693k057343J660614K920456K392502
$$ 725748901 725836258 726572418 725607529 726373291 726876984 724819641 726480255 729400711 731793213
1828.5G31793213o58875l126449P20138J895066J98898N62897J135711J220856R57184
$$ 731793213 731134338 728007889 728728027 730623093 730821991 731384888 732520599 733741455 734698639
1837.2G34698639j75781J182632n74951p4234M68445O75125P37991l723526L052674
$$ 734698639 734522858 735705490 735130539 735056305 735524750 736199875 736937866 733214340 736267014
1845.8G36267014K541961m6997o04858m7760M02755k24151J156387M85611J060181
$$ 736267014 738808975 738761978 738157120 738109360 738512115 738287964 739444351 739929962 740990143
1854.5G40990143R81140L50723Q5144j020965K13699O2027P05032L05634Q57315J321030
$$ 740990143 741971283 742322006 742407150 741386185 741599884 741661911 742366943 742672577 743529892 744850922
1864.2G44850922M13589O18134q67157P9956j440583r04388J305847J284409J341858
$$ 744850922 745264511 745882645 745015488 745095444 743654861 742750473 744056320 745340729 746682587
1872.8G46682587K38113M77142p87277j12762j60904l33252P82776K25677J279373
$$ 746682587 746920700 747397842 746610565 746497803 746336899 746003647 746786423 747012100 748291473
1881.5G48291473N43671O48727l56216r67178M7760k69394J200943m3259o12183R41163
$$ 748291473 748835144 749483871 749127655 748160477 748208237 747938843 749139786 749096527 748484344 749425507
1891.2G49425507R03091Q8272j16424n58701j088867J122207N40619O44074M25415
$$ 749425507 750328598 750416870 750300446 749741745 748652878 749775085 750315704 750959778 751385193
1899.8G51385193L5858N18951n96847j13907o09817L37982P69119M56314Q81958L88107
$$ 751385193 751421051 751940002 751343155 751229248 750619431 750957413 751726532 752182846 753064804 753452911
1909.5G53452911k67868j291122P3395l44315K60468Q31909Q98514J890030j601334
$$ 753452911 753185043 751893921 751967316 751623001 751883469 752715378 753613892 755503922 753902588
1918.2G53902588q38928K23694l17078J52o85577M49600J116257J037064n0278L05557
$$ 753902588 753063660 753287354 752970276 752970428 752284851 752734451 753850708 754887772 754837494 755143051
1927.8G55143051n05295p68661j85013q39004K84957N24750J384354O36596l76434
$$ 755143051 754637756 753869095 753684082 752845078 753130035 753654785 755039139 755675735 755299301
1936.5G55299301o16150o05621J08566q03451Q40149j72959p60879J848449P24335
$$ 755299301 754683151 754077530 754186096 753382645 754222794 754049835 753288956 755137405 755861740
1945.2G55861740o32706j348724k78625q3313J63040L60565N41916R85184J08795n7144
$$ 755861740 755229034 753880310 753601685 753518372 753681412 754041977 754583893 755569077 755677872 755620728
1954.8G55620728r50165n55420o29883m18396P29446N52216N87082o7444K90680m31900
$$ 755620728 754670563 754115143 753485260 753066864 753796310 754348526 754935608 754868164 755158844 754726944
1964.5G54726944p72629n48324q70057K17286N61065J102448L96271K71072j39160
$$ 754726944 753954315 753405991 752535934 752753220 753314285 754416733 754813004 755084076 754944916
1973.1G54944916o11420k87399o23551p5760k15988R31015Q52433J86157Q8959q19169
$$ 754944916 754333496 754046097 753422546 753346786 753130798 754061813 754914246 755100403 755189362 754370193
1982.8G54370193n39779p99561J0987L8910L53622O61545r918N63659o34689j181870
$$ 754370193 753830414 753030853 753041840 753080750 753434372 754095917 754085999 754649658 754014969 752833099
1992.4G52833099n14907M2190n569M24118Q99429K6474J09634n77316k42996m35486
$$ 752833099 752318192 752360382 752354813 752778931 753678360 753704834 753814468 753237152 752994156 752558670
2002.1G52558670o06918m9057q2779O31790L1738L20206j48239o68946p27844p66907
$$ 752558670 751951752 751902695 751819916 752451706 752483444 752803650 752655411 751986465 751258621 750491714
2011.7G50491714L47825l28522L204O92444P55234l12576p31583r6131o82754p6981
$$ 750491714 750839539 750511017 750514221 751206665 751961899 751649323 750917740 750821609 750138855 750061874
2021.3G50061874k7389L81470O3934j68305L78113k60620j17645m98428k81830l52707
$$ 750061874 750034485 750415955 750479889 750311584 750689697 750429077 750311432 749813004 749531174 749178467
2031G49178467J72272N93643r842J02920n32074m35485o48194j25961k8000p3547K83508
$$ 749178467 749350739 749944382 749934540 750037460 749505386 749069901 748421707 748295746 748267746 748194199 748477707
2041.6G48477707p4921N44052m85687m08172o42472m77905O24847J38169K81295m71267
$$ 748477707 748402786 748946838 748461151 748052979 747410507 746932602 747557449 747695618 747976913 747505646
2051.2G47505646M16183O2256o43768j10932l42941M93240j39312K14157K08282Q1864
$$ 747505646 747921829 747984085 747340317 747229385 746886444 747379684 747240372 747454529 747662811 747744675
2060.9G47744675J47247m41742l6926p69654m45709R6588Q50373L57589j51214K62832
$$ 747744675 747891922 747450180 747413254 746643600 746197891 746294479 747144852 747502441 747351227 747614059
2070.5G47614059q14209m47082n70908L8071L99399N23834O46744m41208r079m48456
$$ 747614059 746799850 746352768 745781860 745819931 746219330 746743164 747389908 746948700 746939621 746491165
2080.2G46491165l94592o18286l48282L44772M19312Q82492j11084Q0795m52499o07910
$$ 746491165 746096573 745478287 745130005 745474777 745894089 746776581 746665497 746746292 746293793 745685883
2089.8G45685883m10767m25110P7896j65710R63135K21328m0893k56729p96967k35443
$$ 745685883 745275116 744850006 744927902 744762192 745725327 745946655 745905762 745649033 744852066 744616623
2099.5G44616623p66296l88947m56161Q05511Q64792J12381J49078q04748m12674o95572
$$ 744616623 743850327 743461380 743005219 743810730 744675522 744787903 744936981 744132233 743719559 743023987
2109.1G43023987k59018J4953N08271M82101l25775J87454m28085P935l64762m68445
$$ 743023987 742764969 742779922 743288193 743770294 743444519 743631973 743203888 743211823 742847061 742378616
2118.7G42378616l3722M0894N91660J26724M89120l30276n44281o41556n85938J10856
$$ 742378616 742344894 742385788 742977448 743104172 743593292 743263016 742718735 742077179 741491241 741602097
2128.4G41602097k48337P33642N83802K77633j58539k45361q4610m07715K0294k33840
$$ 741602097 741353760 742087402 742671204 742948837 742790298 742544937 742460327 742052612 742072906 741839066
2138G41839066M42810J37863N25818M34799m59900L3722p28912j9227K4033J39160
$$ 741839066 742281876 742419739 742945557 743380356 742920456 742954178 742225266 742206039 742230072 742369232
2147.7G42369232O82068K59476p8430m88968J19247m54101p2632J01013J3580J58158
$$ 742369232 743051300 743310776 743232346 742743378 742862625 742408524 742335892 742436905 742450485 742608643
2157.3G42608643k54517M61807p4005r7656m38614J13296L35923m42200O51550M08631
$$ 742608643 742354126 742815933 742741928 742644272 742205658 742318954 742654877 742212677 742864227 743272858
2167G43272858K90146m23508k04086K8839m71802K08130j99280N98450N25665K04163
$$ 743272858 743563004 743139496 742935410 742964249 742492447 742700577 742501297 743099747 743625412 743829575
2176.6G43829575K1820k63749j46865o75583K30407J94474K84958J14746N5923K06146
$$ 743829575 743851395 743587646 743440781 742765198 742995605 743190079 743475037 743589783 743645706 743851852
2186.3G43851852m02450K73743j43433k24381p9803L78647L97720j13754P324n95856
$$ 743851852 743449402 743723145 743579712 743355331 743275528 743654175 744051895 743938141 743945465 743349609
2195.9G43349609k0752k38723J15356M60816K96249O67419L4562J32904m50974J4649
$$ 743349609 743328857 743090134 743205490 743666306 743962555 744629974 744664536 744797440 744346466 744361115
2205.5G44361115p935k76413K88849j71433N19028L49197J64948k71378l98025j30844
$$ 744361115 744353180 744076767 744365616 744194183 744713211 745062408 745227356 744955978 744557953 744427109
2215.2G44427109k92740K65045N5237O06232M27856J41907k42157m34723j10016q18176
$$ 744427109 744134369 744399414 744454651 745060883 745488739 745630646 745388489 744953766 744843750 744025574
2224.8G44025574n188K20489O45142N02243r003K69623m04892m18625q87909j68304
$$ 744025574 744020386 744240875 744886017 745388260 745379257 745648880 745243988 744825363 743937454 743769150
2234.5G43769150K27203J92566N08804K50092M05884l02887o4316l65524k44599p095
$$ 743769150 743996353 744188919 744697723 744947815 745353699 745050812 744986496 744620972 744376373 744369278
2244.1G44369278j05667N49011J6022N36117n5694o33774n90744l72009M85840k7771
$$ 744369278 744263611 744812622 744828644 745364761 745309067 744675293 744084549 743712540 744198380 744170609
2253.8G44170609L26004M25338L32337j73340l18375m65393p80029K48413n0964L58505
$$ 744170609 744496613 744921951 745254288 745080948 744762573 744297180 743517151 743765564 743714600 744073105
2263.4G44073105L69186K73819J8387n79300j21765p50046j44729J01547K67410J88141
$$ 744073105 744442291 744716110 744734497 744155197 744033432 743283386 743138657 743240204 743507614 743695755
2273G43695755M0054M54789l09372j96991n10636j0223k86408k91977M89350J39694
$$ 743695755 743735809 744190598 743881226 743684235 743173599 743163376 742876968 742584991 743074341 743214035
2282.7G43214035N55267l90167j16501l30047p36618l43399l73154M41818j49994O83518
$$ 743214035 743769302 743379135 743262634 742932587 742195969 741852570 741479416 741921234 741771240 742454758
2292.3G42454758Q4152p16400k91825n76934k36512q07418M42504K50550R5443J7777
$$ 742454758 742538910 741822510 741530685 740953751 740717239 739909821 740352325 740602875 740698318 740716095
2302G40716095q51669m02222j210175m5089p6828l6240K9144k77786K15225j051254
$$ 740716095 739864426 739462204 738252029 738206940 738130112 738093872 738123016 737845230 738060455 737009201
2311.6G37009201K29034n81817o78101L37982l52554m84619j113205M62723k15149
$$ 737009201 737238235 736656418 735978317 736316299 735963745 735479126 734365921 734828644 734613495
2320.3G34613495q74939q38928l69950n62362j333161J308060J52206q99810j320496
$$ 734613495 733738556 732899628 732529678 731967316 730634155 731942215 732094421 731194611 729874115
2329G29874115j58768J29319r12552N05600j103287M65240o1874n11017N68161o27670
$$ 729874115 729715347 729844666 728932114 729437714 728334427 728799667 728737793 728226776 728794937 728167267
2338.6G28167267j7929n61218l50419n62973K14920k66342O27442J153412k46888R27811
$$ 728167267 728149338 727588120 727237701 726674728 726889648 726623306 727250748 728404160 728157272 729085083
2348.3G29085083L93219k36206k205429j909180O72531N4322p64618j337662M85611
$$ 729085083 729478302 729242096 727036667 725127487 725800018 725854340 725089722 723752060 724237671
2356.9G24237671j753235j326752j36337J96533J455536j638260k66876n89676k56195
$$ 724237671 722484436 721157684 721021347 721217880 722673416 721035156 720768280 720178604 719922409
2365.6G19922409j009903K51999K843552J382522J843567j27411n47638J71204P72552
$$ 719922409 718912506 719164505 722008057 723390579 725234146 725106735 724559097 724730301 725502853
2374.3G25502853j5792o15921R54513O04553O78864J43814K02789L00751q5678j43662
$$ 725502853 725487061 724871140 725825653 726430206 727109070 727252884 727455673 727756424 727670746 727527084
2383.9G27527084m76455J60064j43814L06549J23215k86636L4637q50677n03464n84488
$$ 727527084 727050629 727210693 727066879 727373428 727496643 727210007 727244644 726393967 725890503 725306015
2393.6G25306015m22974j87454j24893K49939o0120j19018m60663l80783o24542l47443
$$ 725306015 724883041 724695587 724570694 724820633 724760513 724641495 724180832 723800049 723175507 722828064
2403.2G22828064l42178j38932O45676k08817m39682m42504J17797l77807j029892
$$ 722828064 722485886 722346954 722992630 722783813 722344131 721901627 722019424 721641617 720611725
2411.9G20611725n96314o30874K70004M0436J8234j68610m86221n66635j047592n01709
$$ 720611725 720015411 719384537 719654541 719694977 719713211 719544601 719058380 718491745 717444153 716942444
2421.6G16942444m88587M50287L15934j98441R5444m87671o44531p92695m52041j025009
$$ 716942444 716453857 716904144 717220078 717021637 717117081 716629410 715984879 715192184 714740143 713715134
2431.2G13715134o00129J76697J984M2877o01196l45993q19702o77033o4010L3950
$$ 713715134 713115005 713291702 713293686 713336563 712735367 712389374 711569672 710892639 710828629 710862579
2440.8G10862579K9602n02777j64566m80499k24838p09000r48639k17972m35638K76489
$$ 710862579 710892181 710389404 710224838 709744339 709519501 708810501 707861862 707643890 707208252 707484741
2450.5G07484741N3711j95770n41992q09937o13479p87735m95224n73502Q2321J00784
$$ 707484741 707538452 707342682 706800690 705990753 705377274 704589539 704094315 703520813 703603134 703703918
2460.1G03703918l17916n86167n00641j72729p97882r02939j028290n417L63465k94266
$$ 703703918 703386002 702799835 702299194 702126465 701328583 700425644 699397354 699391937 699755402 699461136
2469.8F99461136l52860o36825k87171m92935m85306m84390l89557l71933l54461J32980
$$ 699461136 699108276 698471451 698184280 697691345 697206039 696721649 696332092 695960159 695605698 695738678
2479.4F95738678n19867p61719j026153m25110j78757q24051l79867l20282j64032
$$ 695738678 695218811 694457092 693430939 693005829 692827072 692003021 691623154 691302872 691138840
2488.1F91138840l60794r8191o36367j348496o51779o06918j39695L1510l82767q28018
$$ 691138840 690778046 690679855 690043488 688694992 688043213 687436295 687296600 687328110 686945343 686117325
2497.7F86117325n25208m97436q26645m92859n74799k70843n83572k2431M4251p28226
$$ 686117325 685592117 685094681 684268036 683775177 683200378 682929535 682345963 682323532 682367783 681639557
2507.4F81639557l51715r56421q55789n43747k60086k53601m36707m61121p50961j66778
$$ 681639557 681287842 680331421 679475632 678931885 678671799 678418198 677981491 677520370 676769409 676602631
2517F76602631p25556p34863l97873n12619l80936l81622Q4457m04434l37753n26581
$$ 676602631 675877075 675142212 674744339 674231720 673850784 673469162 673553619 673149185 672811432 672284851
2526.7F72284851p98035n21240n48324Q4610k1210n57099q76846l35770m41970o76957
$$ 672284851 671486816 670965576 670417252 670501862 670480652 669923553 669046707 668710937 668268967 667592010
2536.3F67592010l26843n94940k58484m44946k08969n42832p06024p4615o47354o41098
$$ 667592010 667265167 666670227 666411743 665966797 665757828 665214996 664508972 664434357 663787003 663145905
2546F63145905p21055l49273o1875K6398m00848j021653l90243n38254l17612m01916
$$ 663145905 662424850 662075577 662013702 662040100 661639252 660617599 660227356 659689102 659371490 658969574
2555.6F58969574n70145m83780l74755j20621n00336j67770o39954l42712j05362p72324
$$ 658969574 658399429 657915649 657540894 657420273 656919937 656752167 656112213 655769501 655664139 654891815
2565.2F54891815n32684n55115l37677n69534k76108k65579l48511l15857p36313m58145
$$ 654891815 654359131 653804016 653466339 652896805 652620697 652355118 652006607 651690750 650954437 650496292
2574.9F50496292p32956l5477k63290p92923k96707n36652n62515r07669m68140k62069
$$ 650496292 649763336 649727859 649464569 648671646 648374939 647838287 647275772 646368103 645899963 645637894
2584.5F45637894j50376j36337m26025k35596n13535j77002m36096p56302r82513p03583
$$ 645637894 645487518 645351181 644925156 644689560 644176025 643999023 643562927 642806625 641824112 641120529
2594.2F41120529j29318k89993o9962n69000n64728r07364m77562P6523q90121n80826
$$ 641120529 640991211 640701218 640631256 640062256 639497528 638590164 638112602 638189125 637299004 636718178
2603.8F36718178m12598j38130n39322q84361q05092n39742R8992o31600j92566o16378
$$ 636718178 636305580 636167450 635628128 634743767 633938675 633398933 633497925 632866325 632673759 632057381
2613.5F32057381j029663k12632m31480p34215p89566o5269n65758n73120k50969o34194
$$ 632057381 631027718 630815086 630383606 629649391 628859825 628794556 628228798 627655678 627404709 626770515
2623.1F26770515l11126n91851q85772j222954l74298q1635n20782l47633n58510l38059
$$ 626770515 626459389 625867538 624981766 623758812 623384514 623302879 622782097 622434464 621875954 621537895
2632.8F21537895r20410r26514o09245k78549J7738l63083k61497q19168p28455o39953
$$ 621537895 620617485 619690971 619081726 618803177 618820915 618457832 618196335 617377167 616648712 616008759
2642.4F16008759p59316o25420q28247l65142j59150k16064l38707k58675m72831p32308
$$ 616008759 615249443 614624023 613795776 613430634 613271484 613055420 612716713 612458038 611985207 611252899
2652F11252899p35168m17214k19879p15866j85204m47158o02494k07519n37033o85120
$$ 611252899 610517731 610100517 609880638 609164772 608979568 608532410 607929916 607722397 607185364 606500244
2661.7F06500244q86307j94854j70746l02887k96898k50511k03896q62655n24254o72264
$$ 606500244 605613937 605419083 605248337 604945450 604648552 604398041 604194145 603331490 602807236 602134972
2671.3F02134972k92550j29852l20892K33116r0981k43263j097603p54394q6365q02765
$$ 602134972 601842422 601712570 601391678 601624794 601533813 601290550 600192947 599438553 599352188 598549423
2681E98549423m56123O5498k50091n92614j04370k32277l54957n71098o28434k79045
$$ 598549423 598093300 598158798 597908707 597316093 597211723 596979446 596624489 596053391 595424957 595145912
2690.6E95145912r07020o04668p1564L84751j94130p48101m87251q62503j78261j91231
$$ 595145912 594238892 593634224 593562660 593947411 593753281 593005180 592517929 591655426 591477165 591285934
2700.3E91285934n1307j22910p87658n44968l10021m0779p75833m14657k1019k77672
$$ 591285934 591234627 591111717 590324059 589779091 589469070 589428291 588652458 588237801 588216782 587939110
2709.9E87939110o1455m10309l83339m89883k44522m06189m42810m16222o41212j72158
$$ 587939110 587877655 587467346 587084007 586594124 586349602 585943413 585500603 585084381 584443169 584271011
2719.5E84271011j91574m5471l92075k77214n77125o86836L54309k59743o21758p07244
$$ 584271011 584079437 584033966 583641891 583364677 582787552 582100716 582455025 582195282 581573524 580866280
2729.2E80866280j86158P0687m04015m51240n98946J31073O5575k1668l72391m72526
$$ 580866280 580680122 580750809 580346794 579895554 579296608 579427681 579493256 579471588 579099197 578626671
2738.8E78626671K23694l39508m43764n35774j63079m8904l68500Q7815k14386m10119
$$ 578626671 578850365 578510857 578067093 577531319 577368240 577319336 576950836 577038651 576824265 576414146
2748.5E76414146k00386j95617p06673n90744r3880j37100k38533l56445j02120l02200
$$ 576414146 576213760 576018143 575311470 574720726 574626846 574489746 574251213 573894768 573792648 573490448
2758.1E73490448m47273m15726l11508m85420m81110Q6441m13094l93066l22418m78516
$$ 573490448 573043175 572627449 572315941 571830521 571349411 571435852 571022758 570629692 570307274 569828758
2767.8E69828758m44641m21142K51121J37596l01742o85959o56319p15675p59964k78054
$$ 569828758 569384117 568962975 569214096 569351692 569049950 568363991 567707672 566991997 566232033 565953979
2777.4E65953979l51867j72425k15339l55606n36270o45485n99099p47756n29976l41607
$$ 565953979 565602112 565429687 565214348 564858742 564322472 563676987 563077888 562330132 561800156 561458549
2787E61458549j75971p57027p09725l08609n95588o12870q51516o05889j50528j28479
$$ 561458549 561282578 560525551 559815826 559507217 558911629 558298759 557447243 556841354 556690826 556562347
2796.7E56562347j055183r64775l18451p09343l34930p37801j030731r43680o10504
$$ 556562347 555507164 554542389 554223938 553514595 553179665 552441864 551411133 550467453 549856949
2805.4E49856949m35257j039429m40063l13874o24504j263618j007652m60015j195335
$$ 549856949 549421692 548382263 547942200 547628326 547003822 545740204 544732552 544272537 543077202
2814E43077202j050835q51669q3428k82974r98115p50466j060524j211471j191788
$$ 543077202 542026367 541174698 541091270 540808296 539810181 539059715 537999191 536787720 535595932
2822.7E35595932n26466q68721j112214o81571q76198q12416j324730r02138q78105
$$ 535595932 535069466 534200745 533088531 532406960 531530762 530718346 529393616 528491478 527613373
2831.4E27613373j260224n75866n80635r10569j112709j058387j408348j590424j579056
$$ 527613373 526353149 525777283 525196648 524286079 523173370 522114983 520706635 519116211 517537155
2840.1E17537155j794624j789246j716537j742897k047959j645698j798554k150497
$$ 517537155 515742531 513953285 512236748 510493851 508445892 506800194 505001640 502851143
2847.8E02851143k150040k496490k241745k308693j709213o78978n17426n02281o59981
$$ 502851143 500701103 498204613 495962868 493654175 491944962 491265984 490748558 490246277 489586296
2856.5D89586296n55878P439L71323J49192m44259q28858n46493q57926p57865m94309
$$ 489586296 489030418 489037857 489409180 489558372 489114113 488285255 487738762 486880836 486122971 485628662
2866.1D85628662j168632j163712j582642q44879j31569j019058j134987j189842r43298
$$ 485628662 484460030 483296318 481713676 480868797 480737228 479718170 478583183 477393341 476450043
2874.8D76450043q23670k05536k43148j233406j033478r95293o69556q05206j207466
$$ 476450043 475626373 475420837 475177689 473944283 472910805 471915512 471245956 470440750 469233284
2883.5D69233284q77686q58078j053314q16421m35448j331024j731224j126175o58760
$$ 469233284 468355598 467497520 466444206 465627785 465192337 463861313 462130089 461003914 460345154
2892.2D60345154m59404r71832j249085o45637n92499j637802j394501q89893r85183
$$ 460345154 459885750 458913918 457664833 457019196 456426697 454788895 453394394 452504501 451519318
2900.8D51519318q61664n05371j69716p17926o51665j268272j398621r27315j209030
$$ 451519318 450657654 450152283 449982567 449264641 448612976 447344704 445946083 445018768 443809738
2909.5D43809738m80537j422539j858749j305390j532783j592293j869850j255837
$$ 443809738 443329201 441906662 440047913 438742523 437209740 435617447 433747597 432491760
2917.2D32491760j486892j918030j717377j178207q03261r31778n46570j280479j053620
$$ 432491760 431004868 429086838 427369461 426191254 425387993 424456215 423909645 422629166 421575546
2925.9D21575546J7357L03345J92947K26326L52364j86157N05218J94016k27204M16718
$$ 421575546 421592903 421896248 422089195 422315521 422667885 422481728 422986946 423180962 422953758 423370476
2935.6D23370476K52571P59048Q02155P35359J069832R95064O03676O05125J020546
$$ 423370476 423623047 424382095 425184250 425919609 426989441 427984505 428588181 429193306 430213852
2944.2D30213852P76329M05235L82347P53479N98412Q90312J361923J026116L13034
$$ 430213852 430990181 431395416 431777763 432531242 433129654 434019966 435381889 436408005 436721039
2952.9D36721039m20838M33464Q67424P43752L27797K29034R79538N33371P02477O11191
$$ 436721039 436300201 436733665 437601089 438344841 438672638 438901672 439881210 440414581 441117058 441728249
2962.6D41728249M79354P23191M96940N23148J49498N32112Q29659Q22715P59774N40123
$$ 441728249 442207603 442930794 443427734 443950882 444100380 444632492 445462151 446284866 447044640 447584763
2972.2D47584763N27153Q46748J125755J03607M62456J008797N79681N58510l700J93863
$$ 447584763 448111916 448958664 450084419 450188026 450650482 451659279 452238960 452797470 452793770 452987633
2981.8D52987633M27131O8970J65596P78999Q28591J75857l91426j29051O43807K00996
$$ 452987633 453414764 453483734 453649330 454428329 455256920 455432777 455041351 454912300 455556107 455757103
2991.5D55757103J35994k38228p53975l36990j10474M71077k04506q18405l88641K6512
$$ 455757103 455893097 455654869 454900894 454563904 454453430 454924507 454720001 453901596 453512955 453539467
3001.1D53539467k53296q28857n32647r73510o40793l65830p99370l97796l14560k63138
$$ 453539467 453286171 452457314 451924667 450951157 450310364 449944534 449145164 448747368 448432808 448169670
3010.8D48169670m60014n80330p25975q84171j104049r80721m46548q50144p56798
$$ 448169670 447709656 447129326 446403351 445519180 444415131 443434410 442987862 442137718 441380920
3019.5D41380920m08592m92172q96339r75457q94546j088906o32057q98704r61952
$$ 441380920 440972328 440480156 439583817 438608360 437713814 436624908 435992851 435094147 434132195
3028.1D34132195p80182p50046p09191j040534m99688p24525j301842j056976q73490
$$ 434132195 433352013 432601967 431892776 430852242 430352554 429628029 428326187 427269211 426395721
3036.8D26395721j372528j091423j71508r58100j128769r32617j095123j032906j111183
$$ 426395721 425023193 423931770 423760262 422802162 421673393 420740776 419645653 418612747 417501564
3045.5D17501564o60248o33850q84628j244812q79708p96890j335716q70361p82166
$$ 417501564 416841316 416207466 415322838 414078026 413198318 412401428 411065712 410195351 409413185
3054.2D09413185q11615j099472j137695p86095j105270j166954j001435o26220n51644
$$ 409413185 408601570 407502098 406364403 405578308 404473038 403306084 402304649 401678429 401126785
3062.9D01126785r18350j204224o95686m07715r85565p85599o92711q00781q07686
$$ 401126785 400208435 399004211 398308525 397900810 396915245 396129646 395436935 394636154 393828468
3071.5C93828468r91516r05342o36749l73497m47426p74498j065636o60515o51321
$$ 393828468 392836952 391931610 391294861 390921364 390473938 389699440 388633804 387973289 387321968
3080.2C87321968r56650p62710j044426p60994k11792p21092j403351q37555m29115
$$ 387321968 386365318 385602608 384558182 383797188 383585396 382864304 381460953 380623398 380194283
3088.9C80194283j014252r35326o72951n66902p38601q69561n57823n59158o95458
$$ 380194283 379180031 378244705 377571754 377004852 376266251 375396690 374838867 374279709 373584251
3097.6C73584251p03506p62749o63452m43802j098175j293030j014251r02901l03726
$$ 373584251 372880745 372117996 371454544 371010742 369912567 368619537 367605286 366702385 366398659
3106.2C66398659o44722q91266j139717j243515l22533m72450p37534m17823p76673
$$ 366398659 365753937 364862671 363722954 362479439 362156906 361684456 360946922 360529099 359752426
3114.9C59752426j459427r32922l42217o24504r36775j106033o30913r28230j087075
$$ 359752426 358292999 357360077 357017860 356393356 355456581 354350548 353719635 352791405 351704330
3123.6C51704330r50584j278343o98052o43730o20231o15502p79304p90787j424751
$$ 351704330 350753746 349475403 348777351 348133621 347513390 346897888 346118584 345327797 343903046
3132.3C43903046j202355l91083l34892q97598p67860n14374q53081j093140j482429
$$ 343903046 342700691 342309608 341974716 341077118 340309258 339794884 338941803 337848663 336366234
3141C36366234r11751n87921p36847o83556j359062j238098o86684n01747n86700q80890
$$ 336366234 335454483 334866562 334129715 333446159 332087097 330848999 330162315 329660568 329073868 328192978
3150.6C28192978p22923r02443j134873r83734j055794q20617n51186o80122p53441
$$ 328192978 327470055 326567612 325432739 324449005 323393211 322572594 322021408 321341286 320587845
3159.3C20587845r88979j133614j130295r33761o70739p78122o81419p68089j077919
$$ 320587845 319598866 318465252 317334957 316401196 315730457 314952335 314270916 313502827 312424908
3168C12424908r84364o42586q89778j176014o43882o48289p87659q19759p63474o99405
$$ 312424908 311440544 310797958 309908180 308732166 308088284 307439995 306652336 305832577 305069103 304369698
3177.6C04369698j163979q92735p69252j015778j013031q04806m77256p49569j284314
$$ 304369698 303205719 302312984 301543732 300527954 299514923 298710117 298232861 297483292 296198978
3186.3B96198978j193714l29094n41973r31816n69973p82547j039657j119309o11191
$$ 296198978 295005264 294676170 294134197 293202381 292632408 291849861 290810204 289690895 289079704
3195B89079704p61852j055737o72607n18417l26824r02310p03907m68941q89377p47662
$$ 289079704 288317852 287262115 286589508 286071091 285744267 284841957 284138050 283669109 282779732 282032070
3204.6B82032070q38775l77522k51274n68256o20347k88105m85172j401825o22577
$$ 282032070 281193295 280815773 280564499 279996243 279375896 279087791 278602619 277200794 276578217
3213.3B76578217j52092o56109q40988p74155k66495o38504o44913m87518q41885k97222
$$ 276578217 276426125 275770016 274929028 274154873 273888378 273249874 272604961 272117443 271275558 270978336
3222.9B70978336j29108p04117r82571q40129n98889o97269p00283m00982m10729m72126
$$ 270978336 270849228 270145111 269162540 268322411 267723522 267026253 266325970 265924988 265514259 265042133
3232.6B65042133o33030r10606p99503o69308l81241k68860o34365p27482n19085k83947
$$ 265042133 264409103 263498497 262698994 262029686 261648445 261379585 260745220 260017738 259498653 259214706
3242.2B59214706k19001m32549n96142n88646n74741m72393l47271j52359n13725r74026
$$ 259214706 258995705 258563156 257967014 257378368 256803627 256331234 255983963 255831604 255317879 254343853
3251.9B54343853m81968k29111l26767n39417m10709m70219j067257m28371l20950
$$ 254343853 253861885 253632774 253306007 252766590 252355881 251885662 250818405 250390034 250069084
3260.5B50069084q84495q21914n04551J05266j70211m87175k84424j59779k92759n22442
$$ 250069084 249184589 248362675 247858124 247963390 247793179 247306004 247021580 246861801 246569042 246046600
3270.2B46046600l97834l20321j55353m08898n75771k70576m54102p27692p53974p47242
$$ 246046600 245648766 245328445 245173092 244764194 244188423 243917847 243463745 242736053 241982079 241234837
3279.8B41234837k79465K56100m78650o95591j60579k18582l10097o65321m97036n15614
$$ 241234837 240955372 241211472 240732822 240037231 239876652 239658070 239347973 238682652 238185616 237670002
3289.5B37670002k53963M4136o40870j40266k00405o07891r7389k31724o17638m92401
$$ 237670002 237416039 237460175 236819305 236679039 236478634 235870743 235773354 235541630 234923992 234431591
3299.1B34431591r8286m00695l63236l61690o84624j07956j40381n40504n42164k54593
$$ 234431591 234333305 233932610 233569374 233207684 232523060 232415104 232274723 231734219 231192055 230937462
3308.8B30937462l31402r21497m60301j00403n52387n80501k58980Q850k75173m90017
$$ 230937462 230606060 229684563 229224262 229123859 228571472 227990971 227731991 227740841 227465668 226975651
3318.4B26975651N8956q1711p43828q18462p50942o43254m98256l94936p05891r30690
$$ 226975651 227034607 226952896 226209068 225390606 224639664 223996410 223498154 223103218 222397327 221466637
3328.1B21466637m82006q8520j80741n48611o99844q85048n16395n0850l27454n63068
$$ 221466637 220984631 220896111 220715370 220166759 219466915 218581867 218065472 218014622 217687168 217124100
3337.7B17124100r06754r99203j034107m24385L41759n8174m05998o07682m61979n48019
$$ 217124100 216217346 215218143 214184036 213759651 214101410 214043236 213637238 213029556 212567577 212019558
3347.3B12019558n03597k91996m82140j85089p34653o92578j33781m39263j72081l1414
$$ 212019558 211515961 211223965 210741825 210556736 209822083 209129505 208995724 208556461 208384380 208352966
3357B08352966k57206n48648k87648j08928m51947l59058p458j1482p37267j54914
$$ 208352966 208095760 207547112 207259464 207150536 206698589 206339531 206332073 206320591 205583324 205428410
3366.6B05428410M12426n19982n86204j69354k26631l74012k04678r4318J9779j63574
$$ 205428410 205840836 205320854 204734650 204565296 204338665 203964653 203759975 203665657 203685436 203521862
3376.3B03521862l90873J04923P5417j36643k30083k05536J42365J98822n1861o62079
$$ 203521862 203130989 203235912 203311329 203174686 202944603 202739067 202881432 203080254 203028393 202366314
3385.9B02366314p50122M7703M98905j10474k43053K03972l14751p79133m9400R22718
$$ 202366314 201616192 201663895 202162800 202052326 201809273 202013245 201698494 200919361 200869961 201792679
3395.6B01792679M40559o30531m88758J70231J39732k79541m3621J27735L57723o0749
$$ 201792679 202233238 201602707 201113949 201284180 201423912 201144371 201100750 201228485 201586208 201525459
3405.2B01525459n76744L20893L98521l62930n99423m6787M64153K81182m3393k90145
$$ 201525459 200948715 201269608 201668129 201305199 200705776 200658989 201123142 201404324 201360931 201070786
3414.8B01070786R2487M83799N44815K88639L89404L31192k60639O8073o160L80935
$$ 201070786 201163273 201647072 202191887 202480526 202869930 203201122 202940483 203008556 203002396 203383331
3424.5B03383331P51953K75593L39508L12462N79720J02634m22382M08573O59313N95226
$$ 203383331 204135284 204410877 204750385 205062847 205642567 205745201 205322819 205731392 206390705 206985931
3434.1B06985931N53952J23043m0474K39925M59671L22247K35119O55555O15845J78585
$$ 206985931 207539883 207662926 207622452 207862377 208322048 208644295 208879414 209534969 210150814 210329399
3443.8B10329399K32067N01881L96480m31938J151104K109738K60505k9087Q82607
$$ 210329399 210561466 211063347 211459827 211027889 212178993 214288731 214549236 214520149 215402756
3452.5B15402756R50947J78909j31512N03845P62101Q61511Q27961O77337L44353O43196
$$ 215402756 216353703 216532612 216401100 216904945 217667046 218528557 219356518 220033855 220378208 221021404
3462.1B21021404P17526O69536J060124Q71010J264934M76456N3711R00554N53189
$$ 221021404 221738930 222408466 223468590 224339600 225604534 226080990 226134701 227035255 227588444
3470.8B27588444N40657R20734J406937Q26092N5313N21068Q27999J282349R96189
$$ 227588444 228129101 229049835 230456772 231282864 231338177 231859245 232687244 233969593 234965782
3479.5B34965782P66964J139679P03449M42200J026020R23252N96333R40532P23534
$$ 234965782 235732746 236872425 237575874 238018074 239044094 239967346 240563679 241504211 242227745
3488.1B42227745J097851J509476Q52489N49011P00226Q37841J177940J047307M29649
$$ 242227745 243325596 244835072 245687561 246236572 246936798 247774639 248952579 249999886 250429535
3496.8B50429535J090526J252041J135197J450100J152210J165467M90531O14701R99183
$$ 250429535 251520061 252772102 253907299 255357399 256509609 257675076 258165607 258780308 259779491
3505.5B59779491R24836J257095J311779J184483K28214R68265J736889J396237R55867
$$ 259779491 260704327 261961422 263273201 264457684 264685898 265654163 267391052 268787289 269743156
3514.2B69743156O55537J507263R91078J309910J975879N95722Q23250J581803J609745
$$ 269743156 270398693 271905956 272897034 274206944 276182823 276778545 277601795 279183598 280793343
3522.9B80793343J284160J369305J584320J170101J179085J103172P26032J745110
$$ 280793343 282077503 283446808 285031128 286201229 287380314 288483486 289209518 290954628
3530.6B90954628J995773N84450O80523J141567J681271J549797J234054K215329J371841
$$ 290954628 292950401 293534851 294215374 295356941 297038212 298588009 299822063 302037392 303409233
3539.2C03409233Q39501J604690J858749J394272J881733J755352N94559J883545R33704
$$ 303409233 304248734 305853424 307712173 309106445 310988178 312743530 313338089 315221634 316155338
3547.9C16155338J543961J978779J560516K483025Q11157J628342J788482K198029
$$ 316155338 317699299 319678078 321238594 323721619 324532776 326161118 327949600 330147629
3555.6C30147629K374306O13975J931419K047005K039108J757698J825791J073723
$$ 330147629 332521935 333135910 335067329 337114334 339153442 340911140 342736931 343810654
3563.4C43810654J706352M902077J159057J118164J298867K84080L844605K325973
$$ 343810654 345517006 350419083 351578140 352696304 353995171 354279251 358123856 360449829
3571.1C60449829K001534K047348J937713J950875K466240K479400R79309K910347
$$ 360449829 362451363 364498711 366436424 368387299 370853539 373332939 374312248 377222595
3578.8C77222595K604141J896172J882019K144737K518616J298943L960762K641067
$$ 377222595 379826736 381722908 383604927 385749664 388268280 389567223 393527985 396169052
3586.5C96169052J91040K789078J270027K715111K965240L847771J813889R17778M553756
$$ 396169052 396360092 399149170 400419197 403134308 406099548 409947319 411761208 412678986 417232742
3595.2D17232742J742974K790069L285561J018638L360062K226982J773873L002128
$$ 417232742 418975716 421765785 425051346 426069984 429430046 431657028 433430901 436433029
3602.9D36433029K473793K958107L730431L035240O32286L932991R63821N00527P611351
$$ 436433029 438906822 441864929 445595360 448630600 449262886 453195877 454159698 454660225 462271576
3611.6D62271576K980919o02150M122887J120338N031815M949417J573562L025589
$$ 462271576 465252495 464650345 468773232 469893570 474925385 479874802 481448364 484473953
3619.3D84473953K36092J400146L857155L379250K469406L945312M156495L559265
$$ 484473953 484710045 486110191 489967346 493346596 495816002 499761314 503917809 507477074
3627E07477074O406936O58226n160827M698524N075264N776711K543678N97496L943253
$$ 507477074 513884010 514542236 509381409 514079933 519155197 524931908 527475586 528073082 532016335
3635.7E32016335M604148L762093K016449K100563K801666L379746K340660J818695
$$ 532016335 536620483 540382576 542399025 544499588 547301254 550681000 553021660 554840355
3643.4E54840355L963089N373840O266556j579018j364555Q322029J416664o64978
$$ 554840355 558803444 564177284 570443840 568864822 567500267 575822296 577238960 576573982
3651.1E76573982J266785N444450M688988M459610N229416o047211L658295O388016
$$ 576573982 577840767 583285217 587974205 592433815 597663231 591616020 595274315 601662331
3658.8F01662331J801109K023315J472435L425408K297668K213974K563973J614303
$$ 601662331 603463440 605486755 606959190 610384598 612682266 614896240 617460213 619074516
3666.5F19074516N152359K513733m50210O12640n382080M231911R316253R677277J268158
$$ 619074516 624226875 626740608 626290398 626903038 621520958 625752869 635069122 644746399 646014557
3675.2F46014557j7053146J712265Q590164N289077k278823Q75625L332367K313843
$$ 646014557 628961411 630673676 639263840 644552917 642274094 643149719 646482086 648795929
3682.9F48795929J648788L91388P81021M656678O258774r382706q82874Q912888o591034
$$ 648795929 650444717 650836105 651617126 656273804 662532578 653149872 652266998 661179886 654588852
3691.6F54588852K84119N431594Q12149K013703J215515N06821J312179P08237L293838
$$ 654588852 654872971 660304565 661116714 663130417 664345932 664852753 666164932 666873169 670167007
3700.3F70167007K987900n209808j513291M920884J702118j84021K79007K881240M757615
$$ 670167007 673154907 667945099 666431808 671352692 673054810 672870789 673149796 676031036 680788651
3709F80788651o393509J981277K845764j0866165O474609M708558k65656N93796K545013
$$ 680788651 674395142 676376419 679222183 668356018 674830627 679539185 679273529 679867325 682412338
3717.7F82412338K282181l214264J167069O183700l811874n010529M682541J828156
$$ 682412338 684694519 681480255 682647324 688831024 685019150 680008621 684691162 686519318
3725.4F86519318k34604l106308q0109L270035J312637O373368k087327p572631Q827591
$$ 686519318 686284714 683178406 683098297 686368332 687680969 694054337 691967010 684394379 693221970
3734F93221970Q4533r696426J453934L388214R99145K389069L587723l584595L387070
$$ 693221970 693306503 683610077 685064011 688452225 689451370 691840439 695428162 691843567 695230637
3742.7F95230637J3125305j1646881j7612992J0779267O317367O790390l333816j0214920
$$ 695230637 708355942 696709061 679096069 689875336 696192703 702983093 699649277 689434357
3750.4F89434357J1081009n458222o050262N803756M574128L738632n403900J722564
$$ 689434357 700515366 695057144 689006882 694810638 699384766 703123398 697719498 699442062
3758.2F99442062M294434p975693K01264M321518R63974J48773L132858k315903l749618
$$ 699442062 703736496 695760803 695962067 700283585 701247559 701396332 704529190 702213287 698463669
3766.8F98463669L415146M583587N55039q806381J546478K896728J06964J102829j2588
$$ 698463669 701878815 706462402 707017441 698211060 699757538 702654266 702761230 703864059 703851471
3775.5G03851471J307754J80283K706833L68729p199784L471222K588577Q01850J033935
$$ 703851471 705159225 705339508 708046341 708415070 701215286 704686508 707275085 708076935 709110870
3784.2G09110870l715667P6141J753235K25830p3471Q1711O63604l7231N04761J44958
$$ 709110870 705395203 705471344 707224579 707450409 707376938 707458649 708122253 708085022 708589783 708734741
3793.8G08734741J282273K609939m636688m257126K613754M671250O495819n783386
$$ 708734741 710017014 712626953 707990265 703733139 706346893 711018143 717513962 711730576
3801.5G11730576j0414505L906631K759476M284057M235688r732819k795181M973373
$$ 711730576 701316071 705222702 707982178 712266235 716501923 706769104 703973923 708947296
3809.3G08947296J628876l48282O15921M71420J327286N782623j755066j4335250M966201
$$ 708947296 710576172 710227890 710843811 711315231 712642517 718425140 716670074 702334824 707301025
3817.9G07301025O258088N335083K081222j8850555J564483O684494K309037J530380
$$ 707301025 713559113 718894196 720975418 702124863 703689346 710373840 712682877 714213257
3825.7G14213257l2578l305740N90210J785965K765808K060699q630218J640625O749954
$$ 714213257 714180679 710874939 711465149 713251114 716016922 718077621 709447403 711088028 717837982
3834.3G17837982o484375k12707R181442o859970n203324O848069n177002m0970P586212
$$ 717837982 711353607 711140900 720322342 713462372 708259048 715107117 709930115 709889145 717475357
3843G17475357k368698m933395K805709K324295M74625J300507j322861J798782O416703
$$ 717475357 715106659 710173264 712978973 715303268 715777893 717078400 715755539 717554321 723971024
3851.7G23971024m248963J286316j7702255M28619J1476822j118851k556457K430191
$$ 723971024 719722061 721008377 703306122 703734741 715211563 714092712 711536255 713966446
3859.4G13966446L124618K937241n461044O79016N836105p548828m557342M290161
$$ 713966446 717091064 720028305 714567261 715246277 721082382 713533554 708976212 713266373
3867.1G13266373N175476O061783q014069q971100M572449O866150L696289j1218720
$$ 713266373 718441849 724503632 716489563 707518463 712090912 718957062 722653351 711434631
3874.8G11434631k55127L998642P95746L133545M159851n705108p745209N070038J778412
$$ 711434631 711179504 715178146 715973892 719107437 723267288 717562180 709816971 714887009 716665421
3883.5G16665421K076110M218903j2644577J147003L428192J203537N031510n26352
$$ 716665421 718741531 722960434 710315857 711462860 714891052 716094589 721126099 720599747
3891.2G20599747q890305M06876L645859j303101J307831J689529K051926J904373
$$ 720599747 711709442 712116318 715762177 714459076 715766907 717456436 719508362 721412735
3898.9G21412735r635544M514847J596909m712906O491165k439881l555679l4332K180862
$$ 721412735 711777191 716292038 717888947 713176041 719667206 717227325 713671646 713637314 715818176
3907.6G15818176J974793j134186J91345J57929L48434k50320j1063J530304J416397
$$ 715818176 717792969 716658783 716850128 717008057 717356491 717106171 717095108 718625412 720041809
3916.3G20041809l568802k863540M450531o79322l069610K281112J550064J816941
$$ 720041809 716473007 713609467 718059998 717380676 714311066 716592178 718142242 719959183
3924G19959183k730408l492508J813049J875916J045990j873016q14591K094803k200623
$$ 719959183 717228775 713736267 715549316 717425232 718471222 716598206 715783615 717878418 715677795
3932.7G15677795j281356J806717M46548p7133k99072K87170L52402p97730J041641
$$ 715677795 714396439 716203156 716649704 716572571 716273499 716560669 716913071 716115341 717156982
3941.4G17156982R18885l098526k71759Q29696O18363J230316k359238N28031O66198
$$ 717156982 718075867 714977341 714705582 715535278 716153641 717383957 715024719 715552750 716218948
3950.1G16218948k076797J753540L07922P4387M71649l36304N32379m80422K05154
$$ 716218948 714142151 715895691 716203613 716278000 716749649 716413345 716945724 716465302 716670456
3958.7G16670456m06571M86756P32117j400223j35803p7134K49787M71344M51202N52216
$$ 716670456 716263885 716750641 717482758 716082535 715946732 715869598 716119385 716590729 717041931 717594147
3968.4G17594147l55225k38037L12881o1340j328049p11517J10092M13513O76728L85437
$$ 717594147 717238922 717000885 717313766 717252426 715924377 715212860 715322952 715736465 716413193 716798630
3978G16798630L57971J33133j24893m80118K26288k2126k14309J51367l46527L14789
$$ 716798630 717156601 717289734 717164841 716684723 716911011 716888885 716674576 716825943 716479416 716794205
3987.7G16794205N10635N57251n10940p75376K00806J72348K25677n97686k6551j09787
$$ 716794205 717304840 717862091 717351151 716575775 716776581 716948929 717174606 716576920 716550369 716440582
3997.3G16440582L35617O67572r06143
$$ 716440582 716776199 717443771 716537628
4000.2G16537628
$$ 716537628
##END=$$ End of the data block
