##TITLE=$$ Begin of the data block
##JCAMP-DX=5.00 $$ ACD/SpecManager v 10.08
##SPECTROMETER/DATA SYSTEM=Varian
##DATE=08 Jan 2013 15:50:28
##DATA TYPE=INFRARED SPECTRUM
##DATA CLASS=XYDATA
##ORIGIN=
##OWNER=
##NPOINTS=3735
##FIRSTX=399.26403809
##LASTX=4000.35498047
##MAXX=4000.35498047
##MINX=399.26403809
##MAXY=75.76236725
##MINY=20.10204697
##XFACTOR=1.0000000000
##YFACTOR=0.000000100000000
##FIRSTY=44.05284500
##DELTAX=0.96440572
##XUNITS=1/CM
##YUNITS=TRANSMITTANCE
##XYDATA=(X++(Y..Y))
399.3D40528450j2751007N798187J1214485M198609n347939K036019K367324n066299
407D42977829K944260o613999n983505Q383827l294144m779968N82009J326446k421226
415.7D33121529n382233l023720j2672729O805534J4922524M982299K894211l303909
423.4D38343506k222328l677979m356003l701172K058526Q454742K557297k817917
431.1D34638672l163223l27568K945022o80542n980835K551460P476159J660270k210159
439.8D36909256l740425j460037j326104P19338L241196K531890R34296n454483p59964
448.4D31594963J622658o328011q505706l79067Q402824N510140J073456l93868k048492
457.1D30548897n604439k626381K08664K286415K567978N25093p72896j832313j394425
$$ plain form
399.3 440528450 427777443 433575630 444790115 448988724 443640785 445676804 448044128 442977829
407 442977829 445922089 439308090 433324585 441708412 438414268 433634300 434216309 435542755 433121529
415.7 433121529 427739296 424715576 412042847 418848381 433770905 438753204 441647415 438343506
423.4 438343506 436121178 432443199 428087196 424386024 426444550 434899292 437456589 434638672
431.1 434638672 431475449 431147881 434092903 433412361 427431526 429982986 437459145 439119415 436909256
439.8 436909256 433168831 431708794 430382690 431102028 434343224 436875114 437809410 432354927 431594963
448.4 431594963 433217621 426889610 418383904 418004837 426407661 431917801 432991257 432597389 430548897
457.1 430548897 424944458 422318077 422526741 424813156 427381134 427906227 427133331 425301018 423906593
465.8D23906593j303787K016869n150l316918J888733L70369j638756l556251l353653
474.5D15008049j552849k212791L348350J368828l875465q63190P30515J486701k70042
483.2D13168106l954239l8J532288k94228J489410N45884J062812k58140n613060k704392
492.8D04974403r7313K303620K688598j792K645340K910308r35859m278107l877182
501.5D06332016j147461j327324p22580J301003J849327M383278J743812l759193m543877
510.2D04109001j968803K775688J187248k465591R86480J312829j150742k709847l093223
518.9C98983040m175644k667465R52530J444702K471885J836281k00500k027550k729301
527.5C93887978j443596K11906J825638J242828Q5869L98636N02853j229934j451912
$$ plain form
465.8 423906593 422602806 424619675 424614525 421297607 423186340 423556709 421917953 418361702 415008049
474.5 415008049 413455200 411242409 414590759 415959587 412084122 411220932 411951447 413438148 413168106
483.2 413168106 409213867 409213829 410746117 410451889 411941299 412487183 413549995 413291855 407678795 404974403
492.8 404974403 404877090 407180710 409869308 409867516 412512856 415423164 414487305 410209198 406332016
501.5 406332016 405184555 403857231 403134651 404435654 406284981 410668259 412412071 408652878 404109001
510.2 404109001 402140198 404915886 406103134 403637543 404624023 405936852 404786110 402076263 398983040
518.9 398983040 394807396 392139931 393092461 394537163 397009048 398845329 398644829 396617279 393887978
527.5 393887978 392444382 392656288 394481926 395724754 395810623 396209259 396712112 395482178 394030266
536.2C94030266o93054k272606r16062Q38242K126846J322632j734695j351014k211418
544.9C89139137j606559M53376j246986j026764J705017J488266j293678k215805k017899
553.6C83378105j33743J057281j89552M0588P78389J49613m26712j065140j878929
562.3C81709900n28221J304359R48792n30663k97165P44133N17655K23999j033020
570.9C83059769j514588k116928m60357K982482J301346l99780j376572j353988k99874
579.6C79821510j728744o02417J836662J875877k67639L77846R71680m28162M3945
588.3C81900558k215309j881599J238518J857490K845688K150688M6692j136742k109832
597C82696152j745987O60209J472664L38364R87930J730995l98178k283783j551208
$$ plain form
536.2 394030266 393337212 391064606 390148544 390986786 393113632 394436264 392701569 391350555 389139137
544.9 389139137 387532578 387985954 386738968 385712204 387417221 388905487 387611809 385396004 383378105
553.6 383378105 383244362 384301643 384112091 384152679 384931068 385080681 384653969 383588829 381709900
562.3 381709900 381181679 382486038 383434830 382904167 382607002 383351135 383868790 384092789 383059769
570.9 383059769 381545181 379428253 378967896 381950378 383251724 382851944 381475372 380121384 379821510
579.6 379821510 378092766 377490349 379327011 381202888 380935249 381313095 382284775 381856613 381900558
588.3 381900558 379685249 377803650 379042168 380899658 383745346 385896034 385942726 384805984 382696152
597 382696152 380950165 381610374 383083038 383421402 384409332 386140327 385742149 383458366 381907158
605.6C81907158j000519r67979l53241M14962M45977Q71315J265335m97360j765175
614.3C80320473k248574r05876m7989n13954J361580J681099J398239K8877j110725
623C79963150p04956k40212J318398J009293K545852L676186J788750J089706J98936
631.7C90645103L29476N69839Q45223K288971K648506K639275K069244J269722N15900
640.4D03821259q22258n44243N14183J473274K820511K593765J571694J103858L79334
649D12911377l19290q66966l68920J126213K113533K479058J103057j46026r10225
657.7D17121811j670876k03781N07317j43624O33507K128830J103554M1847R73129
666.4D20491714j696891j0870629M253388N303192K492332J156159K238235N11437
$$ plain form
605.6 381907158 380906639 379938660 379585419 380000381 380446358 381317673 382583008 382085648 380320473
614.3 380320473 378071899 377166023 377118034 376604080 377965660 379646759 381044998 381073875 379963150
623 379963150 379258194 379017982 380336380 381345673 383891525 387567711 389356461 390446167 390645103
631.7 390645103 390974579 391544418 392389641 394678612 397327118 399966393 402035637 403305359 403821259
640.4 403821259 402999001 402454758 402968941 404442215 407262726 409856491 411428185 412532043 412911377
649 412911377 412592087 411725121 411356201 412482414 414595947 417075005 418178062 418032036 417121811
657.7 417121811 415450935 415247154 415754471 415610847 416244354 418373184 419476738 419518585 420491714
666.4 420491714 418794823 407924194 412177582 417480774 419973106 421129265 423367500 423878937
674.1D23878937K13356J210060n08804j99051J798019K861061J995087J627426J828690
682.8D34704781J302948Q96911n1727m1924M43077K049561L317528K527313J141548
691.5D46290016n79414q95691j224632n12238J158295J641159K025757K330017J377640
700.2D51610909o28777m97246k83279q40607N39284K546120K904319K015381J944733
708.8D59310837R76639k50855r44443p29980R37118J813202J982766J427574J687011
717.5D66209869Q24051o63528j117287j093559J331711J848106K107658K465401Q98819
726.2D72811241J93787k4262O99616J84440J30082J205711K291298L284530J638299
734.9D82414742l21465j052437k80838j63803m39644N01442K068672K883950J180381
$$ plain form
674.1 423878937 424092293 425302353 424793549 424594498 426392517 429253578 431248665 432876091 434704781
682.8 434704781 436007729 436904640 436852913 436810989 437254066 439303627 442621155 445148468 446290016
691.5 446290016 445710602 444814911 443590279 443078041 444236336 445877495 447903252 450233269 451610909
700.2 451610909 450982132 450484886 450201607 449361000 449900284 452446404 455350723 457366104 459310837
708.8 459310837 460287476 460036621 459092178 458362198 459299316 461112518 463095284 464522858 466209869
717.5 466209869 467033920 466370392 465253105 464159546 465491257 467339363 469447021 471912422 472811241
726.2 472811241 473005028 472980766 473680382 473864822 473994904 475200615 477491913 480776443 482414742
734.9 482414742 482093277 481040840 480760002 480596199 480156555 480657997 482726669 485610619 486791000
743.6D86791000k46009o18477N16395J93024o39191Q09021O74629J501351K471123
752.2D91452866J420173j79672p40204n23071l23715J598358K883377L062286K214546
760.9E00864944J954117J334992q33664o65703J28288O47812N99785J529121J999360
769.6E07559052J010360L40843r18006j134911j763725o87485R19876J430054J685943
778.3E08442001R74121P99561j114082j576805j646386j097374J478997K324333L149414
787E11733780K007294N59730r41887k123413r18503J08681P03163L21846N46112P59125
796.6E12755928J7700k018547k748337k237129k500801p55958r0333l13148j525612
805.3E00583763k633209k435951l019028k388840k513351k107468o4010j50605j694145
$$ plain form
743.6 486791000 486544991 485926514 486442909 486635933 485996742 486805763 487480392 488981743 491452866
752.2 491452866 492873039 492693367 491953163 491430092 491106377 492704735 495588112 498650398 500864944
760.9 500864944 502819061 504154053 503320389 502654686 502782974 503430786 504030571 505559692 507559052
769.6 507559052 508569412 508910255 507992249 506857338 505093613 504406128 505326004 506756058 508442001
778.3 508442001 509416122 510215683 509101601 507524796 505878410 504781036 506260033 508584366 511733780
787 511733780 513741074 514300804 513358917 511235504 510317001 510425682 511128845 511450691 511996803 512755928
796.6 512755928 512773628 510755081 508006744 505769615 503268814 502512856 502422523 502109375 500583763
805.3 500583763 497950554 495514603 492495575 490106735 487593384 485485916 485421906 485271301 483577156
814D83577156j415863j287460k366753k714500k258606K43530J397018J219597J869431
822.6D78263550J931610J065330M51813J006203J253357L876571M518433L477554M697838
831.3E00542259L380699K991410J549530Q08677J986351K448349M473229M381637M338570
840E26900711L006058J537704j6174p39937J971779K287025K545739J973190L246689
848.7E42712784L585892R47761M46892L88641J856384R90792K166443L853225K806282
857.4E59755096K420273R23844J67274k72369O59637n50995N96352K369385N70526
866E66639023R37271l02887r78622k522240k725601k179642j938095J089210J576043
874.7E59594460O52427k183380k673530k158165k331124j264953o99959J002540K60773
$$ plain form
814 483577156 482161293 480873833 478507080 475792580 473533974 473777504 475174522 476394119 478263550
822.6 478263550 480195160 481260490 481712303 482718506 483971863 487848434 492366867 495844421 500542259
831.3 500542259 503922958 506914368 508463898 509272575 511258926 513707275 518180504 522562141 526900711
840 526900711 529906769 531444473 531428299 530688362 532660141 534947166 537492905 539466095 542712784
848.7 542712784 546298676 547246437 547693329 548081970 549938354 550929146 553095589 556948814 559755096
857.4 559755096 562175369 563099213 563266487 562994118 563653755 563102760 563699112 566068497 566639023
866 566639023 567576294 567273407 566294785 563772545 561046944 558867302 556929207 558018417 559594460
874.7 559594460 560246887 558063507 555389977 553231812 550900688 549635735 548935776 549938316 550199089
883.4E50199089L89252K28386p44286j234283j787682o72188r98344L58124J354522
892.1E47092590K491341J734428p56645k92663q10662m82406q04215J057854J947670
900.8E51177292O16264J080551q5868M9095j66664J260719K344971K889480L307762
909.4E62473602J053124J236572n5923j167794k398300k209320p56493j967468j744613
918.1E54463387j950417k040634l091774l571663m192810m508209l411332l587417
925.8E28109131j698570j923905k810745l317375l898010l334923m083176k753448
933.6E04288979j336060p59048m99535k8496o9961j657334k127533k229957j190796
942.2D94390259r15985k34223K39373m76342O01044K30026r96170j753921j224213
$$ plain form
883.4 550199089 550588341 550816727 550072441 548838158 547050476 546378288 545379944 545738068 547092590
892.1 547092590 549583931 551318359 550561714 550269051 549458389 548975983 548171768 549229622 551177292
900.8 551177292 551793556 552874107 552788239 552837334 552670670 553931389 556276360 559165840 562473602
909.4 562473602 563526726 564763298 564707375 563539581 561141281 558931961 558175468 556208000 554463387
918.1 554463387 552512970 550472336 547380562 543808899 539616089 535107880 531696548 528109131
925.8 528109131 526410561 524486656 521675911 518358536 514460526 511125603 507042427 504288979
933.6 504288979 502952919 502193871 501694336 501665840 501595879 499938545 497811012 495581055 494390259
942.2 494390259 493474274 493240051 493479424 493003082 493604126 493834152 492837982 491084061 489859848
950.9D89859848o34499k11601M27437p60765j579018j982307k294579l525772l211708
959.6D76087036j914520k261887k257080j932907j078949k338028l156509l027954
967.3D58119202l226624k119141k321128k181282k465973k643814k439194l756180
975D36965866m343071m520569m444198m061585l784370m089699m473419n216294o168212
983.7C95864449n992241o027489o242523n254555m390030m819031m980507m862899
991.4C53295174n142556n618476m861489m487076m966735m651108m244900l058128
999.1C16264706l370476l635750l410892l580151k574139j879940j617889j803246
1006.8B94392223j114082j587868k287445j888962j715698j528168j996059j493664
$$ plain form
950.9 489859848 489225349 489013748 489441185 488680420 487101402 485119095 482824516 479298744 476087036
959.6 476087036 474172516 471910629 469653549 467720642 466641693 464303665 461147156 458119202
967.3 458119202 454892578 452773437 450452309 448271027 445805054 443161240 440722046 436965866
975 436965866 432622795 428102226 423658028 419596443 415812073 411722374 407248955 402032661 395864449
983.7 395864449 389872208 383844719 377602196 372347641 367957611 363138580 358158073 353295174
991.4 353295174 348152618 342534142 337672653 333185577 328218842 323567734 319322834 316264706
999.1 316264706 312894230 309258480 305847588 302267437 299693298 297813358 296195469 294392223
1006.8 294392223 293278141 291690273 289402828 287513866 285798168 284270000 282273941 280780277
1014.6B80780277k089462j809998j643524l343677l594094l200512k225513k601681
1022.3B60271816k368831k485199k229691j544533k309646j840554k400760j314011
1030B43778591j443500j749955j040477j117897L09162K64606Q41332j17188O86016
1038.7B40410690J034317L50628K030926Q85391J115780K53773M61063M45919p43141
1047.4B46245346m18510j808987l96843k30160j36280o2713j28689o64253k307358
1056B40091553k4071k73075P05776K062817J922626K066117J909847K478847J289711
1064.7B52230148K299252K134762K329464K187061R39541J540832J099682J610680
1072.4B66371422K09122R72194J649571j62621P801N92156J983451J250897J701832
$$ plain form
1014.6 280780277 278690815 276880817 275237293 271893616 268299522 265099010 262873497 260271816
1022.3 260271816 257902985 255417786 253188095 251643562 249333916 247493362 245092602 243778591
1030 243778591 242335091 240585136 239544659 238426762 238735924 239000530 239841862 239724674 240410690
1038.7 240410690 241445007 241795635 243826561 244711952 245827732 246081505 246542568 246988487 246245346
1047.4 246245346 245826836 244017849 243621006 243390846 243254566 243191853 243063164 242398911 240091553
1056 240091553 240067482 239794407 240500183 242563000 244485626 246551743 248461590 250940437 252230148
1064.7 252230148 254529400 256664162 258993626 261180687 262120228 263661060 264760742 266371422
1072.4 266371422 266580544 267552738 269202309 269039688 269047489 269639645 271623096 272873993 274575825
1081.1B74575825K065658J222344R92126J328087K014675J175022K306671K358189
1088.8B88038597J909599J382618J194382J727104R39770J805820J739007K496204
1096.5C01233101K382278J594906K024670J908932K077312N06821J624202K688256
1104.2C16040478J882477J880741J463089J553993R12208N93949J5411O12641J465873
1112.9C26420860J023484Q16307K99301P40738P4997p1793n82466j404076k45857j30806
1122.6C26940689O13670J015854J092720R75266J275215J749191J041222J768761K493820
1131.2C38966408L033409K474594K024574K465973K039986K095489J818085J668472
1139C56586990J793328J915207K061233J469689J013298M29496j29089J01242N55954
$$ plain form
1081.1 274575825 276641483 277863827 278855953 280184040 282198715 283373737 285680408 288038597
1088.8 288038597 289948196 291330814 292525196 294252300 295192070 296997890 298736897 301233101
1096.5 301233101 303615379 305210285 307234955 309143887 311221199 311728020 313352222 316040478
1104.2 316040478 317922955 319803696 321266785 322820778 323732986 324326935 324342346 324954987 326420860
1112.9 326420860 327444344 328260651 328559952 329300690 329375687 329303894 328721428 327317352 327071495 326940689
1122.6 326940689 327554359 328570213 329662933 330638199 331913414 333662605 334703827 336472588 338966408
1131.2 338966408 341999817 344474411 346498985 348964958 351004944 353100433 354918518 356586990
1139 356586990 358380318 360295525 362356758 363826447 364839745 365269241 365140152 365241394 365797348
1147.6C65797348Q99849Q83026M87900l7422k25754m9553j14136l24096n98832n02891
1157.3C66215439Q354k08549p02210r74388q98933r9679N63813R86213J180993J958580
1166.9C68029633K427520K107506K733231K485008K296524K366600J844597K505073
1174.6C86795692L519707K815437K628861L299637K398491K052574J650886J444283
1182.4D06605568J532707J487160J738701J280250J426277P28798n60264j059952n81093
1191D12598152k2545l66630m14887o02112r64164j306458j649971k011642j555329
1199.7D03704414j145134j582069j037407q59528j100502j255455j803817j359177
1207.4C93561325j014519o58874q621K60925O35185K05918l19329l50456r9907j68304
$$ plain form
1147.6 365797348 366697197 367580223 368068123 368030701 367804947 367755394 367641258 367317162 366718330 366215439
1157.3 366215439 366223793 366015244 365313034 364338646 363439713 363340034 363903847 364890060 366071053 368029633
1166.9 368029633 370457153 372564659 375297890 377782898 380079422 382446022 384290619 386795692
1174.6 386795692 390315399 393130836 395759697 399059334 401457825 403510399 405161285 406605568
1182.4 406605568 408138275 409625435 411364136 412644386 414070663 414799461 414239197 413179245 412598152
1191 412598152 412575607 412208977 411794090 411191978 410227814 408921356 407271385 405259743 403704414
1199.7 403704414 402559280 400977211 399939804 399080276 397979774 396724319 394920502 393561325
1207.4 393561325 392546806 391887932 391879311 392140236 392775421 392981339 392662010 392311554 392211647 392043343
1217.1C92043343j77880K73209M20608R30901P14760J07422n8747n92346p76138o17447
1226.7C92267685n68008n08767m73137n04875n08995q03985j133652j059990j186676
1235.4C85519600q68073m47502J38550O47087j45798n38215o88057r21898j121864
1244.1C81573830j161728n64423k6054M43306n6916n21316p28111j029549p69005n14908
1253.7C76645126j98097j53046K52762J00403l38592k43378m53949k09351J22414M33350
1263.4C75957642M02793J142350J416511K56958L47977O13708L62511J47629P39098
1272C81387177J600532J546173J556816J728783J398773O77757P72362J103249J271934
1280.7C93043556J779213K096253K046318J921806J670151J306801J045036J026878
$$ plain form
1217.1 392043343 391865463 392138672 392559280 393490181 394204941 394312363 394253616 393661270 392885132 392267685
1226.7 392267685 391699677 391190910 390717773 390212898 389703903 388899918 387766266 386706276 385519600
1235.4 385519600 384651527 384204025 384342575 384989662 384843864 384305649 383617592 382695694 381573830
1244.1 381573830 380412102 379847679 379821625 380264931 380208015 379686699 378958588 377929039 377160034 376645126
1253.7 376645126 376447029 376293983 376546745 376647148 376308556 376065178 375611229 375401878 375524292 375957642
1263.4 375957642 376360435 377502785 378919296 379176254 379524231 380137939 380500450 380648079 381387177
1272 381387177 382987709 384533882 386090698 387819481 389218254 389896011 390668373 391771622 393043556
1280.7 393043556 394822769 396919022 398965340 400887146 402557297 403864098 404909134 405936012
1288.4D05936012J345330J622352K070732J835289J429100J187020Q78067Q78639N02357
1297.1D17684898N46456O27403J260414J235581N45616O08368j08796k73551j41488
1305.8D21984901M3755k47803m48837K09503P2212j72309r07860j162682o95953l68309
1315.4D18306618L0594L66935Q44345J113701J341324J013718O69021L94783L62587
1324.1D24443626O02875P27921J121864O36024N17769K49024m16298r65958j155700
1332.8D25761147n56298m94041j41297p6561M62418L92532n23834p2784j2512N85899
1342.4D25324669K12784O84776J508102Q20389P65534P1067J24588k72026n16166j71509
1352.1D28552208k85454J49994P744m14734q05855m12788q70018q20351m30069n52330
$$ plain form
1288.4 405936012 407281342 408903694 410974426 412809715 414238815 415425835 416303902 417182541 417684898
1297.1 417684898 418231354 418858757 420119171 421354752 421900368 422508736 422399940 422126389 421984901
1305.8 421984901 422028656 421780853 421332016 421541519 421613731 421441422 420533562 419370880 418674927 418306618
1315.4 418306618 418337212 418704147 419548492 420662193 422003517 423017235 423686256 424081039 424443626
1324.1 424443626 425046501 425774422 426896286 427532310 428050079 428299103 427882805 426916847 425761147
1332.8 425761147 425204849 424710808 424569511 424492950 424955368 425347900 424824066 424751282 424738770 425324669
1342.4 425324669 425537453 426222229 427730331 428550720 429316254 429387321 429511909 429239883 428723717 428552208
1352.1 428552208 428266754 428416748 428424492 428009758 427203903 426791115 425921097 425100746 424670677 424118347
1361.7D24118347N3139p04308N33905j8196j090927q24051j340141o94847o67458L7461
1371.4D19402924L54423p9346n63049p62176R4528n92919p35359r22508k81372j27487
1381D15787659p18079j310081k506943j746941j347770j330567k695732j609993m74930
1389.7D02046623j798363k081184k211990j631775l092461l970451j568375j819114
1397.4C83872910j497193k636909k124825j669502k575684k460899k470322k741813
1405.1C65695763k096558j305580j354370j252899j202965k079125j882209j619072
1412.8C52902985j312523q66547q92258n10025r4833O67801j217423m45060R16214
1421.5C49148331K95677J056862M10843J088714J354447Q05549J458473P80106R84459
$$ plain form
1361.7 424118347 424171486 423467178 424001083 423982887 422891960 422067909 420727768 420032921 419365463 419402924
1371.4 419402924 419757347 419678001 419114952 418352776 418447304 417854385 417119026 416196518 415915146 415787659
1381 415787659 415069580 413759499 411252556 409505615 408157845 406827278 404131546 402521553 402046623
1389.7 402046623 400248260 398167076 395955086 394323311 391230850 387260399 385692024 383872910
1397.4 383872910 382375717 379738808 377613983 375944481 373368797 370907898 368437576 365695763
1405.1 365695763 363599205 362293625 360939255 359686356 358483391 356404266 354522057 352902985
1412.8 352902985 351590462 350723915 349831657 349321632 349226799 349894600 348677177 348232117 349148331
1421.5 349148331 349444008 350500870 350911713 352000427 353354874 354160423 355618896 356399002 357383461
1430.2C57383461Q30994J583862J691246J492691K647285K036896Q81958J343346K623749
1438.9C72515488J806411J257859J327362J311035K429085J616440J546401J092873
1446.6C84902954O21338o180O66123J854248J118278J644325J330376J749649J140061
1455.3C95021172L8108J040268o48384L206520J806755K578926J798668J361237K426643
1464D08629913J45302J664467J746483K679176K775841K681427L607597K475434K640953
1472.6D29046593J823578L809814L557472K347718L070411L152123K885475K501945
1480.3D52195129K504425J679802J460534J693229J529732J660538J388282J286850
1488.1D65398521K217026L00446j123276j36414o70623j228409r81102p08542m926453
$$ plain form
1430.2 357383461 358214455 359798317 361489563 362982254 365629539 367666435 368548393 369891739 372515488
1438.9 372515488 374321899 375579758 376907120 378218155 380647240 382263680 383810081 384902954
1446.6 384902954 385524292 385518112 386184235 388038483 389156761 390801086 392131462 393881111 395021172
1455.3 395021172 395059280 396099548 395451164 398657684 400464439 403043365 404842033 406203270 408629913
1464 408629913 408775215 410439682 412186165 414865341 417641182 420322609 423930206 426405640 429046593
1472.6 429046593 430870171 434679985 438237457 440585175 443655586 446807709 449693184 452195129
1480.3 452195129 454699554 456379356 457839890 459533119 461062851 462723389 464111671 465398521
1488.1 465398521 467615547 467915993 466792717 466656303 465985680 464757271 463776169 463067627 458141174
1496.7D58141174O1531j548233m250106q80700k259597k054520j487999M61884N80253
1505.4D46763687n012207l607750P47948J161575j310158O90957r25522j651650N37300
1514.1D37394180m28734o9236j908570k492904Q27255J012001j353569k105484J380196
1522.8D32255135J418495K075157n42984N91392J784478O64978J159439J450653J913414
1531.5D42770157J488991J280250M18015J556053J353531J275215K086449j964112
1539.2D50264549r55085K480545J987686P89528J802024J612587j217956J914406J347274
1547.9D60025558J221581O70319q8959J739349J124726R06028l119774l19862J275482
1556.5D63434448Q36487k106819j2689056M894142J471939J045418j718827j869468
$$ plain form
1496.7 458141174 458202705 456654472 452404366 451523666 449264069 447209549 445721550 446183434 446763687
1505.4 446763687 441751480 438143730 438891678 440053253 438743095 439434052 438508530 436856880 437394180
1514.1 437394180 436965446 436896210 434987640 432494736 433321991 434333992 432980423 430874939 432255135
1522.8 432255135 433673630 435748787 435205803 435797195 437581673 438246651 439406090 440856743 442770157
1531.5 442770157 444259148 445539398 445957413 447513466 448866997 450142212 452228661 450264549
1539.2 450264549 449309464 451790009 453777695 454567223 456369247 457981834 456763878 458678284 460025558
1547.9 460025558 461247139 461917458 461828499 463567848 464692574 465598602 462478828 462158966 463434448
1556.5 463434448 464270935 462164116 449475060 454369202 455841141 456886559 455167732 453298264
1564.2D53298264l596535l498001q33702j661377p69005r975815k241173j993713m282150
1572.9D24446793l540459m168015k678909j3297806j025963l352050m444123m378013
1580.6C87561455o472702m235077o759148m113388n844231m987411m853554o229934
1588.4C44066010m087258o735039l574752o138077l969460m695854n758896l108330
1596.1C05998344n481529k537803n610314k846451m129142l962613k382125m638215
1603.8B74410152j373577m381904j354904l655758k109661j699543l518544j4209l037644
1612.5B53264408J75266k291946M3316j460648o031170L447075j291618J467915j347199
1621.1B45975399J308556j23444j363831J857567o66618K430839j739845J844902P63359
$$ plain form
1564.2 453298264 449701729 446203728 445370026 443708649 442939644 432963829 430722656 428728943 424446793
1572.9 424446793 420906334 416738319 414059410 400761604 399735641 396383591 391939468 387561455
1580.6 387561455 381088753 376853676 370094528 365981140 360136909 355149498 350295944 344066010
1588.4 344066010 339978752 333243713 329668961 323530884 319561424 314865570 309106674 305998344
1596.1 305998344 300516815 297979012 292368698 289522247 285393105 281430492 279048367 274410152
1603.8 274410152 273036575 268654671 267299767 263644009 261534348 259834805 256316261 256302052 253264408
1612.5 253264408 253439674 251147728 251191044 249730396 243699226 247146301 245854683 247322598 245975399
1621.1 245975399 247283955 247160511 245796680 247654247 246987629 249418468 247678623 249523525 250286884
1629.8B50286884J156330J819687L80612K977180m63581K725659r51672M067421K932167
1638.5B64930687J660919L066483Q44116L631725O74553K615242J657314j30901M065724
1647.2B83015862j825085M196033J003208L186703K024021J57509r78546j918259M338799
1655.9B93200245O20956K252159R05877J983451K108880J235866L340416J32961M298859
1664.5C10079670K368011L593884L838692K700920M419975K320862N949325K852021
1672.3C38123360M955101M149360L574791N459214M029426N685692M045525N664100
1680C75686569L642960N052070N831566J658097R467392L914108O794662M981156N481796
1688.6D22510376N777550M857444O071435N591621O781578O254120O534843M418755
$$ plain form
1629.8 250286884 251443214 253262901 253643513 256620693 256157112 258882771 257931099 261998520 264930687
1638.5 264930687 266591606 269658089 270502205 274133930 274808483 277423725 279081039 278950138 283015862
1647.2 283015862 281190777 285386810 286390018 289576721 291600742 291758251 290779705 288861446 293200245
1655.9 293200245 293821201 296073360 296979237 298962688 301071568 302307434 305647850 305780811 310079670
1664.5 310079670 312447681 316041565 319880257 322581177 327001152 329322014 335271339 338123360
1672.3 338123360 343078461 347227821 350802612 356261826 360291252 365976944 370022469 375686569
1680 375686569 379329529 384381599 390213165 391871262 401338654 405252762 412047424 417028580 422510376
1688.6 422510376 428287926 433145370 439216805 444808426 451590004 457844124 464378967 468797722
1696.4D68797722N350113N845032N552940M110832L018074Q670387O224900N304298
1704.1E12874298L962746L800163L434334L661461M621925L050308L251534M211235
1711.8E42868004M296837M045677J422310K44713L650322K811622l167839M608116
1719.5E60779762M576111L283806K410889J447601R95560J504593J678314J376343
1727.2E78052979K172889K818413J156845J183319M148407M251480j505623n019798
1734.9E87258911M295883M819107K996102L753853J876678l96309M107552K787132
1742.7F11498909Q64716J823349L971023L339424K534561L203736K091560N162316
1750.4F34489594J490249P67098M907188L495407L786163L610459J345978K152099
$$ plain form
1696.4 468797722 474147835 479992867 485545807 489656639 492674713 501345100 507570000 512874298
1704.1 512874298 516837044 520637207 524071541 527733002 532354927 535405235 538656769 542868004
1711.8 542868004 547164841 551210518 552632828 552877541 556527863 559339485 556171646 560779762
1719.5 560779762 565355873 568639679 571050568 572498169 573493729 574998322 576676636 578052979
1727.2 578052979 580225868 583044281 584201126 585384445 589532852 593784332 592278709 587258911
1734.9 587258911 591554794 596373901 599370003 603123856 605000534 604604225 608711777 611498909
1742.7 611498909 612363625 614186974 618157997 621497421 624031982 627235718 629327278 634489594
1750.4 634489594 635979843 636746941 641654129 645149536 648935699 652546158 653892136 656044235
1758.1F56044235K880173K156448L017121l82462N67627M083328K339478K252884K410812
1766.8F75369644K060089j823806J949234M058456n54352r60312J7548N305328L121033
1775.4F88542862p13348J781311L60260J426773P12433R0637J585464K270127K202835
1784.1F98259354o35910J73797J122894R28422N72586J778717J589126Q29544p52792
1792.8G03865738n15289L842315Q20771q97446J230240J916504J066284l41416K780610
1801.5G13768311J15661K58331J106339n5161O99540M96292J196594J270294J899567
1810.2G20755768k31400M41056J098022r6436P70798m6234J435547P01218J107025
1818.8G25935364J746521L90854O33545j213990P44095P01981k449875J019287L233719
$$ plain form
1758.1 656044235 658924408 661080856 664097977 663715515 664283142 668366470 670705948 672958832 675369644
1766.8 675369644 677429733 675605927 677555161 681613617 681059265 680098953 680116501 685421829 688542862
1775.4 688542862 687829514 689610825 689971085 691397858 692110291 692200928 693786392 696056519 698259354
1784.1 698259354 697623444 697797241 698920135 699848557 700421143 702199860 703788986 704618530 703865738
1792.8 703865738 703350449 707192764 708013535 707116089 708346329 710262833 711329117 710987701 713768311
1801.5 713768311 713883972 714142303 715248642 715193481 715893021 716389313 717585907 718856201 720755768
1810.2 720755768 720524368 720965424 722063446 721967010 722737808 722691574 724127121 724828339 725935364
1818.8 725935364 727681885 728072739 728706284 727492294 728236389 728938370 726488495 727507782 730741501
1827.5G30741501L098450o8512l568192o2637K086410O11267N30167J021118J088410
1836.2G35477982P28149l43628J293335j76544j91727N0812J387024J304169m313279
1844.9G35216293L211518K365112j80435o80084j91346M61502k22549J111069L51181
1853.6G41442261J290359R26895k594K83204o83671K99149k36816N93109L50113Q47702
1863.2G45109711J243515L38592O61316j278381M51278q74404j460572J559449J597671
1871.9G47348175J532059J67312r1171j077499j26801p0114j61819R52606N78842J304245
1881.5G50355835J59759O96183m23279j224136J94091L0976J724243P7209j112289
1890.2G50478592P99484J002197J02005k96096l73230q24204J006851J69831N59539
$$ plain form
1827.5 730741501 733839951 733771439 730203247 730140610 732227020 732838287 733368454 734389572 735477982
1836.2 735477982 736206131 735862503 737155838 736979294 736787567 736838379 738225403 739529572 735216293
1844.9 735216293 738427811 740792923 740612488 739932404 739741058 740202560 739980011 741091080 741442261
1853.6 741442261 742732620 743659515 743656921 743940125 743256454 743555603 743318787 743911896 744262009 745109711
1863.2 745109711 746353226 746691818 747353134 746074753 746526031 745651627 744191055 745750504 747348175
1871.9 747348175 748880234 749047546 748956375 747878876 747752075 747681961 747520142 748472748 749051590 750355835
1881.5 750355835 750515594 751211777 750788498 749564362 749758453 749789429 751513672 751590881 750478592
1890.2 750478592 751278076 752280273 752382278 752086182 751712952 750888748 751895599 752065430 752624969
1898.9G52624969Q22297N9433M16107p57599m29840n15671O14395Q61664M44794O81381
1908.5G54821930L1662p9956q15735J45264m15497L23639P42645O70319K028885j564484
1918.2G55888672r52835J50070m24347K22168o86035M08325J220398R80835k44827
1926.8G56562424K3803m37164p56149k76642l59802R44900M47388R35516M42353m20456
1936.5G57106171k95411p42721l47900o39039R30100o6223o88477J620713P46459l20510
1946.1G57303162j077347m91104m75540J11236N80292O14166R06601J46179j69525
1954.8G57448120j156998o97937p00225k84882Q17032M84772N37033Q6517N31998l50724
1964.5G56714706o13098n79071j247711J91040O31332J148911N44052M51737Q0490
$$ plain form
1898.9 752624969 753447266 753506699 753922806 753165207 752735367 752219696 752834091 753695755 754140549 754821930
1908.5 754821930 754853592 754773636 753957901 754103165 753687668 754011307 754753952 755424271 757453156 755888672
1918.2 755888672 754935837 755085907 754661560 754883728 754197693 754606018 755826416 756807251 756562424
1926.8 756562424 756586227 756149063 755392914 755116272 754756470 755701370 756148758 757084274 757526627 757106171
1936.5 757106171 756810760 756068039 755720139 755081100 756011200 755944977 755256500 756877213 757623672 757303162
1946.1 757303162 756225815 755734711 755259171 755370407 755950699 756564865 757471466 757617645 757448120
1954.8 757448120 756291122 755593185 754892960 754608078 755425110 755909882 756446915 756533432 757065430 756714706
1964.5 756714706 756101608 755522537 754274826 754465866 755097198 756246109 756790161 757241898 757322388
1973.1G57322388q41675q07648r52148o8207J97601J315995R61227m1351l29743q99582
1982.8G55856857j53961n81360k7008J40915J33972M48914J28403N90744m43650j255340
1992.4G54838486r11637L5782L32337O18820N70679m7608L47366o98699m10386n61523
2002.1G54113617n80368J09711r8343Q63952M26255J64260o62307q99811l74451l38669
2011.7G52723846J35880l33099L51638L88108M62112k94037q57467j98670o05850L92227
2021.3G52164688J04523M1122P8736j48850K45667j59226r3613p36007k59629k86178
2031G50951233m0131N54962P0115K30255l22495l82995r88388k66724N37872J31226
2040.6G50474930J25351o3553L87039o18439l90854m82330n70602N41992N04761N57861
$$ plain form
1973.1 757322388 756480713 755673065 754720917 754652710 754850311 756166306 757127533 757086182 756756439 755856857
1982.8 755856857 755702896 755121536 755094528 755235443 755369415 755818329 755946732 756537476 756093826 754838486
1992.4 754838486 753926849 753962631 754294968 754913788 755484467 755436859 755784225 755085526 754675140 754113617
2002.1 754113617 753533249 753642960 753544617 754408569 754834824 754999084 754336777 753436966 753062515 752723846
2011.7 752723846 752859726 752526627 752878265 753266373 753728485 753434448 752576981 752378311 751772461 752164688
2021.3 752164688 752269211 752310333 752389069 752240219 752485886 752326660 752233047 751497040 751237411 750951233
2031 750951233 750911102 751466064 751536179 751766434 751443939 751060944 750072556 749805832 750343704 750474930
2040.6 750474930 750600281 750536728 750923767 750305328 749914474 749432144 748861542 749403534 749908295 750466156
2050.3G50466156k92664Q2779m28466o14930k84805m02985O47583o5918M37012J38092
2059.9G49681854k20871J29929l16544k47650q08411k3117P4387O99310M51966R5443
2069.6G49516296L60947j058502l28903m13666K9526L18832J36337O33774j08414P3777
2079.2G49160004p01294m91181m42123l93753K71072M13285R26895j53962o4544l59879
2088.9G48164520n22232n88760n17044O38046L06625O67878m3259j66016l69720o19965
2098.5G46950073M578p28531k28577l48739M44107O94656K13928K2202r83582l54614
2108.1G45685501m04434j35727k07291N57709R09348l44010M349n01633l12729m90570
2117.8G44760513m17633Q5984K37731N29786j53962L62244p5455l86352o48956o35682
$$ plain form
2050.3 750466156 750173492 750256271 749827805 749212875 748928070 748525085 749172668 749106750 749543762 749681854
2059.9 749681854 749460983 749590912 749274368 749026718 748218307 748195190 748269577 748968887 749420853 749516296
2069.6 749516296 749877243 748818741 748489838 748076172 748105698 748424530 748560867 749194641 749086227 749160004
2079.2 749160004 748458710 747967529 747525406 747131653 747402725 747816010 748742905 748588943 748524399 748164520
2088.9 748164520 747642288 747053528 746536484 747174530 747481155 748149033 748105774 747939758 747570038 746950073
2098.5 746950073 746954651 746226120 745997543 745648804 746092911 746787567 747001495 747023697 746040115 745685501
2108.1 745685501 745281067 745145340 744938049 745495758 746405106 746061096 746065445 745563812 745251083 744760513
2117.8 744760513 744342880 744428864 744666595 745196381 745042419 745404663 745329208 744942856 744293900 743658218
2127.4G43658218O562r1706P02515M14352N95093J73416l90472m70886p01065m8523
2137.1G43847504j81198O55899M33425N02549L04413p32727m11683o36062K83508K17743
2146.7G44283371J88293K46201J57089K60849m97055J33209l54385r4986K12631P9422
2156.4G44614639K43759j92565K43682j75171J48850k53296k44064P0114o3400R76715
2166G45369263J44119k46582k54211M50057J97678p23495j16272l28598O41937O83517
2175.6G45817413J84861j27717k17132k28653p63550M8523J5640N00107K31018J36414
2185.3G45596924N36346l72848j66626k81143O027J41067O28052M48914K2049K53143
2194.9G46811905o67343j99890m14353j47476J58463K69775R42078L4713o0348l64151
$$ plain form
2127.4 743658218 743664780 743573074 744275589 744689941 745285034 745458450 745067978 744597092 743896027 743847504
2137.1 743847504 743666306 744322205 744755630 745258179 745562592 744829865 744418182 743782120 744065628 744283371
2146.7 744283371 744471664 744717865 744874954 745135803 744638748 744771957 744417572 744322586 744535217 744614639
2156.4 744614639 744858398 744665833 744909515 744734344 744883194 744629898 744385834 744455948 744392548 745369263
2166 745369263 745513382 745266800 745012589 745462646 745660324 744936829 744820557 744491959 745133896 745817413
2175.6 745817413 746002274 745874557 745657425 745428772 744665222 744713745 744729385 745229492 745460510 745596924
2185.3 745596924 746133270 745760422 745593796 745312653 745318680 745459747 746087799 746536713 746558762 746811905
2194.9 746811905 746144562 745944672 745530319 745382843 745541306 745811081 746753159 746787872 746727524 746363373
2204.6G46363373j43585k72141j28860L75595M730N94177L06244L12119l01361l73765
2214.2G46736526k14996j94626O20041j34964K80228K40707K63214J66016m09393k75727
2223.9G47077026o49795O2866l5706N57404N91888K85264J19018j024933j85394k93198
2233.5G46504440k40860p8506L87726P04193P3471M92401j46942l13797r00421l26767
2243.2G46154938L51257j03226L24707R6054O25229k33001l39508l70636p39518J85318
2252.8G45951614Q5373Q90045M03367J97219n1498n84717m63791q36944J96228j01395
2262.4G45685501J24130N77164N26657R1629p67517l14941n87616J39847J07498r4223
2272.1G45488129J60522J70365N09262k69928k18125m83627k59705l57666k9144O22406
$$ plain form
2204.6 746363373 746219788 745947647 745818787 746194382 746199112 746793289 747099533 747411652 747110291 746736526
2214.2 746736526 746521530 746326904 746946945 746811981 747092209 747332916 747596130 747762146 747352753 747077026
2223.9 747077026 746427231 746490097 746454391 747011795 747603683 747888947 748007965 746983032 746797638 746504440
2233.5 746504440 746263580 746185074 746572800 747276993 747350464 747842865 747695923 747382126 746481705 746154938
2243.2 746154938 746506195 746402969 746727676 746823730 747448959 747215958 746876450 746505814 745766296 745951614
2252.8 745951614 746036987 746927032 747330399 747527618 747476120 746891403 746427612 745590668 745786896 745685501
2262.4 745685501 745809631 746386795 746913452 747005081 746237564 745922623 745335007 745474854 745582352 745488129
2272.1 745488129 745648651 745819016 746328278 746058350 745840225 745356598 745096893 744739227 744710083 745332489
2281.7G45332489n1117M61044Q9951l26386j033630m35028Q4839o68640L02582J39312
2291.4G43895416O64063K16675l67585n00030r10340k61001m95606M38691k31400q2321
2301G42366562N0430o80313j01242r33151l02201o15005L88718O25763k10801M16489
2310.7G41005249r04236m70199j267395j58768L78265j171570n17196p06787J72500
2319.3G36359863o38504k54135k46429m88282p06405j184845P32498q31375j23367
2328G32619019r02100o79398L94669j121140O53840j56479L98559r15298o01807L9597
2337.7G29729462j682282L1128p0038R4834p75833P89184N88074K975P39670k53525
2347.3G29193649J355133O37513l34321k134399j766510J183701M57077R5291j641846
$$ plain form
2281.7 745332489 745281372 745742416 745832367 745505981 744472351 744037323 744122162 743453522 743756104 743895416
2291.4 743895416 744559479 744776154 744408569 743908539 742998199 742737198 742241592 742680283 742448883 742366562
2301 742366562 742416992 741736679 741635437 740702286 740400085 739785080 740173798 740799561 740588760 741005249
2310.7 741005249 740101013 739630814 738363419 738204651 738582916 737411346 736894150 736187363 736359863
2319.3 736359863 735721359 735467224 735220795 734732513 734026108 732841263 733573761 732742386 732619019
2328 732619019 731716919 731037521 731432190 730311050 730964890 730808411 731206970 730291672 729689865 729729462
2337.7 729729462 728047180 728078308 728008270 728103104 727327271 728116455 728704529 728707504 729447174 729193649
2347.3 729193649 730548782 731186295 730851974 728717575 726951065 728134766 728591843 728687134 727045288
2356G27045288j933441l048096j205292Q80127O71845J332855m99344J285935r43680
2364.7G23586197j013260J51062J71127R89838L93372K335662O36979n68848L8528
2373.3G26720657O09208k3423n08194J091767P41195L37372J75095O22406J49078m18548
2383G29496613n9128l22037J74561r1858P324j84555p7362K86407o67572m83856o75659
2393.6G27402878l27301m3488J526J70212q5831R3613o41861o09436n89523l12577
2403.2G25058212j84173k92740K46887k60925j67237l28369j92413n42221q91724k39868
2412.9G22205429m92325p2250k3575j5640l18833n50079m26865m64019k25983n72281
2422.5G19043579Q1024q3389j37863l9597m30603l79562r42078m30374n80978k36664
$$ plain form
2356 727045288 725111847 722063751 720858459 721738586 722410431 723743286 723243942 724529877 723586197
2364.7 723586197 722572937 722723999 722895126 723884964 724278336 726613998 727250977 726682129 726720657
2373.3 726720657 727329865 727306442 726798248 727890015 728631210 728968582 729143677 729766083 729915161 729496613
2383 729496613 729437485 729115448 729290009 729198151 729205475 729020920 728943558 729229965 728562393 728078537 727402878
2393.6 727402878 727075577 727032089 727033615 727203827 727117996 727211609 726569748 725960312 725370789 725058212
2403.2 725058212 724874039 724581299 724828186 724567261 724400024 724071655 723879242 723337021 722445297 722205429
2412.9 722205429 721713104 721640854 721617279 721601639 721282806 720732727 720305862 719841843 719615860 719043579
2422.5 719043579 719124603 719041214 718903351 718863754 718433151 718053589 717111511 716681137 716100159 715863495
2432.2G15863495j21613l20511L50266n99060r32541p76978j20162k94343j53808N06363
2441.8G13401108n20630m83704k87933k32086j119843q18481q1253o04782J08947k95791
2451.5G09065552l44086n34439m63181j72119p15179o44913j092377j44195K9526j56098
2461.1G04828491J23215l12805l33939q89511p23495o62156j09253N1575l08914p7057
2470.7G01586151o85730m99420m75159o89087p39212m09393k69699k51312N2948p63398
2480.4F96856689q09707r30557n67933n3024j57852k64206r27887l17230j78070k00348
2490F92449875o75659j095581n16358q73031o09589l36838J34506J7395m79202o77109
2499.7F87338409r48715l76510n97306p49969q21610j54342R5977n80139j68686m99496
$$ plain form
2432.2 715863495 715741882 715421371 715771637 715172577 714240036 713463058 713342896 713048553 712894745 713401108
2441.8 713401108 712880478 712396774 712108841 711876755 710756912 709938431 709857178 709252396 709361343 709065552
2451.5 709065552 708721466 708187027 707723846 707551727 706836548 706191635 705099258 704955063 704984589 704828491
2461.1 704828491 704951706 704638901 704304962 703415451 702691956 702029800 701920547 701972122 701663208 701586151
2470.7 701586151 700900421 700401001 699925842 699236755 698497543 698088150 697818451 697567139 697620087 696856689
2480.4 696856689 696046982 695116425 694548492 694495468 694337616 694073410 693145523 692828293 692650223 692449875
2490 692449875 691774216 690678635 690162277 689289246 688679657 688342819 688477325 688494720 688015518 687338409
2499.7 687338409 686389694 686013184 685415878 684665909 683844299 683689957 683785934 683205795 683037109 682537613
2509.3F82537613p39975q11081m13895k96249n57480j85699l46985l57971q11921n47027
2519F77469330k62604o09283q08869n61371K71149l13797o11572p45316o82983l44315
2528.6F72800369m99038k85874k78091k89154p64237m39529n52292n46265Q2398n58625
2538.2F68669662j96685k72141n80749n59693m33044m22135q17871m31823n35965j41068
2547.9F64278488j93939l97415n59540p36313j07040m70658l56903n55725l51639l34930
2557.5F60214386p50809k33917m34647j50756q29239p60193o0730l27072j71891n29022
2567.2F55966110m27856n45349l81470m86221m82407k01950n43366l14178n39932j43357
2576.8F51900024n83572p85751k92588p21130n25513o30264k10190l48358l59039k81906
$$ plain form
2509.3 682537613 681797638 680986557 680572662 680276413 679718933 679533234 679186249 678828278 678016357 677469330
2519 677469330 677206726 676597443 675788574 675227203 675498352 675184555 674572983 673827667 673144684 672800369
2528.6 672800369 672301331 672015457 671737366 671448212 670683975 670244446 669692154 669145889 669228287 668669662
2538.2 668669662 668472977 668200836 667620087 667060394 666627350 666205215 665387344 664955521 664419556 664278488
2547.9 664278488 664084549 663687134 663127594 662391281 662284241 661813583 661456680 660900955 660549316 660214386
2557.5 660214386 659463577 659229660 658795013 658644257 657815018 657054825 656994095 656667023 656495132 655966110
2567.2 655966110 655538254 654992905 654611435 654125214 653642807 653440857 652897491 652583313 652043381 651900024
2576.8 651900024 651316452 650530701 650238113 649516983 648991470 648361206 648151016 647802658 647443619 647161713
2586.5F47161713n07737j84402n77621j65177n43899p31812n83725p56302l17306k45896
2596.1F42547836p1335q12835o00968p16476n02243L48892r64622q10357j80435j60560
2605.7F38076897o20270q25997m63180n33905l98789p92083q0910j83945q97827q02650
2615.4F32477341q73947n10521o32096k59437k68669k78092m35104q74977m44527m08669
2625F27491302n65261j369782p19185Q6365l14598k30217n34401m54330p73430r79843
2634.7F21636620q31223m20608K41241p3624n44128p80525o43883q34007p27272n78041
2644.3F16444550m57344j08033m96978n51568m86030l15361m34647n67665p96661p66831
2654F11463432l21693o97250j15319j1444j31149l71018j011314m50630n09224m79508
$$ plain form
2586.5 647161713 646653976 646469574 645891953 645726776 645182877 644451065 643867340 643111038 642793732 642547836
2596.1 642547836 642476501 641663666 641062698 640346222 639843979 640192871 639228249 638417892 638237457 638076897
2605.7 638076897 637456627 636630630 636167450 635633545 635234756 634442673 634361763 634177818 633279991 632477341
2615.4 632477341 631603394 631092873 630460777 630201340 629932671 629654579 629219475 628344498 627899971 627491302
2625 627491302 626926041 625556259 624837074 624923439 624608841 624378624 623844223 623389893 622616463 621636620
2634.7 621636620 620805397 620384789 620626030 620552406 620008278 619227753 618583870 617749863 617022591 616444550
2644.3 616444550 615987206 615879173 615382195 614830627 614344597 614029236 613594589 613026924 612230263 611463432
2654 611463432 611141739 610444489 610329170 610317726 610186577 609815559 608804245 608353615 607844391 607364883
2663.6F07364883n77468j73569J72272k62032k94113j071167r88999l64532O409j93024
2673.3F03618660j51291n9166o26411j16120o78177p33413k10991n94750n01937o29464
2682.9E99316940q8653J56326j67084n61332r06411m41475k4833m59976n82581j94168
2692.5E96046753m84352J50413J908n64194m37355r37195k03133J91l21159n90668
2702.2E92661209o83060j69296k16102l10593r14421m66767R4071l02849l46908m70124
2711.8E88875160n85747m93698N6534j21651l07769l21427l70102l63350l33099N7755
2721.5E86092606o43731k05383n4016o85081l46489n42031j57547l86276l76587j12572
2731.1E82582893n12924l75748l5972L64494l31115q02460r06601n07507L04298K36511
$$ plain form
2663.6 607364883 606787415 606613846 606786118 606524086 606229973 605158806 604169807 603805275 603811684 603618660
2673.3 603618660 603467369 603408203 602781792 602665672 601987495 601254082 601043091 600448341 599946404 599316940
2682.9 599316940 599228287 599384613 599217529 598656197 597749786 597308311 597283478 596823502 596240921 596046753
2692.5 596046753 595562401 595712814 595714722 595150528 594713173 593775978 593572845 593573036 593251877 592661209
2702.2 592661209 591978149 591808853 591592751 591282158 590367737 589900970 589995041 589692192 589345284 588875160
2711.8 588875160 588289413 587795715 587852249 587730598 587422829 587101402 586731300 586367950 586034851 586092606
2721.5 586092606 585448875 585243492 585189476 584504395 584157906 583615875 583458328 583072052 582695465 582582893
2731.1 582582893 582069969 581694221 581658249 582022743 581691628 580889168 579982567 579475060 579779358 580015869
2740.8E80015869k00577o35299J97677M8065k56996L44773o03981j026039l58010k38075
2750.4E77287407p54891m11834K34146J78833j4572j72844n75638r40819k57988l19900
2760E74251900l64991j81427l02543J86653l38249n05142l58086o51360o81190j84631
2769.7E70870934J69982l55339j74980m21371p03621m42276n59044m81873l60717k63596
2779.3E67278099j97639j12992q24127q77380m29612o38847m72145m23279k20718m66042
2789E62615318p09037o33126n21278o57959r78623l75557l57131m08860m59633p24716
2798.6E56789398j024170q15086o7177p51991j008225j168823q20732l45802o83747
2807.3E50103645k39715m80576m49867q73375j193733r63822r95750n30090q89740
$$ plain form
2740.8 580015869 579815292 579179993 579377670 579425735 579168739 579513512 578909531 577883492 577525482 577287407
2750.4 577287407 576532516 576120682 576354828 576533661 576519089 576346245 575770607 574829788 574571800 574251900
2760 574251900 573886909 573705482 573402939 573589592 573251343 572746201 572388115 571736755 571055565 570870934
2769.7 570870934 571040916 570685577 570510597 570089226 569385605 568943329 568384285 567902412 567541695 567278099
2779.3 567278099 567080460 566967468 566143341 565265961 564836349 564197502 563725357 563302078 563081360 562615318
2789 562615318 561906281 561273155 560751877 560093918 559115295 558739738 558382607 557973747 557514114 556789398
2798.6 556789398 555765228 554950142 554882965 554130974 553122749 551953926 551133194 550787392 550103645
2807.3 550103645 549863930 549383354 548933487 548060112 546866379 545902557 544906807 544376717 543486977
2816E43486977n19791m89006q93784j081810j164741o56243j055908p69195q24776
2824.7E36031723r18541o56128r98878j039391j361198q73413n67666r37232j253586
2833.3E27425690r53904o98356j129608j170159j641388j252784j162148j654472j439629
2842E16323242j715889k258987k486267j612358j676140k069588k363548k835427j774292
2850.7D97530746j525573j637078j120605r57642j116066m96063J24054k5711M03290
2859.4D91179352p2174q63495j172562o32210q5449n55382r10530j334953q03032p76367
2869D83973198q98781r39979j244622o73103j203842j091347n35698o06041q97446
2877.7D75882339r39064l60145r60350j164665j098137q04596m63715p54623r44481
$$ plain form
2816 543486977 542967186 542478180 541584396 540502586 539337845 538681602 537625694 536856499 536031723
2824.7 536031723 535113182 534457054 533458176 532418785 531057587 530184174 529616508 528679276 527425690
2833.3 527425690 526471786 525773430 524643822 523473663 521832275 520579491 519417343 517762871 516323242
2842 516323242 514607353 512348366 509862099 508249741 506573601 504504013 502140465 499305038 497530746
2850.7 497530746 496005173 494368095 493247490 492289848 491173782 490677719 490801773 490776062 491179352
2859.4 491179352 491107178 490243683 489071121 488438911 488353462 487798080 486887550 485552597 484749565 483973198
2869 483973198 483074417 482134438 480889816 480216713 479012871 477921524 477385826 476779785 475882339
2877.7 475882339 474943275 474583130 473622780 472458115 471359978 470555382 470091667 469337044 468392563
2886.4D68392563j320610o82831q43201j202850j076660j439934q65860p90596r65996
2895.1D59204025j111717j295853j029930q24623o45943q30040q12454n16929o10505
2903.7D51526031j118507j028480q26683q45566n86853j032753j586113j719246j299019
2912.4D41482811j084633j547165j671638j666184j714935j434250j319275j862106
2920.1D29182625j498528r89456p42721l59917j130600j071320l21159J78947M75922
2928.8D23723793J1787k08129J94473L99170k7008M32129P59506J77841K94075Q17413
2938.5D26575050P91054O14929J280098J170082P18499P89108N58243M31366L55911
2947.1D33284340O41174R26094J096344N49393J29623M49067N99632Q60252L64914
$$ plain form
2886.4 468392563 467071953 466389122 465545921 464343071 463266411 461826477 460960617 460170021 459204025
2895.1 459204025 458092308 456796455 455766525 454941902 454295959 453465919 452653465 452136536 451526031
2903.7 451526031 450407524 449379044 448552361 447706795 447119942 446087189 444501076 442781830 441482811
2912.4 441482811 440398178 438851013 437179375 435513191 433798256 432364006 431044731 429182625
2920.1 429182625 427684097 426694641 425951920 425592003 424461403 423390083 423068924 423247871 423723793
2928.8 423723793 423735580 423527451 423721924 424121094 424094086 424526215 425285721 425463562 425757637 426575050
2938.5 426575050 427366104 427981033 429261131 430431213 431149712 431938820 432497063 432928429 433284340
2947.1 433284340 433925514 434851608 435947952 436497345 436626968 437076035 437675667 438535919 438900833
2955.8D38900833K07710L76397R13810J230736P16972Q93517K81906J53008M43000
2964.5D44117889O03676Q54492L13683M71840P51266J036377R56040P82699O31409
2973.2D50519371M94003P46842K01835M18816O76651P51801P01599K06489L62168N4740
2982.8D55134315L07999N93567L33366J34430j34010M8218N18303P20710K8153m0970
2992.5D57644081r0446k68822K3384k39792l69911n82581m72679k61154r4299k95067
3002.1D54992714o18973m72221q70514o80046n78537o02761m22592l98864l41454r22813
3011.7D49083939q07076n48820p60727j031456j005440n40009k70347l71056q56666
3020.4D42892342p35016r18312q44345n70870r53865q60710j054154r66300r78013
$$ plain form
2955.8 438900833 439108543 439484940 440398750 441629486 442346458 443239975 443521881 443674889 444117889
2964.5 444117889 444721565 445576057 445889740 446361580 447112846 448149223 449105263 449887962 450519371
2973.2 450519371 451013374 451760216 451962051 452380867 453057518 453809319 454510918 454717407 455079575 455134315
2982.8 455134315 455442314 456035881 456369247 456503677 456369667 456417885 456936188 457656898 457685051 457644081
2992.5 457644081 457553635 457284813 457308197 457068405 456698494 456115913 455643234 455382080 455287781 454992714
3002.1 454992714 454373741 453901520 453031006 452350960 451772423 451169662 450747070 450348206 450006752 449083939
3011.7 449083939 448276863 447728043 446967316 445935860 444930420 444390411 444120064 443749008 442892342
3020.4 442892342 442157326 441239014 440394669 439823799 438869934 438009224 436955070 435988770 435010757
3029.1D35010757r14421o13823o61850m55741p79686j159249j549492j316261r79576
3037.8D26580658q18787l20625j158409j441841n07279m63371j020431j089821j159745
3046.5D18600349r58976o16646j135788r28230o12069r73396j662598j348648n8059
3055.1D10305939n33257j518669j662178q46367k67792o43386j029129j193276o49338
3063.8D01962547o12373m06265o04210j160774p41616r24682j092415j188507q39958
3072.5C94391747p42798r93157l29399l50418m70886m63333j138764j404342o30494
3081.2C87868156m99420r23309p56722p46803n43251o25229o08063n95817j094666
3089.9C81474876j232681r85222m84810p09419o51283o86569j214104m74358n2719
$$ plain form
3029.1 435010757 434096336 433482513 432820663 432364922 431585236 430425987 428876495 427560234 426580658
3037.8 426580658 425761871 425441246 424282837 422840996 422333717 421870346 420849915 419760094 418600349
3046.5 418600349 417641373 417024727 415888939 414960709 414348640 413375244 411712646 410363998 410305939
3055.1 410305939 409772682 408254013 406591835 405745468 405477676 404834290 403805161 402611885 401962547
3063.8 401962547 401350174 400943909 400339699 399178925 398437309 397512627 396420212 395231705 394391747
3072.5 394391747 393648949 392655792 392326393 391975975 391505089 391041756 389902992 388498650 387868156
3081.2 387868156 387368736 386445427 385688705 384941902 384398651 383773422 383165359 382569542 381474876
3089.9 381474876 380242195 379256973 378772163 378062744 377411461 376724892 375510788 375036430 374983711
3098.5C74983711n91469r52529j157303j372681p97310m93469n85671l64418p60154
3107.2C67908707r06372j068192r88617m99306o76612j189499j118851p20825q45375
3115.9C59895058m38118o77147q45604p37686j199303n46989q72345j142960p20978
3124.6C52713928p27005p31659j129608p66945r38301q87718l47672q45871j320304
3133.3C45018845j322213p33490l49388n27572q74138o43006p60231j258201j215363
3141.9C37335243j418190q44955l78952n74684q14667r48639j005516j111183l99246
3150.6C29839211l67508q37212j254883j428947j048203q06885l14140o88858r86862
3159.3C22105713q10356r92317r90735o56948n54199j344051r93710n31158r31568
$$ plain form
3098.5 374983711 374392242 373439713 372282410 370909729 370112419 369618950 369033279 368668861 367908707
3107.2 367908707 367002335 365934143 364945526 364446220 363769608 362580109 361461258 360740433 359895058
3115.9 359895058 359456940 358779793 357934189 357196503 355997200 355450211 354577866 353434906 352713928
3124.6 352713928 351986923 351255264 350125656 349358711 348420410 347532692 347185020 346339149 345018845
3133.3 345018845 343696632 342963142 342613754 342086182 341212044 340569038 339808807 338550606 337335243
3141.9 337335243 335917053 335072098 334693146 334118462 333303795 332355156 331349640 330238457 329839211
3150.6 329839211 329471703 328634491 327379608 325950661 324902458 324095573 323781433 323092575 322105713
3159.3 322105713 321295357 320303040 319312305 318655357 318101158 316757107 315763397 315232239 314300671
3168C14300671j080361j185722p68948n43651n08900r67617j430721j037121m18873
3176.6C06358757o17008j499844r19971m58527p25422q06045p57656o75145j127662
3185.3B98771477r71432p02152r01108r86729l33271k55031j219426r82532p75738
3194B91644058p54776p86361j056138q31165o81133m07467p12986r83315p53326n36804
3203.6B84140587m23012m47731l64761q23574r64928n89542l35789n83420q26416m10480
3213.3B78370934n27535n02739l79887o50177n47161p40623j119824j021404n29423
3222B72352161o4354m96597r50203o10351o54698n17177m86203o02188l23677o73008
3231.6B66973705l88584l06492l52840l85876j113052n29747n79739j048279n65662
$$ plain form
3168 314300671 313220310 312034588 311265640 310721989 310213089 309245472 307814751 306777630 306358757
3176.6 306358757 305741749 304241905 303321934 302863407 302137985 301331940 300574284 299899139 298771477
3185.3 298771477 297800045 297097893 296196785 295210056 294876785 294621754 293402328 292419796 291644058
3194 291644058 290889282 290102921 289046783 288215618 287534485 287127018 286414032 285430717 284677391 284140587
3203.6 284140587 283717575 283269844 282905083 282081509 281116581 280527039 280191250 279607830 278781414 278370934
3213.3 278370934 277843399 277340660 276960773 276310596 275763435 275022812 273902988 272881584 272352161
3222 272352161 272287807 271791210 270841007 270230656 269575958 269058781 268572578 267970390 267646713 266973705
3231.6 266973705 266585121 266278629 265925789 265539913 264426861 263897114 263317375 262269096 261703434
3240.3B61703434k67181n91240q19302l5191m37736o20575j84002q83579p40357m4078
3249.9B57080193j82419r39579o39801l71495q87336n63107m65736m94023n27763p07302
3259.6B51301632m12083j08356k76489m98295m60129o26297o66580l00141O447k75020
3269.2B47684689n57824l76300O0672j53293j099644n55782k68689q19778n13992m82426
3278.9B42917633m41132l81584k30446L2978j53350l23964o28185q32710k08359J24970
3288.5B39875851m37146m54540n14831o09398l17192k28710k99092n41687k99606n22862
3298.2B35650787m64344k41584n81074J52492J26267l81241m62341m64802j26381l43227
3307.8B32864552o11325n88741n60093p33833j22433P9594n83668m19655o47507n78365
$$ plain form
3240.3 261703434 261436253 260845013 260025711 259990520 259552784 258932209 258748207 257864628 257124271 257080193
3249.9 257080193 256897774 255958195 255318394 254946899 254059563 253496456 253030720 252536697 252008934 251301632
3259.6 251301632 250889549 250781193 250504704 250006409 249546280 248919983 248253403 247953262 247959709 247684689
3269.2 247684689 247126865 246750565 246811237 246657944 245558300 245002518 244733829 243914051 243400059 242917633
3278.9 242917633 242476501 242094917 241864471 241897449 241744099 241420135 240791950 239959240 239750881 239875851
3288.5 239875851 239438705 238984165 238469334 237859936 237542744 237314034 237014942 236473255 236173649 235650787
3298.2 235650787 235186443 234944859 234363785 234516277 234642544 234261303 233798962 233334160 233207779 232864552
3307.8 232864552 232253227 231664486 231104393 230370560 230248127 230327721 229744053 229324398 228676891 228098526
3317.4B28098526l75595j12000L7270o88229p49244n63279K3442j09749q01430p23591
3327.1B24036121j215858j271153l58314J46961l73859m13418k25086m56066p59354
3335.8B19109974j471367p75967j85470n23987l84808l84197l90625m12617j46293
3344.4B14434643m62609q27293l39794k90814m70218l21617j25523m98276p84855p95574
3354.1B09518070n55439J20106L03173l56007r99565j42135L02906l85723k31133P7667
3363.7B07651920L4504l03688m11300k63634l66116l91254j46122j05820m41856m43402
3373.4B04813232j10416L08800j30329o96259l56350k37884k42215j82590k9507r5005
3383B03041477m1752J32771L9787M30679K83242k01702n00908m26197P5607l5267r327
$$ plain form
3317.4 228098526 227722931 227610931 227648201 226959972 226210728 225647449 225670891 225561142 224759712 224036121
3327.1 224036121 222820263 221549110 221190796 221337757 220963898 220550480 220325394 219869328 219109974
3335.8 219109974 217638607 216862640 216677170 216153183 215768375 215384178 214993553 214580936 214434643
3344.4 214434643 213972034 213144741 212804947 212514133 212043915 211722298 211596775 211098499 210313644 209518070
3354.1 209518070 208962631 209082737 209385910 209029903 208030338 207888203 208191109 207805386 207574253 207651920
3363.7 207651920 207686424 207382736 206971436 206707802 206341686 205950432 205804310 205698490 205256634 204813232
3373.4 204813232 204702816 205011616 204881287 204185028 203828678 203590794 203348579 203165989 203136482 203041477
3383 203041477 202999725 203132496 203172283 203602962 203886204 203684502 203183594 202757397 202833004 202797737 202788410
3393.6B02788410J7109l61099n12600l14274R1534M24633L21483l28693o74248m31785
3403.3B01020470K5406O5078K26364M00105o2008o3972J92947M81968k86o11878L48549
3413.9B02022743Q27008J90029m3393N8041n7678K41909N34992M01020M43592R7828
3423.5B04716091l06358Q0261J141567O17199l89461J73740K35653L26633K00844J05305
3433.2B06901474N60436Q1291J85605N99880O09455P19986L12748M04720O60019j40247
3442.8B10895367J13048P17831L55015N30510J95160L96041J003476N23910N75333
3451.5B15305691P00207O47926O04400L20035L67832P40108Q58727R20562J038990
3460.2B21504478L56961M12101R21078R59797P75147J07498N01671P93590O49204Q06351
$$ plain form
3393.6 202788410 202805519 202444420 201931820 201617546 201709080 202133713 202455196 202126503 201452255 201020470
3403.3 201020470 201045876 201110954 201337318 201737423 201675415 201611443 201804390 202286358 202286072 201674194 202022743
3413.9 202022743 202849751 203039780 202996387 203054428 202996750 203238659 203773651 204174671 204618263 204716091
3423.5 204716091 204409733 204489994 205631561 206248760 205859299 206033039 206268692 206595325 206796169 206901474
3433.2 206901474 207461910 207543201 207728806 208328686 208938141 209658127 209970875 210375595 211035614 210895367
3442.8 210895367 211008415 211726246 212081261 212611771 212806931 213202972 214206448 214730358 215305691
3451.5 215305691 216005898 216653824 217258224 217578259 217946091 218686199 219544926 220465488 221504478
3460.2 221504478 221861439 222273540 223194618 224154415 224929562 225037060 225538731 226332321 226981525 227787876
3469.8B27787876Q45127Q64773O72913J116905P94163j15567N17311J241036R93862
3478.5B34718399Q83160J426468J424503O71329K45362P45411Q11805N28756O96373
3487.2B42151566R31243J228486J241855J132069K73208M32148J438485J379432J248570
3495.8B51457062M37336M86107J153774J374016J258106J046810J618137P23114N04742
3504.5B60059204J242333R71145P16210J140937J713067Q88500J071853J042214Q43124
3513.2B69688587J229897R23118J362515J474304J636868J451683P63111Q01296J050281
3521.9B80381660J282711M81930J119805K205448J552315J014385J304111J047573
3529.6B90389938J238881J972942J417389J027946J137963J813373J641693J023178
$$ plain form
3469.8 227787876 228633003 229497776 230170689 231287594 232081757 231966190 232483501 233724537 234718399
3478.5 234718399 235601559 237028027 238452530 239123859 239369221 240114632 240926437 241455193 242151566
3487.2 242151566 243082809 244311295 245553150 246685219 246958427 247390575 248829060 250208492 251457062
3495.8 251457062 251894398 252380505 253534279 254908295 256166401 257213211 258831348 259554462 260059204
3504.5 260059204 261301537 262272682 262988892 264129829 265842896 266731396 267803249 268845463 269688587
3513.2 269688587 270918484 271841602 273204117 274678421 276315289 277766972 278530083 279331379 280381660
3521.9 280381660 281664371 282146301 283266106 285471554 287023869 288038254 289342365 290389938
3529.6 290389938 291628819 293601761 295019150 296047096 297185059 298998432 300640125 301663303
3537.3C01663303J609288J585331J815776J290684J549606J786385J341667J383648
3545C14025688P39956J768513J039829J916332K481880J792489K366485M12483J433869
3553.7C27977524J783600J957435K589875J055831J833573K197189K287064J314544
3561.4C42996635K075081K137032J247330L762626N94368Q63915J990661O82068L330345
3570.1C59680061K354241K941360K514305J741028K088356K181206K049065J414032
3577.8C76963654L188667K007103J611137K737885K093696J851807K101746M405365
3585.5C96961060J872673l06054K069321R18236M037514L995819L886718K522927J525726
3594.2D17483940L662186k1630K113457M349785K284088K593460J476593K364235K823525
$$ plain form
3537.3 301663303 303272591 304857922 306673698 307964382 309513988 311300373 312642040 314025688
3545 314025688 314765644 316534157 317573986 319490318 321972198 323764687 326131172 326543655 327977524
3553.7 327977524 329761124 331718559 334308434 335364265 337197838 339395027 341682091 342996635
3561.4 342996635 345071716 347208748 348456078 352218704 352813072 353676987 355667648 356349716 359680061
3570.1 359680061 362034302 364975662 367489967 369230995 371319351 373500557 375549622 376963654
3577.8 376963654 380152321 382159424 383770561 386508446 388602142 390453949 392555695 396961060
3585.5 396961060 398833733 398527679 400597000 401515236 405552750 409548569 413435287 415958214 417483940
3594.2 417483940 421146126 421124496 423237953 427587738 429871826 432465286 433941879 436306114 439129639
3602.9D39129639K242927L297997L933830L421288O11839L304443R74579J626701P959099
3611.6D66502342K055741k94533M687385M30451M759598M859047R35974K800369J875877
3620.3D88612251K238922L117524L418274L396530L986129L411828K839241N771369
3628E16792068N036n238609N308685N524216O147728L059043L59917L645821M539909
3636.6E40143814L660050J814193K288590L581886L937454K710991J442108L278923
3644.4E62858009N120087O066475K9030M54292Q018227k93351l246040J710701O261101
3653E86978531M820480M572869M974708o590729M239197O660843J558151K156563J878967
3661.7F11249580L590966J830444J843529K884865J618652N070152K865639k1095P97920
$$ plain form
3602.9 439129639 441372566 444670563 448604393 452025681 452637520 455941963 456916542 458543243 466502342
3611.6 466502342 468558083 468263550 472950935 473381386 478140984 483000031 483936005 486736374 488612251
3620.3 488612251 490851173 493968697 497386971 500783501 504769630 508181458 511020699 516792068
3628 516792068 516797104 511558495 516867180 522391396 528539124 531598167 531958084 535603905 540143814
3636.6 540143814 543803864 545618057 547906647 551488533 555425987 558136978 559579086 562858009
3644.4 562858009 567978096 574044571 574073601 574527893 582546120 582252769 579006729 580717430 586978531
3653 586978531 591799011 596371880 601346588 594755859 598995056 605655899 607214050 609370613 611249580
3661.7 611249580 614840546 616670990 618514519 621399384 623018036 628088188 630953827 630932732 631730652
3670.4F31730652n816765L830261Q884621Q951111N71518j5481873K228661Q601265
3678.1F43499451N662536k120742L58734K857971K177582K014236J241379J141128
3685.8F56832275M410630O168213r803009j260834Q906326o405029M98810N617523
3693.5F64964905J223602K057190O53152K71760J794052O37893K794953L079529n014267
3702.2F72462769j385575M477082J080398m0207N92575L209000M283523o569442L440704
3710.9F81550827L445740j1870957O113282M927673p6752M96369K268524J844101l192902
3719.6F85505905J225739O405410l012695m944916M824982K081299p39136l615875
3727.3F87730713N9357L688812J512451O025162k162705p343368Q526306J292648q738861
$$ plain form
3670.4 631730652 625913887 629744148 638628769 647579880 648151398 632669525 634898186 643499451
3678.1 643499451 649161987 647041245 647399979 650257950 652435532 654449768 655691147 656832275
3685.8 656832275 661242905 667411118 657608109 656347275 665253601 658848572 659347382 664964905
3693.5 664964905 666188507 668245697 668898849 669170609 670964661 671602554 674397507 677477036 672462769
3702.2 672462769 671077194 675554276 676634674 676594467 677187042 680396042 684679565 678110123 681550827
3710.9 681550827 684996567 673125610 679238892 684166565 684089813 684586182 686854706 688698807 685505905
3719.6 685505905 686731644 693137054 690124359 685179443 690004425 692085724 691346588 687730713
3727.3 687730713 687790070 691478882 692991333 699016495 696853790 689510422 698036728 699329376 690590515
3736F90590515o71997K924347K095184K517853K404938m279251L491134J3011475j0427933
3744.7G01656265j9130478J0341721P314072P579650k071914j1180573J0117951n511017
3752.4F99115677p167816O223526M725799L683243m424820K016144N156326q175812
3760.1G01152267j178360M425049J256104P46155L366546l347015m150849M106522
3767.8G06376419N207291K92816r677048J271057L725052J148071P47452o32095J258087
3776.5G09717102q8654K239838L80020p528839K781067K444763J424256K249679l522262
3785.2G10096970p50809J761093N25131L25928P8430K31629l6698K10190o10K395553
3794.8G14836807L633805n021286n052720K620469M872131O220245n542297j0828476
$$ plain form
3736 690590515 689918518 692842865 694938049 697455902 699860840 695581589 699072723 712084198 701656265
3744.7 701656265 682525787 692867508 700181580 707761230 705689316 694508743 704626694 699115677
3752.4 699115677 691947861 698171387 702897186 706580429 702155609 704171753 709328079 701152267
3760.1 701152267 699973907 704398956 705655060 706401215 709767761 706420746 702269897 706376419
3767.8 706376419 711583710 711876526 702199478 703470535 707195587 708343658 709091110 708459015 709717102
3776.5 709717102 709628448 711868286 712248306 704719467 707500534 709945297 711369553 713619232 710096970
3785.2 710096970 709346161 711107254 711632385 711958313 712036743 712268372 712231674 712441864 712441254 714836807
3794.8 714836807 718470612 713449326 708396606 711017075 715889206 722109451 716567154 705738678
3802.5G05738678K797928K809677N039062N585785j0275039l890763N464096J776276
3810.2G15045700R4605O24160J85471J768570N465851l056183j4967804N552139O612168
3818.9G17324677N093917K776413j8180847J310043O346818K599868J915741j458359
3826.6G17728271l568038J585998K149582L091278J776047q749619K318039P502213
3834.3G23833771n642624m97513O899490j0174255l145370Q191833n643921j41830
3842.1G13679581P643814k725373m227066L345719K157059R92202J386338j417847
3849.8G20834427K136001N584946o110229m74244j3833084J546936R772797j613464
3857.5G17844086k133484K500076L075638K661667n580902N58700O351319o867371
$$ plain form
3802.5 705738678 708536606 711346283 716385345 721971130 711696091 707805328 713269424 715045700
3810.2 715045700 715140305 715764465 715949936 717718506 723184357 720128174 705160370 710712509 717324677
3818.9 717324677 722418594 725195007 707014160 708324203 714671021 717270889 719186630 717728271
3826.6 717728271 714160233 715746231 717895813 720987091 722763138 714013519 716331558 723833771
3834.3 723833771 718191147 717693634 724593124 714418869 711273499 719465332 713821411 713679581
3842.1 713679581 721323395 718598022 714370956 717716675 719873734 720865936 722252274 720834427
3849.8 720834427 722970428 728555374 722445145 721970901 708137817 709684753 719457550 717844086
3857.5 717844086 715710602 718210678 721286316 723947983 718367081 718925781 725277100 718409729
3865.2G18409729n032120M819641N564347N101776j0084763q809128N689164P164840
3872.9G22823486K755738j1267929R57260M201355J56173L105011M014969o758804
3880.6G19987259o503906O043090J952668J989135L221970j3524017K410660M137954
3888.3G19714813P33490M485321o36368p847747J302337L763275j237106J121674J083145
3897G22482834J839447K653351q985215M309388O85348o119613N060043l326569j114807
3905.7G17484207J183548J166458J433945m43726J015091k29263Q6899J98517K09808
3914.4G22105484J687241J475448l516769l526001M281692o4850l614425K029877J886444
3923.1G22744141J548843l086319l191299K436142K146530M29687k799835n93033L236160
$$ plain form
3865.2 718409729 713377609 718197250 723761597 728863373 718778610 709969482 715658646 722823486
3872.9 722823486 725579224 714311295 715268555 719469910 719626083 722731094 726746063 719987259
3880.6 719987259 713483353 719526443 721479111 723468246 726690216 713166199 715576859 719714813
3888.3 719714813 720448303 724933624 724297256 716449509 717751846 721515121 720278015 721399689 722482834
3897 722482834 724322281 726975632 717990417 722299805 722985153 716865540 721925583 718599014 717484207
3905.7 717484207 718667755 719834213 721268158 720824432 721839523 721610260 721697159 721895676 722105484
3914.4 722105484 723792725 725268173 721751404 718225403 722507095 722442245 718827820 720857697 722744141
3923.1 722744141 724292984 721206665 718015366 720451508 722598038 723027725 720227890 719634857 722871017
3931.7G22871017j697082j445389J327515m75006J20086K15454l31802L92990R0332
3940.4G21068115J306229O60782l874512j203003P80335J260147J659622k142258Q56781
3949.1G20372238J127854k135621K080689Q23898r02023o87027p97348O83670R7732
3957.8G20664062M85993k53296N30090P46766j410218K42157N36728q3313p26852n65644
3967.4G20166473N83039R0866P2708M84161k22854o79627m62112j194077K15454J651993
3977.1G20706024J092453P56378l50418o31942l39585L79334j51520n6381O51397l77349
3986.7G21678391K62374q1176j24131l52325j063767J49689O29044Q27179r97467n93109
3996.3G20334702J065902L44086J72729o71539
$$ plain form
3931.7 722871017 721173935 719728546 721056061 720581055 720701141 720916595 720584793 720977783 721068115
3940.4 721068115 722374344 723035126 719160614 717957611 718737946 719998093 721657715 719515457 720372238
3949.1 720372238 721500092 719364471 721445160 722269058 721367035 720680008 719882660 720566330 720664062
3957.8 720664062 721150055 720896759 721426849 722173615 720763397 721005554 721542282 721458969 720732117 720166473
3967.4 720166473 720749512 720840378 720913086 721397247 721174393 720494766 720032654 718838577 719054031 720706024
3977.1 720706024 721798477 722554855 722204437 721572495 721232910 721612244 721460724 721404343 722055740 721678391
3986.7 721678391 721940765 721859589 721735458 721383133 720319366 720469055 721098099 721925278 720927811 720334702
3996.3 720334702 721400604 721744690 721917419 721245880
4000.2G21245880
$$ plain form
4000.2 721245880
##END=$$ End of the data block
