##TITLE=$$ Begin of the data block
##JCAMP-DX=5.00 $$ ACD/SpecManager v 10.08
##SPECTROMETER/DATA SYSTEM=Varian
##DATE=08 Jan 2013 16:21:20
##DATA TYPE=INFRARED SPECTRUM
##DATA CLASS=XYDATA
##ORIGIN=
##OWNER=
##NPOINTS=3735
##FIRSTX=399.26403809
##LASTX=4000.35498047
##MAXX=4000.35498047
##MINX=399.26403809
##MAXY=74.02394104
##MINY=24.92408752
##XFACTOR=1.0000000000
##YFACTOR=0.000000100000000
##FIRSTY=44.85100555
##DELTAX=0.96440572
##XUNITS=1/CM
##YUNITS=TRANSMITTANCE
##XYDATA=(X++(Y..Y))
$$ plain form
399.3 448510056 450614853 453533440 457581635 459379921 460451393 460228271 460053825 453680305 452199478
407.9 452199478 459779625 465468674 470472870 466397095 460843658 458091698 460298767 469932861
415.7 469932861 470538139 461347046 447398453 460978508 465023155 458393097 457738380 456631203
423.4 456631203 457155533 464051933 463441048 456573677 454656944 452366829 451290398 451503296 447176018
432.1 447176018 448887634 454738655 455381699 451709328 451166878 454582214 453954124 453497353 454504929
440.7 454504929 453297653 455285950 456630325 455153656 458056145 463560143 463691978 459686699 456825409
449.4 456825409 456804161 457916679 458109283 459096413 458837128 453783112 450797615 450894089 449480515
458.1 449480515 451870956 450536690 449270477 450811501 450402451 451225433 450939445 448513489 444821587
$$ packed form
399.3D48510056K104797K918587M048195J798286J071472k23122j74446o373520j480827
407.9D52199478P580147N689049N004196m075775n553437k751960K207069R634094
415.7D69932861O05278r191093j3948593J3580055M044647o630058o54717j107177
423.4D56631203N24330O896400o10885o867371j916733k290115j076431K12898m327278
432.1D47176018J711616N851021O43044l672371n42450L415336o28090m56771J007576
440.7D54504929j207276J988297J344375j476669K902489N503998J31835m005279k861290
449.4D56825409k1248J112518J92604R87130k59285n054016k985497R6474j413574
458.1D49480515K390441j334266j266213J541024m09050Q22982k85988k425956l691902
$$ plain form
466.8 444821587 443217010 446217232 446948509 444796829 444387779 450261841 452755470 448474617 443988380
475.5 443988380 443560677 445025291 442484207 437812767 438420067 443232155 441831741 439905586 442878113
484.1 442878113 443070183 438410988 433235474 435409393 438267326 436174164 435943298 438340836 437687836
492.8 437687836 436061401 435268593 435886345 439858284 440275192 437125969 436026497 437651520 439516258
501.5 439516258 437814140 437504539 437537117 436329842 434421234 433493271 433965912 431625824 430924759
510.2 430924759 431516037 431442375 430144615 429082069 431598434 431634445 429171867 429708481 431515503
518.9 431515503 430051384 427429810 425904160 424758072 427193985 431063156 432779846 429120598
526.6 429120598 426269112 426614609 426514015 425743790 424028473 424153366 425160751 426251221 427325172
$$ packed form
466.8D44821587j604577L000222P31277k151680m09050N874062K493629m280853m486237
475.5D43988380m27703J464614k541084m671440O07300M812088j400414j926155K972527
484.1D42878113J92070m659195n175514K173919K857933k093162k30866K397538o53000
492.8D37687836j626435p92808O17752L971939M16908l149223j099472J625023J864738
501.5D39516258j702118l09601L2578j207275j908608r27963M72641k340088p01065
510.2D30924759N91278p3662j297760j062546K516365L6011k462578N36614J807022
518.9D31515503j464119k621574j525650j146088K435913L869171J716690l659248
526.6D29120598k851486L45497j00594p70225j715317J24893J007385J090470J073951
$$ plain form
535.2 427325172 426498795 425146484 423733406 422628136 420898399 421210327 422344513 421111336 421039543
543.9 421039543 421412544 421055527 420087280 419224243 418711472 418712921 418953285 417953606 418216248 419838219
553.6 419838219 419651833 417866058 417011719 414959602 413393173 414191132 414341698 415171127 414266472
562.3 414266472 413318748 413566055 413687782 415492134 415582314 414758377 414640007 415436897 415665741 414164429
571.9 414164429 413382645 413034821 413980942 414271355 413774757 412844734 411189384 411945496 413434982
580.6 413434982 413690834 412753868 412552109 412664757 412502975 413839493 414397240 414471512 414408913 413762894
590.2 413762894 414226036 416059113 417543068 417377090 416824379 417099152 416639671 415751266 415690193 415467987
599.9 415467987 416631699 418293495 418422012 418333664 417343864 415463486 413144531 412237396 413037262
$$ packed form
535.2D27325172q26377j352311j413078j105270j729737L11928J134186j233177p1793
543.9D21039543L73001l57017r68247q63037n12771J449K40364r99679K62642J621971
553.6D19838219j86386j785775q54339k052117j566429P97959J50566Q29429r04655
562.3D14266472r47724K47307J21727J804352R0180q23937j18370P96890K28844j501312
571.9D14164429p81784l47824R46121K90413m96598r30023j655350P56112J489486
580.6D13434982K55852r36966k01759J12648j61782J336518N57747P4272o2599o46019
590.2D13762894M63142J833077J483955j65978n52711K74773m59481q88405o1073k22206
599.9D15467987J163712J661796J28517q8348r89800j880378k318955r07135P99866
$$ plain form
608.5 413037262 412953072 412420044 411345901 410990486 411861229 412781143 412626686 411939812 412392654 412471848
618.2 412471848 412393265 412410164 412907143 413035507 412547607 413887825 415260010 416149330 417372398 418080139
627.8 418080139 418346863 419478760 422046356 423845444 424147415 424236031 425565033 427485580 428901749
636.5 428901749 430580444 432000351 433223724 433926888 433936081 434896278 436847153 438507767 439150581
645.2 439150581 440458946 441839294 441952667 442456779 442193718 441847725 444023857 447330818 448872757
653.9 448872757 448214340 447373390 447106705 447069321 447106628 447612114 447395287 446546593 446667595 447048454
663.5 447048454 447335358 447837563 448870850 450194740 449151497 448371773 449481735 451302757 452001762
672.2 452001762 452354507 453222275 453532028 453733711 454315834 456574440 458892899 459668617 460786591
$$ packed form
608.5D13037262q4190n33028j074143l55415Q70743R19914j54457o86874M52842P9194
618.2D12471848p8583J6899M96979J28364m87900J340218J372185Q89320J223068P07741
627.8D18080139K66724J131897K567596J799088L01971Q8616J329002J920547J416169
636.5D28901749J678695J419907J223373P03164R193R60197J950875J660614O42814
645.2D39150581J308365J380348J13373N04112k63061l45993K176132L306961J541939
653.9D48872757o58417q40950k66685l7384L7307N05486k16827q48694J21002L80859
663.5D47048454K86904N02205J033287J323890j043243p79724J109962J821022O99005
672.2D52001762L52745Q67768L09753K01683N82123K258606K318459P75718J117974
$$ plain form
680.9 460786591 461600609 461466827 462140427 464150505 465198059 464365578 464181976 465419769 466509972
689.6 466509972 468018379 469737930 469948654 470220108 471163559 471789627 472838440 473731041 473507347
698.2 473507347 473049164 473902855 475887566 476778297 477017517 477844162 478204689 478513374 478751373 479132957
707.9 479132957 479934425 481139336 483557510 484352684 484183159 484580383 484391251 485220070 486329536
716.6 486329536 487214775 487896500 489062157 490294609 490045471 490336304 490934334 491640434 492080421
725.2 492080421 493065758 494854088 496067963 497740135 498906403 500021515 500469742 499669724 499246674
733.9 499246674 499776840 501368980 502490082 503899651 505141449 505440063 504732552 503710518 504595833
742.6 504595833 506193886 507031746 507099724 508497810 509407501 509740105 511726913 511763535 510990486 510942497
$$ packed form
680.9D60786591Q14018j33782O73600K010078J047554q32481j83602J237793J090203
689.6D66509972J508407J719551K10724K71454R43451O26068J048813Q92601k23694
698.2D73507347m58183Q53691J984711Q90731K39220Q26645L60527L08685K37999L81584
707.9D79132957Q01468J204911K418174P95174j69525L97224j89132Q28819J109466
716.6D86329536Q85239O81725J165657J232452k49138K90833N98030P06100M39987
725.2D92080421R85337J788330J213875J672172J166268J115112M48227q00018m23050
733.9D99246674N30166J592140J121102J409569J241798K98614p07511j022034Q85315
742.6E04595833J598053Q37860O7978J398086R09691L32604J986808L6622p73049m7989
$$ plain form
752.2 510942497 512036781 514037933 515246162 516331635 516470985 516517372 517363586 518794212 520272522
760.9 520272522 521431046 521639404 521368446 522421150 523588638 524938583 525576553 525149193 524819412
769.6 524819412 525414505 526806183 526957970 527094116 526876793 526427650 526708412 526405907 525667419 526679344
779.2 526679344 528477287 527395439 527015495 528345871 529442787 530513763 530752449 531176147 531729927
787.9 531729927 532349586 531780128 531699600 532225494 531638794 532153206 532607994 532580032 531670036 531086197
797.6 531086197 531062508 529783669 528624153 528402710 528267860 526210327 524718933 523536491 520971794
806.2 520971794 518369789 516399727 515961914 515249596 514594917 513494339 511794434 510123329 507965050
814.9 507965050 506352501 505181351 505585060 505755196 505824776 506306839 505446434 505591431 506354065 507254372
$$ packed form
752.2E10942497J094284K001152J208229J085473J39350M6387Q46214J430626J478310
760.9E20272522J158524K08358k70958J052704J167488J349945O37970m27360l29781
769.6E24819412N95093J391678J51787J36146k17323m49143K80762l02505p38488J011925
779.2E26679344J797943j081848l79944J330376J096916J070976K38686M23698N53780
787.9E31729927O19659n69458q0528N25894n86700N14412M54788k7962r09996n83839
797.6E31086197k3689j278839j159516k21443j34850k057533j491394j182442k564697
806.2E20971794k602005j970062m37813p12318o54679j100578j699905j671105k158279
814.9E07965050j612549j171150M03709J70136O9580M82063q60405J44997P62634R00307
$$ plain form
824.6 507254372 508901978 511705208 514552765 516708984 519083786 520660667 523224983 526347198
832.3 526347198 529108887 531970406 535363541 538618240 540239563 541886292 542986107 545341644
840 545341644 547879219 548806725 550654144 553087463 555194626 556026611 557176743 558279343 559704819
848.7 559704819 561372147 562057800 563427277 564897385 566566353 567567482 569121513 570860481 571636620
857.4 571636620 573201790 575454254 577794800 578720093 580102730 580727577 580357018 580333138 579914742
866 579914742 580132294 580350800 581199799 580052338 578209610 576867828 575072823 574161186 572705345
874.7 572705345 572473450 571626472 570652580 570756569 570101776 569422112 568523674 567529907 565550919 565469398
884.4 565469398 566045074 565299149 564602585 563218918 562816315 562635651 562527046 561762581 561460800 562265244
$$ packed form
824.6E07254372J647606K803230K847557K156219K374802J576881K564316L122215
832.3E26347198K761689K861519L393135L254699J621323J646729J099815K355537
840E45341644K537575R27506J847419K433319K107163Q31985J150132J102600J425476
848.7E59704819J667328O85653J369477J470108J668968J001129J554031J738968P76139
857.4E71636620J565170K252464K340546R25293J382637O24847l70559k3880m18396
866E79914742K17552K18506Q48999j147461j842728j341782j795005r11637j455841
874.7E72705345k31895q46978r73892J03989o54793o79664q98438r93767j978988q1521
884.4E65469398N75676p45925o96564j383667m02603j80664j08605p64465l01781Q04444
$$ plain form
894 562265244 562453003 562781448 562638435 563129082 562247429 561043854 561460876 561257057 560805054 560780678
903.7 560780678 562579422 563797874 564595680 566510277 568362503 570012321 570892525 571824913 571423492
912.3 571423492 570538635 570016594 569063873 567448425 565806999 565006409 563189774 560849037 557818260
921 557818260 554746399 551688271 548556366 545846863 542686005 540688744 538099670 534758568 532208099
929.7 532208099 529979706 528217888 526206703 524200935 522802696 521905975 520725479 519840775 518409233
938.4 518409233 516803703 516415329 515444183 514910126 514465790 513752365 513695068 513370819 512386780 511480980
948 511480980 511580734 510934105 510529709 511127548 511334877 511022224 509904823 508287506 505844536 503703728
957.7 503703728 501542091 499913902 498945770 496902008 495212440 493451347 491281929 488740921 486245575
$$ packed form
894E62265244J87759L28445j43013M90647q81653j203575M17022k03819m52003k4376
903.7E60780678J798744J218452P97806J914597J852226J649818Q80204R32388m01421
912.3E71423492q84857n22041r52721j615448j641426q00590j816635k340737l030777
921E57818260l071861l058128l131905k709503l160858j997261k589074l341102k550469
929.7E32208099k228393j761818k011185k005768j398239q96721j180496q84704j431542
938.4E18409233j605530l88374r71146n34057m44336p13425n7297l24249r84039r05800
948E11480980R9754o46629m04396N97839K07329l12653j117401j617317k442970k140808
957.7E03703728k161637j628189r68132k043762j689568j761093k169418k541008k495346
$$ plain form
966.3 486245575 484391899 482390671 480479851 478460808 476911354 475044098 471914749 468878174
974.1 468878174 466097221 462691116 458859749 455431480 452341537 448952980 444387207 439371109
981.8 439371109 434881668 430504265 425609093 420483017 415768738 411435280 407334633 403063011
989.5 403063011 398575783 394265175 390224838 385914688 382108574 378616524 375084076 372179756
997.2 372179756 369059410 365629158 362351074 359747047 356938133 354797707 353181267 351193657
1004.9 351193657 349756546 347541084 346082535 344472313 342852097 342696495 341466637 339269524
1012.6 339269524 336579323 334610062 333154793 331652794 329408340 326989212 325233879 322206726
1020.3 322206726 319558239 317797947 316517162 314043064 311048965 308991146 307034283 306013699
$$ packed form
966.3D86245575j853676k001228j910820k019043j549454j867256l129349l036575
974.1D68878174k780953l406105l831367l428269l089943l388557m565773n016098
981.8D39371109m489441m377403m895172n126076m714279m333458m100647m271622
989.5D03063011m487228m310608m040337m310150l806114l492050l532448k904320
997.2C72179756l120346l430252l278084k604027k808914k140426j616440j987610
1004.9C51193657j437111k215462j458549j610222j620216j55602j229858k197113
1012.6C39269524k690201j969261j455269j501999k244454k419128j755333l027153
1020.3C22206726k648487j760292j280785k474098k994099k057819j956863j020584
$$ plain form
1028.1 306013699 304035568 302437477 300786457 299621410 298911381 297569103 298342018 298593407 299470634
1036.7 299470634 300282326 300400562 301591511 303097210 304543076 304754944 305326481 305373898 305894318
1045.4 305894318 305907803 304911041 304767323 303994675 303425808 301525650 300309677 299760609 299554443
1054.1 299554443 299846344 298501225 297827988 296976185 297568722 298355427 299120808 300478687 301323509
1062.8 301323509 303815498 306087894 308522358 310074997 311407833 312782745 314002914 315807343
1070.5 315807343 316749821 318150253 318260651 318935795 320141983 320582581 321023064 321594925 323394699
1079.2 323394699 323638878 324303131 324974747 325976715 328096771 329470406 331153069 331835251 333371696
1087.9 333371696 334850998 336205101 337588196 339032936 341517525 342431984 343852692 344927216
$$ packed form
1028.1C06013699j978131j598091j651020j165047p10029j342278P72915K51389Q77227
1036.7B99470634Q11692J18236J190949J505699J445866K11868N71537M7417N20420
1045.4C05894318J3485r96762j43718p72648n68867j900158j215973n49068k06166
1054.1B99554443K91901j345119o73237q51803N92537P86705P65381J357879Q44822
1062.8C01323509K491989K272396K434464J552639J332836J374912J220169J804429
1070.5C15807343R42478J400432J10398O75144J206188M40598M40483N71861J799774
1079.2C23394699K44179O64253O71616J001968K120056J373635J682663O82182J536445
1087.9C33371696J479302J354103J383095J444740K484589R14459J420708J074524
$$ plain form
1095.6 344927216 345938148 347516594 348655357 350144119 351207008 353014374 354287300 355745544
1103.3 355745544 357448997 358409767 359190063 359374046 359972725 360595741 361999893 363232918 364240494
1112 364240494 365542526 365892410 366345863 367099037 367743797 367464981 367599030 367866058 367466431 367225380
1121.6 367225380 366838188 367475014 367751198 367757187 368571663 369620476 370836716 372808838 375243721
1130.3 375243721 376992645 379105453 380347099 381587143 383708076 385923843 388787155 391109200
1138 391109200 392905159 393980255 395414162 397289658 398143845 398598175 399118500 400163078 401392097
1146.7 401392097 402427444 402826309 402928619 402892761 402681923 402534065 401600685 401287918 401308517 400730400
1156.3 400730400 400421906 400238304 400061340 398754311 397232056 397042198 397265739 397566185 399092293
$$ packed form
1095.6C44927216J010932J578446J138763J488762J062889J807366J272926J458244
1103.3C55745544J703453R60770P80296J83983N98679O23016J404152J233025J007576
1112C64240494J302032L49884M53453P53174O44760k78816J34049K67028l99627k41051
1121.6C67225380l87192O36826K76184N989Q14476J048813J216240J972122K434883
1130.3C75243721J748924K112808J241646J240044K120933K215767K863312K322045
1138C91109200J795959J075096J433907J875496Q54187M54330N20325J044578J229019
1146.7D01392097J035347L98865J02310l5858k10838j47858r33380l12767K0599n78117
1156.3D00730400l08494j83602j76964j307029j522255j89858K23541L00446J526108
$$ plain form
1165 399092293 400852203 402021294 403841362 405731773 408332214 411063423 413138390 415266457 417633629
1173.7 417633629 420448990 423180542 426084824 428852158 431192207 433498039 436266403 438935623
1181.4 438935623 440864601 442739677 444275398 445607719 447143250 448281822 449150391 449963379 450232201
1190.1 450232201 450671654 451169662 450991058 450939064 450960083 450392876 449106064 447724228 447159805 446834068
1199.7 446834068 446129799 445293312 443810005 442329521 441858368 441848946 441496925 440965042 440739594 440212898
1209.4 440212898 439661102 439135284 438717766 439070168 439152184 438968468 438954697 438783264 438388252 438042679
1219 438042679 438123474 438209801 438085899 437666855 437439690 437387314 437009621 436606522 435902786 435255547
1228.6 435255547 434572678 433600769 432883835 432312737 431755447 431248512 430804329 430170975 429673958 429550819
$$ packed form
1165C99092293J759910J169091J820068J890411K600441K731209K074967K128067K367172
1173.7D17633629K815361K731552K904282K767334K340049K305832K768364K669220
1181.4D38935623J928978J875076J535721J332321J535531J138572Q68569Q12988K68822
1190.1D50232201M39453M98008j78604n1994K1019n67207j286812j381836n64423l25737
1199.7D46834068p04269q36487j483307j480484m71153r422l52021n31883k25448n26696
1209.4D40212898n51796n25818m17518L52402Q2016j83716j3771j71433l95012l45573
1219D38042679Q0795Q6327j23902m19044k27165n2376l77693m03099p03736o47239
1228.6D35255547o82869r71909p16934n71098n57290n06935m44183o33354m97017j23139
$$ plain form
1238.3 429550819 429262886 428774872 428473816 428495789 428242531 427848282 427644882 427062607 426424294 425875854
1247.9 425875854 425409508 425187531 424756737 424245644 423670578 423489189 423999863 424204483 424160080 423962936
1257.6 423962936 423547935 423434525 423778687 424086227 424161453 424372101 424725609 425425453 425944786 426195221
1267.2 426195221 427062836 428362007 429431114 430432777 431466331 432052765 432872734 433866081 434764977
1275.9 434764977 435856590 437046509 438084908 438898849 440109596 441365891 442506027 443698235
1283.6 443698235 445227089 446843109 448120079 449759483 451257782 452489052 453488121 454103928 454717484
1292.3 454717484 455918732 457170715 457868729 458606873 459031410 459675484 460273819 460563622 460744019
1301 460744019 460800896 461256790 461470375 461646957 461568756 461162415 460746880 460448685 460146217 459602089
$$ packed form
1238.3D29550819k87933m88014l01056K1973k53258l94249k03400n82275o38313n48440
1247.9D25875854m66346k21977m30794n11093n75066j81389N10674K04620m4403j97144
1257.6D23962936m15001j13410L44162L07540P5226K10648L53508O99844N19333K50435
1267.2D26195221Q67615J299171J069107J001663J033554N86434Q19969R93347Q98896
1275.9D34764977J091613J189919J038399Q13941J210747J256295J140136J192208
1283.6D43698235J528854J616020J276970J639404J498299J231270R99069O15807O13556
1292.3D54717484J201248J251983O98014P38144M24537O44074N98335K89803J80397
1301D60744019N6877M55894K13585J76582p8201m06341m15535k98195l02468n44128
$$ plain form
1310.6 459602089 459604492 459357796 458909607 458729897 458362732 458022156 457901535 458277740 458911324 459962196
1320.3 459962196 460762024 461488724 462312660 462673683 463300896 463893242 464315758 464522743 464857330 465000496
1329.9 465000496 464579964 464505348 464265823 463492851 462739525 462495995 462521439 462816658 462904510 463096237
1339.6 463096237 463992805 464058609 464358597 464729156 465116959 465792198 466287651 466947174 467307701 467814102
1349.2 467814102 468053207 467863197 467090912 466620712 466986771 466562195 466281891 465990028 465668259 465308952
1358.8 465308952 464900627 464377213 463694496 463881760 463151894 463076286 462886543 462039223 461550980 460704613
1368.5 460704613 460242462 459566498 459412231 459734459 459926643 460026360 459658813 459560204 459047813 458728714
1378.1 458728714 458155212 458004837 458162918 457761917 457044678 455518951 454393997 453376770 452239075
$$ packed form
1310.6D59602089K403k46696m48189j79710l67165l40576j20621L76205O33584J050872
1320.3D59962196P99828P26700Q23936L61023O27213N92346M22516K06985L34587J43166
1329.9D65000496m20532p4616k39525p72972p53326k43530K5444K95219Q7852J91727
1339.6D63096237Q96568O5804K99988L70559L87803O75239M95453O59523L60527N06401
1349.2D67814102K39105j90010p72285m70200L66059m24576k80304k91863l21769l59307
1358.8D65308952m08325n23414o82717J87264p29866p5608j89743q47320m88243q46367
1368.5D60704613m62151o75964j54267L22228J92184R9717l67547r8609n12391l19099
1378.1D58728714n73502j50375J58081m01001p17239j525727j124954j017227j137695
$$ plain form
1386.8 452239075 449867439 448996658 449083290 447505569 445914345 444364891 443042068 440289383 436593399
1395.5 436593399 435126457 433260880 431906891 429800682 427701836 426038170 423725204 421637573
1403.2 421637573 419675140 417030182 414546051 413365173 412170029 410726051 409330063 407595901
1410.9 407595901 406244965 404763489 403311729 402094002 401604424 401559372 400711937 400966530 399314804
1419.6 399314804 398556709 399425507 399497757 400057373 400012512 400933914 401992149 402592964 403732376 404114075
1429.2 404114075 404929390 405909386 407510071 408895264 410114059 412185249 413830757 414914436 415947952
1437.9 415947952 418270493 419384537 420483932 422192307 423167686 425006638 426407318 427663994
1445.6 427663994 428143616 428833961 429786644 430824623 432685699 433533592 435324211 436615829 438210526
$$ packed form
1386.8D52239075k371636q70781Q6632j577721j591224j549454j322823k752685l695984
1395.5D36593399j466942j865577j353989k106209k098846j663666k312966k087631
1403.2D21637573j962433k644958k484131j180878j195144j443978j395988j734162
1410.9D07595901j350936j481476j451760j217727m89578m5052q47435K54593j651726
1419.6C99314804p58095Q68798P2250N59616m4861R21402J058235O00815J139412L81699
1429.2D04114075Q15315R79996J600685J385193J218795K071190J645508J083679J033516
1437.9D15947952K322541J114044J099395J708375R75379J838952J400680J256676
1445.6D27663994M79622O90345R52683J037979J861076Q47893J790619J291618J594697
$$ plain form
1454.3 438210526 440163002 440383720 441350899 441898575 445099831 446527328 448397751 450076637 451407013
1463 451407013 453455734 453840256 456134033 458434792 460651283 462549248 464905205 468169365 470628662
1471.7 470628662 473039665 474552650 477742882 480559502 482451820 484607544 487063484 489703484
1479.4 489703484 491640205 493396950 495198059 496774330 497949181 499270020 501423988 503063698
1487.1 503063698 503182983 503999939 503956680 503318748 503725548 503881035 503186607 502337036 501188889 496188316
1496.7 496188316 496545181 495705032 492537041 491896477 490707397 489926262 489081383 489301186 488459129
1505.4 488459129 481722946 480414162 481800308 482998314 482086754 482791710 481729889 479772682 479949455
1514.1 479949455 478976974 478166275 476270676 474585228 475630379 476951256 476278687 475711098 476148872
$$ packed form
1454.3D38210526J952476K20718R67179N47676L201256J427497J870423J678886J330376
1463D51407013K048721L84522K293777K300759K216491J897965K355957L264160K459297
1471.7D70628662K411003J512985L190232K816620J892318K155724K455940K640000
1479.4D89703484J936721J756745J801109J576271J174851J320839K153968J639710
1487.1E03063698J19285Q16956m3259o37932M06800J55487o94428q49571j148147n000573
1496.7D96188316L56865q40149l167991o40564j189080p81135q44879K19803q42057
1505.4D88459129o736183j308784J386146J198006r11560P04956j061821j957207J76773
1514.1D79949455r72481q10699j895599j685448J045151J320877o72569n67589M37774
$$ plain form
1522.8 476148872 475558357 476583328 476689072 478015442 479598312 480432892 481932640 482875214 483714256
1531.5 483714256 484533577 484792633 484324226 486093102 487401581 488665390 491395149 492271271 489082565
1540.1 489082565 488922272 489901047 490507011 492082443 493632812 493726692 495272446 495663414 496681175
1548.8 496681175 496817093 496117210 497397079 497522392 498563080 497596626 498214531 499724770 500008545
1557.5 500008545 496423302 486242027 492400780 493025017 493403435 492120934 490717239 488068695
1565.2 488068695 485328560 483902092 481582489 480611076 472624893 470648499 468996239 465924339
1572.9 465924339 463421669 460368195 458346863 445998459 445362282 442296448 437931557 434025421
1580.6 434025421 428770752 425622215 419958954 416013947 410469704 406039886 401824646 396412773
$$ packed form
1522.8D76148872n90515J024971J05744J326370J582870Q34580J499748R42574Q39042
1531.5D83714256Q19321K59056m68407J768876J308479J263809K729759Q76122l188706
1540.1D89082565j60293R78775O05964J575432J550369R3880J545754L90968J017761
1548.8D96681175J35918o99883J279869J25313J040688r66454O17905J510239K83775
1557.5E00008545l585243j0181275O158753O24237L78418j282501j403695k648544
1565.2D88068695k740135j426468k319603r71413p986183j976394j652260l071900
1572.9D65924339k502670l053474k021332j2348404o36177l065834m364891l906136
1580.6D34025421n254669l148537n663261l945007n544243m429818m215240n411873
$$ plain form
1588.4 396412773 393054657 387292099 383997307 378348885 374854889 370545502 365190125 362800407
1596.1 362800407 357889557 355312309 350356560 347484131 343710594 340481262 338313980 333903961
1603.8 333903961 332403641 328375282 327095528 323851471 322197914 320931625 317809887 317546520
1611.5 317546520 314241943 313956661 311923962 312505417 312804108 306571426 308259144 306994095 308386345
1620.2 308386345 306929893 307759533 307193127 305212498 307448711 307066784 309124584 308019485 309605350
1628.9 309605350 310088234 310845699 311937485 311856518 314594173 314875145 318127613 316456509 319244118
1637.5 319244118 321201286 322268524 324533234 324801941 327666512 328209953 330970612 333370628 333296814
1646.2 333296814 336328850 334770164 338328629 339374237 342190132 343304863 339706039 343322105
$$ packed form
1588.4C96412773l358116n762558l294792n648422l493996m309387n355377k389718
1596.1C62800407m910850k577248m955749k872429l773537l229332k167282m410019
1603.8C33903961j500320m028359j279754l244057j653557j266289l121738k63367
1611.5C17546520l304577k85282k032699N81455K98691o232682J687718j265049J392250
1620.2C08386345j456452Q29640n66406j980629K236213l81927K057800j105099J585865
1628.9C09605350M82884P57465J091786q0967K737655K80972L252468j671104K787609
1637.5C19244118J957168J067238K264710K68707K864571N43441K760659K400016p3814
1646.2C33296814L032036j558686L558465J045608K815895J114731l598824L616066
$$ plain form
1653.9 343322105 343847275 348255539 349071198 351369286 352713394 354575844 356901665 358753471 361727142
1662.6 361727142 362202263 365888062 368148842 371195984 373911400 376568794 380598679 382575188
1670.3 382575188 387907791 390003242 394020348 397796021 401794853 405562859 408321953 413172760
1678 413172760 416540451 420991402 423879700 428245354 433846970 437692337 442980919 445129204 450791664
1686.7 450791664 454692612 459208565 463979683 468198929 473322067 477642555 482606697 487703972
1694.4 487703972 493379326 494939766 499793701 505336609 510592842 516252441 516314163 522257271 526885910
1703.1 526885910 531639595 535286560 538115120 540419769 543093224 547485046 550549240 552809181
1710.8 552809181 555496140 558157463 560482407 560949135 562027817 565702362 568062744 564378624
$$ packed form
1653.9C43322105N25170M408264Q15659K298088J344108J862450K325821J851806K973671
1662.6C61727142M75121L685799K260780L047142K715416K657394M029885J976509
1670.3C82575188N332603K095451M017106L775673L998832L768006K759094M850807
1678D13172760L367691M450951K888298M365654N601616L845367N288582K148285N662460
1686.7D50791664L900948M515953M771118M219246N123138M320488M964142N097275
1694.4D87703972N675354J560440M853935N542908N256233N659599O1722N943108M628639
1703.1E26885910M753685L646965K828560K304649K673455M391822L064194K259941
1710.8E52809181K686959K661323K324944M66728J078682L674545K360382l684120
$$ plain form
1718.5 564378624 568255310 571893234 573919563 575657387 576992226 577926674 579264603 580880699
1726.3 580880699 582260017 584352798 586795654 586998100 587625008 591409988 595508575 594062004 589856720
1734.9 589856720 593719025 597824898 600748100 603650436 604128342 603338890 607314529 610160866 611143608
1743.6 611143608 613674927 617467728 620449219 622834778 625493851 627075462 631454582 633246994
1751.3 633246994 634193497 638784294 642024765 645277023 648392563 649094009 650986786 653904495 656458740
1760 656458740 659644012 659625549 660166397 663616714 665660172 667690887 669704285 671186218 669452591
1768.7 669452591 671367569 675607834 676056671 674683609 673981781 678202820 680682678 680147858 682269135
1777.4 682269135 683242874 684741364 685402374 684710770 685743103 687650528 689304581 688695068 689202347
$$ packed form
1718.5E64378624L876686L637924K026329J737824J334839R34448J337929J616096
1726.3E80880699J379318K092781K442856K02446O26908L784980M098587j446571m205284
1734.9E89856720L862305M105873K923202K902336M77906p89452L975639K846337R82742
1743.6F11143608K531319L792801K981491K385559K659073J581611M379120J792412
1751.3F33246994R46503M590797L240471L252258L115540P01446J892777K917709K554245
1760F56458740L185272j8463N40848L450317K043458K030715K013398J481933j733627
1768.7F69452591J914978M240265M48837j373062p01828M221039K479858n34820K121277
1777.4F82269135R73739J498490O61010o91604J032333J907425J654053o09513N07279
$$ plain form
1786 689202347 691074371 692368317 692859497 694647369 695839233 695702133 694278641 693877869 697587509
1794.7 697587509 698925705 698624802 699925079 701789703 702633896 701635284 703118820 702860947 703669815
1803.4 703669815 705257568 705825272 707150726 707843323 708400269 709195633 710500183 709281311 709195328
1812.1 709195328 710659332 711403809 712797546 712880325 713554306 713675766 714249268 715330276 715370255
1820.8 715370255 716225815 716029892 717265091 718364792 716668396 716950912 718471680 720396271 720701447
1829.4 720701447 717952118 718415375 720736618 721557007 722025299 722488708 723075409 723555527 722834396
1838.1 722834396 723573532 723559418 723922577 724620132 726165771 727491150 722849960 724528885 726300278
1846.8 726300278 726344833 726315231 727049561 728378143 728168488 728263931 728059387 728782501 729321899 729474487
$$ packed form
1786F89202347J872024J293946M91180J787872J191864j37100j423492m00772L709640
1794.7F97587509J338196l00903J300277J864624Q44193r98612J483536k57873Q08868
1803.4G03669815J587753N67704J325454O92597N56946P95364J304550j218872q5983
1812.1G09195328J464004P44477J393737Q2779O73981J21460N73502J081008L9979
1820.8G15370255Q55560j95923J235199J099701j696396K82516J520768J924591L05176
1829.4G20701447k749329M63257K321243Q20389M68292M63409N86701M80118p21131
1838.1G22834396P39136j4114L63159O97555J545639J325379m641190J678925J771393
1846.8G26300278M4555k9602P34330J328582k09655R5443k04544P23114N39398J52588
$$ plain form
1856.4 729474487 730001602 729565659 730006409 729943466 730244293 730684052 731254196 731506348 731270218 731907578
1866.1 731907578 731622314 732394714 731529770 730764771 732173920 732899094 733178940 732826996 733509293
1874.8 733509293 733754501 734120636 734289780 734309311 734826508 734522095 734840088 734725266 735169296 735275803
1884.4 735275803 735332413 735994949 735849838 736752930 736534653 735123901 735126190 735935287 736484375 737130127
1894.1 737130127 737457275 736246109 736817093 737146378 737256393 737395935 737185211 737439346 737458878 738213959
1903.7 738213959 738112717 738272018 738424988 737923889 737788544 737573395 737815552 737875824 738655777 738664169
1913.3 738664169 738678131 738742676 738847198 740153351 738495331 737674637 738481674 739330978 740046310 738843002
1923 738843002 738335495 738742752 739386978 739551773 739703522 739664688 739665527 739980545 739853516 739762802 739069824
$$ packed form
1856.4G29474487N27115m35943M40750o2943L00827M39759N70144K52152k36130O37360
1866.1G31907578k85264P72400q64944p64999J409149P25174K79846l51944O82297
1874.8G33509293K45208L66135J69144J9531N17197l04413L17993j14822M44030J06507
1884.4G35275803N6610O62536j45111R03092k18277j410752K289Q09097N49088O45752
1894.1G37130127L27148j211166N70984L29285J10015J39542k10724K54135J9532P55081
1903.7G38213959j01242J59301J52970n01099j35345k15149K42157O0272P79953Q392
1913.3G38664169J3962O4545J04522J306153j658020q20694Q07037Q49304P15332j203308
1923G38843002n07507M07257O44226J64795J51749l8834Q39L15018j27029r0714o92978
$$ plain form
1933.6 739069824 739258194 739521790 739636993 739829788 739750137 740021133 739457397 740068512 740092087 738336182
1943.2 738336182 738684464 739630356 739851990 739735031 740239410 739967041 739567490 739222031 739012604 739230728
1952.9 739230728 739336472 739776306 739623489 739595642 739030991 738742905 738981476 738861847 739127808 738810577
1962.5 738810577 739106903 739302902 739494705 739685745 739039001 738672409 738314590 738499603 738392105 738633423
1972.2 738633423 738893738 739066925 739212418 738491745 738566437 738364563 738396301 738501358 738244553 738316498
1981.8 738316498 738464737 738868256 738470383 738376465 738180695 737961197 737857742 737414093 737754211 738060760
1991.5 738060760 737926254 737324600 737521439 737595520 737383041 737182617 736672668 737065201 736980133 737123337
2001.1 737123337 736975861 736721954 736969376 736592331 736389542 735814972 736054993 736260376 735839386 735495605
$$ packed form
1933.6G39069824J88370K63596J15203J92795p9651K70996n63736O11115K3575j755905
1943.2G38336182L48282R45892K21634j16959N04379k72369l99551l45459k09427K18124
1952.9G39230728J05744M39834j52817k7847n64651k88086K38571j19629K65961l17231
1962.5G38810577K96326J95999J91803J91040o46744l66592l57819J85013j07498K41318
1972.2G38633423K60315J73187J45493p20673P4692k01874L1738J05057k56805P1945
1981.8G38316498J48239M03519l97873r3918j95770k19498j03455m43649L40118L06549
1991.5G38060760j34506o01654J96839P4081k12479k00424n09949L92533q5068J43204
2001.1G37123337j47476k53907K47422l77045k02789n74570K40021K05383m20990l43781
$$ plain form
2010.7 735495605 735240250 735568390 735572357 735777817 735637054 735424728 734906464 734676590 735016785 734928589
2020.4 734928589 735344391 734840546 734435654 734008560 733577881 733877945 733747787 733976593 733836899 733916321
2030 733916321 733633499 733339005 733429260 733055038 733034134 732812424 733016891 732768707 732624741 732774124
2039.7 732774124 732711563 732550430 731949844 732329712 731979370 731567230 731259842 731200256 731769943 731488571
2049.3 731488571 731632919 731194229 731170502 731054764 730296707 730392151 730620880 731031799 730709610 730678558
2059 730678558 730466156 730175018 730204468 730107117 730533524 730132294 730047150 730128250 730031891 729919281 730004654
2069.6 730004654 730047760 729538727 729991837 729938889 730077133 730143585 729905014 729917297 729305801 729456635
2079.2 729456635 729197922 729282761 729409790 729204865 729430923 729300156 729397507 728969193 728795624 728600235
$$ packed form
2010.7G35495605k55355L28140L967K05460j40763k12326n18264k29874L40195q8196
2020.4G34928589M15802n03845m04892m27094m30679L00064j30158K28806j39694P9422
2030G33916321k82822k94494R0255l74222k0904k21710K04467k48184j43966J49383
2039.7G32774124o2561j61133o00586L79868l50342m12140l07388n9586N69687k81372
2049.3G31488571J44348m38690k3727j15738p58057R5444K28729M10919l22189l1052
2059G30678558k12402k91138K9450r7351M26407m01230q5144Q1100r6359j12610Q5373
2069.6G30004654M3106n09033M53110n2948J38244O6452k38571J2283o11496J50834
2079.2G29456635k58713Q4839J27029k04925K26058j30767R7351m28314j73569j95389
$$ plain form
2088.9 728600235 728719711 728796310 728288651 728601608 728619003 728635101 728038940 727569351 727514038 727382050
2098.5 727382050 727589035 727479401 727803726 727391205 727015533 727070084 726979523 726799927 726489868 726896439
2108.1 726896439 726818924 726654129 726096420 725909653 726075058 725805740 726056519 725911713 726241455 725972748
2117.8 725972748 725419464 725313873 725177612 725610123 725594254 725502167 725043564 724971008 724868393 724845428
2127.4 724845428 725111618 724569397 724855728 725041656 725334091 725549393 725353394 725043106 724485016 724856339
2137.1 724856339 724883499 724920731 724875641 725212708 725580292 725062637 725049820 724715500 724735870 724855347
2146.7 724855347 724954681 725256195 725467606 725569153 725084915 725059433 724794235 724793930 724925385 725079193
2156.4 725079193 725399094 725238876 725652695 725585861 725348282 725089111 724901199 724904099 724897919 725316696
$$ packed form
2088.9G28600235J19476P6599n07659L12957J7395J6098n96161m69589n5313j31988
2098.5G27382050K06985j09634L24325m12521l75672N4551r0561j79596l10059M06571
2108.1G26896439p7515j64795n57709j86767J65405k69318K50779j44806L29742k68707
2117.8G25972748n53284j05591j36261M32511j5869r2087m58603p2556j02615k2965
2127.4G24845428K66190n42221K86331J85928K92435K15302j95999l10288n58090L71323
2137.1G24856339K7160L7232m5090L37067L67584n17655j2817l34320K0370J19477
2146.7G24855347R9334L01514K11411J01547m84238k5482k65198l05J31455J53808
2156.4G25079193L19901j60218M13819o6834k37579k59171j87912K900o180M18777
$$ plain form
2166 725316696 725417709 725806046 725555725 725200958 724948425 724768295 725342712 725471191 726057358 726393509
2175.6 726393509 726419449 726064148 725611801 725695190 725516510 725913162 726121521 726219711 725808868 725531235
2185.3 725531235 725772476 725766678 726260529 726152039 726118469 726188354 726621780 726874008 726491318 726607971
2194.9 726607971 726180038 726021042 725790634 725904388 726277847 726440582 726881409 726748352 726731491 726196213
2204.6 726196213 726203003 726709595 727022400 727140732 726799240 727368774 727298279 727015305 726801453 726812515
2214.2 726812515 727315063 727121353 727177963 727232208 727443542 727138519 726860962 726970901 726961670 727444382
2223.9 727444382 727432404 727501526 727294769 727205505 727287750 727062836 727202377 727148743 727150650 727088318 727636642
2234.5 727636642 728010254 728049316 728087082 727413101 726919861 726597443 726896820 726959229 727043457 727260742
$$ packed form
2166G25316696J01013L88337k50321l54767k52533j80130N74417J28479N86167L36151
2175.6G26393509K5940l55301m52347Q3389j78680L96652K08359R8190m10843k77633
2185.3G25531235K41241n798M93851j08490l3570O9885M33426K52228l82690J16653
2194.9G26607971m27933j58996k30408J13754L73459J62735M40827j33057j6861n35278
2204.6G26196213O790N06592L12805J18332l41492N69534p0495k82974k13852J1062
2214.2G26812515N02548j93710N6610N4245K11334l05023k77557J09939r231M82712
2223.9G27444382j1978O9122k06757q9264Q2245k24914J39541n3634J907o2332N48324
2234.5G27636642L73612L9062L7766o73981m93240l22418K99377O2409Q4228K17285
$$ plain form
2244.1 727260742 726960144 726920090 726759872 726748123 726545258 726899796 727343674 727546005 727716522 727246552
2253.8 727246552 726981125 726402893 726751785 727098083 726954575 727020569 726797104 727205124 726907425 726689529
2263.4 726689529 726580048 726577682 726765594 726542969 726907501 727030945 727374802 727037277 726585693 726540909
2273 726540909 726360550 726482925 726192780 726690826 726819000 726649475 726478729 726159210 726016006 725626068
2282.7 725626068 726137314 726077728 726262054 726428070 726147537 726409531 726273575 726370697 725866394 725965729
2292.3 725965729 726159134 726149750 726389160 725918732 725962601 725371323 725438156 726014786 726366577 726731644
2302 726731644 726719666 727230606 726978989 727256165 727220306 726878586 727123871 726797562 727391205 727729416
2311.6 727729416 728179245 728512878 728247986 728038712 727639618 727373123 727186203 728226013 728906097
$$ packed form
2244.1G27260742l00598m0054j60218j1749k02865L54538M43878K02331J70517m69970
2253.8G27246552k65427n78232L48892L46298j43508O5994k23465M08020k97699k17896
2263.4G26689529j09481k366J87912k22625L64532J23444L43857l37525m51584m4784
2273G26540909j80359J22375k90145M98046J28174j69525j70746l19519j43204l89938
2282.7G25626068N11246n9586J84326J66016k80533K61994j35956R7122n04303R9335
2292.3G25965729J93405r384K39410m70428M3869n91278O6833N76630L51791L65067
2302G26731644j1978N10940k51617K77176l5859l41720K45285l26309N93643L38211
2311.6G27729416M49829L33633k64892k09274l99094k66495j86920J039810O80084
$$ plain form
2320.3 728906097 729311829 729657288 729573212 729195786 728722534 729559555 729578476 729732971 730031509 730313110
2329.9 730313110 730557098 729646835 729708557 729747162 729982910 730706787 731599808 731491852 730976486 730987854
2339.6 730987854 730613556 730918961 730907059 730404129 729720917 729528275 728474503 726324005 724793777
2348.3 724793777 724899445 726646042 726980362 727794800 729103470 729001770 729813538 730623474 733085403
2356.9 733085403 733565292 733379211 732604523 731901855 731923523 730141220 730196533 729220276 729321823 728636780
2366.6 728636780 726983032 726607437 725854263 725195084 723921127 723957520 722700272 721573563 721349182
2375.3 721349182 720267563 719911423 719311905 718835144 717442245 716063156 715657425 715326843 715114975
2383.9 715114975 714482422 714269791 713796844 713332214 713273849 713094101 713060913 712710495 712466736 712089081
$$ packed form
2320.3G28906097M05732L45459q4076l77426m73252Q37021J8921J54495K98538K81601
2329.9G30313110K43988r10263O1722L8605K35748P23877Q93021j07956n15366J1368
2339.6G30987854l74298L05405j1902n02930o83212j92642j053772k150498j530228
2348.3G24793777J05668J746597L34320Q14438J308670j01700Q11768Q09936K461929
2356.9G33085403M79889j86081p74688p02668K1668j782303N5313r76257J01547o85043
2366.6G28636780j653748l75595p53174o59179j273957L6393j257248j126709k24381
2375.3G21349182j081619l56140n99518m76761j392899j379089m05731l30582k11868
2383.9G15114975o32553k12631m72947m64630n8365j79748l3188l50418k43759l77655
$$ plain form
2393.6 712089081 711746979 711548309 711371231 711209335 711183624 711176071 710515442 710205383 709970398 709794464
2403.2 709794464 709726944 709626999 709660416 709366913 709116211 708704758 708619843 708190460 707832184 707782898
2412.9 707782898 707201309 707123337 706938858 707016525 706724548 706192932 706106567 705562286 705091171 704488373
2422.5 704488373 704519272 704782715 704999542 704746017 703749008 703295670 702852020 702974472 702930069 702621765
2432.2 702621765 702343521 701758957 701918640 702052307 701784668 700966187 700054703 699538040 699459076 699490891
2441.8 699490891 699350281 699356537 698983154 698779755 698390427 698174362 697937775 697318649 697222443 696857910
2451.5 696857910 696789322 696580505 696298523 695839157 694989700 694712982 694200058 694062042 693985825 693721008
2461.1 693721008 693238831 692802658 692741241 692103119 691781387 691400604 691170044 691086960 690717468 690528488
$$ packed form
2393.6G12089081l42102j98670j77078j61896k5711p553o60629l10059k34985j75934
2403.2G09794464o7520r9945L3417k93503k50702m11453q4915m29383l58276m9286
2412.9G07782898n81589p7972j84479P7667k91977n31616q6365n44281m71115o02798
2422.5G04488373L0899K63443K16827k53525r97009m53338m43650J22452m4403l08304
2432.2G02621765k78244n84564J59683J33667k67639q18481r11484n16663p8964L1815
2441.8F99490891j40610O256l73383k03399l89328k16065k36587o19126r6206l64533
2451.5F96857910o8588k08817k81982m59366q49457k76718n12924j38016p6217k64817
2461.1F93721008m82177m36173o1417o38122l21732l80783k30560q3084l69492j88980
$$ plain form
2470.7 690528488 690061111 689581833 688912659 688649826 688433762 687884140 687713547 687580566 687295761 686936951
2480.4 686936951 686621933 686029434 685792847 685365677 684704056 684366760 683912201 683854523 683409042 682984619
2490 682984619 682668839 682162476 681708984 681302490 681406631 681134415 680650787 679663315 678753281 678448334
2499.7 678448334 678162537 678049393 677465744 677321243 677220306 676789551 676296921 675727081 675624161 675381927
2509.3 675381927 675097198 674427948 673863297 673567886 673368607 673051224 672191925 671917725 671451645 670974655
2519 670974655 670986404 670946198 670531235 669704819 669276962 669120636 668937759 668136368 667863388 667934113
2528.6 667934113 667397156 666964264 666120148 665623093 665352707 665117950 665024414 664925003 664798889 664181290
2538.2 664181290 663801193 663284912 662770462 662285156 662015076 662127609 661869583 661562347 661067886 660616074
$$ packed form
2470.7F90528488m67377m79278o69174k62833k16064n49622j70593j32981k84805l58810
2480.4F86936951l15018n92499k36587m27170o61621l37296m54559n7678m45481m24423
2490F82984619l15780n06363m53492m06494J04141k72216m83628r87472r10034l04947
2499.7F78448334k85797j13144n83649j44501j00937m30755m92630n69840j02920k42234
2509.3F75381927k84729o69250n64651k95411j99279l17383q59299k74200m66080m76990
2519F70974655J1749m0206m14963q26416m27857j56326j82877q01391k72980P0725
2528.6F67934113n36957m32892q44116m97055k70386k34757r3536r9411j26114o17599
2538.2F64181290l80097n16281n14450m85306k70080J12533k58026l07236m94461m51812
$$ plain form
2547.9 660616074 659840851 659243851 658919296 658483582 658449631 658372269 658527832 658066483 657489090 657175674
2557.5 657175674 656606140 655964432 655174179 655288925 655188370 654644852 654065094 653637314 653509674 652998047
2567.2 652998047 652835312 652271194 651768494 651627350 651305313 651010742 650632172 650525818 650328064 650306168
2576.8 650306168 649640350 648644180 648179245 647919083 647989883 647818680 647526855 646676788 646216965 646142731
2586.5 646142731 645446625 644866257 644589615 644645920 644107056 643597565 643273163 642989349 642877350 642376938
2596.1 642376938 642081604 641432343 640911560 640498123 640366898 640578003 640036621 639273071 638504219 638409042
2605.7 638409042 638196983 637546577 636900711 636570473 636823921 636297340 635617599 635145645 634860077 634336128
2615.4 634336128 633826904 633645744 632774010 632651482 632582474 631580849 630700073 630380249 630100098 629517899
$$ packed form
2547.9F60616074p75223n97000l24555m35714l3951p7362J55563m61349n77393l13416
2557.5F57175674n69534o41708p90253J14746j00555n43518n79758m27780j27640n11627
2567.2F52998047j62735n64118n02700j41144l22037k94571l78570j06354j97754k1896
2576.8F50306168o65818r96170m64935k60162P0800j71203k91825q50067m59823p4234
2586.5F46142731o96106n80368k76642N6305n38864n09491l24402k83814j11999n00412
2596.1F42376938k95334o49261n20783m13437j31225K11105n41382p63550p68852r5177
2605.7F38409042k12059o50406o45866l30238K53448n26581o79741m71954k85568n23949
2615.4F34336128n09224j81160q71734j22528o9008j001625q80776l19824k80151n82199
$$ plain form
2625 629517899 629096107 628585320 628476372 628046417 627419701 626993866 626427078 626067352 625354576 624937515
2634.7 624937515 624498901 624397430 624513092 624053650 623822289 623467941 623035927 621992836 621018715
2643.4 621018715 620473137 619916000 619587021 619187393 619281998 619191170 618677940 617844124 617388802 617330093
2653 617330093 616907806 616792374 616413269 616116600 615553169 615070686 615088005 614535332 613875542 613064995
2662.6 613064995 612534752 612061577 611880684 611916008 611661415 611403656 610684509 610506630 610458641 610108185
2672.3 610108185 609529152 608997154 609138489 609022751 608871040 608484535 607918549 607271118 606543884 606356583
2681.9 606356583 606278496 605755882 605173416 605081825 604382019 603915176 604080658 603884697 603573685 603015366
2691.6 603015366 602651215 602101860 602004166 602101860 601718712 601332817 600429115 599993782 599823914 599617195
$$ packed form
2625F29517899m21792n10787j08948m29955o26716m25835n66788l59726p12776m17061
2634.7F24937515m38614j01471J15662m59442k31361l54348m32014j043091r74121
2643.4F21018715n45578n57137l28979l99628R4605r0828n13230q33816m55322n8709
2653F17330093m22287j15432l79105k96669n63431m82483J7319n52673o59790q10547
2662.6F13064995n30243m73175j80893L5324k54593k57759p19147j77879m7989l50456
2672.3F10108185n79033n31998J41335j15738j51711l86505n65986o47431p27234j87301
2681.9F06356583p8087n22614n82466r1591o99806m66843J65482j95961l11012n58319
2691.6F03015366l64151n49355r7694R7694l83148l85895r03702m35333j69868k06719
$$ plain form
2701.2 599617195 599384613 599005203 598857002 598698006 598741646 598371277 597774315 597212105 596831818 596384659
2710.9 596384659 595679131 595576782 595462151 595238571 595038185 595000877 594589691 593946381 593710937 593234215
2720.5 593234215 593106537 593069687 593251877 593238640 592518692 591749382 591288033 591562347 591224556 590804596
2730.2 590804596 590550537 590063095 589972076 589600830 589267349 589074059 589097939 588900948 588649445 588785820
2739.8 588785820 588659744 588494911 588226280 588240204 587902260 587015991 586765556 586968575 586927681 586684036
2749.4 586684036 586424294 585889740 585769958 585581665 585076904 584722939 584403381 584242859 583864174 583892479
2759.1 583892479 583872719 583508911 583039055 582507133 582261963 581779442 581502876 581212807 581256065 581322060
2768.7 581322060 580837021 580616074 580329018 580145988 579651337 579173203 578925591 578531418 577974968 577262726
$$ packed form
2701.2E99617195k32582l79410j48201j58996M3640l70369n96962n62210l80287m47159
2710.9E96384659p05528j02349j14631k23580k00386l7308m11186o43310k35444m76722
2720.5E93234215j27678l6850J82190j3237p19948p69310m61349K74314l37791m19960
2730.2E90804596k54059m87442r1019l71246l33481j93290K3880j96991k51503J36375
2739.8E88785820j26076j64833k68631J3924l37944q86269k50435K03019m0894k43645
2749.4E86684036k59742n34554j19782j88293n04761l53965l19558j60522l78685K8305
2759.1E83892479j9760l63808m69856n31922k45170m82521k76566k90069M3258O5995
2768.7E81322060m85039k20947k87056j83030m94651m78134k47612l94173n56450p12242
$$ plain form
2778.4 577262726 577069855 576680527 576476517 576276283 575754852 575114784 574173012 574205132 574498787 574489250
2788 574489250 573945084 572927780 572295685 571775551 571287117 570568733 570014648 569783745 569604530 568831673
2797.7 568831673 567584076 566727257 566108665 565684547 565168991 564615784 563646851 563209381 563367462
2806.3 563367462 562735329 562109108 561343307 560775757 560203590 559391518 558959465 558470078 557776299 556784706
2816 556784706 556324234 555872879 555034561 554250221 553431511 552650909 551817017 551428986 550446129 549135475
2825.6 549135475 548340073 547550735 546878242 546281204 545907135 545113754 544177170 543417702 542568932 541575394
2835.3 541575394 540511894 539700012 538683395 537698860 535975533 534018097 532668114 531083565 529619141
2843.9 529619141 528004150 526340485 524747620 523091736 520870972 518431740 516654663 514997215
$$ packed form
2778.4E77262726j92871l89328k04010k00234n21431o40068r41772L2120K93655r537
2788E74489250n44166j017304o32095n20134m88434p18384n54085k30903j79215p72857
2797.7E68831673j247597q56819o18592m24118n15556n53207r68933m37470J58081
2806.3E63367462o32133o26221p65801n67550n72167q12072m32053m89387o93779r91593
2816E56784706m60472m51355q38318p84340q18710p80602q33892l88031r82857j310654
2825.6E49135475p95402p89338o72493n97038l74069p93381r36584p59468q48770r93538
2835.3E41575394j063500q11882j016617r84535j723327j957436j349983j584549j464424
2843.9E29619141j614991j663665j592865j655884k220764k439232j777077j657448
$$ plain form
2851.7 514997215 514069061 513364296 512863884 512876663 512392273 511611443 511202202 511525841 511697273 511480255
2861.3 511480255 511131897 510886955 510327873 509292793 508688278 507724457 506414223 505439148 504843750
2870 504843750 504115105 503527412 503111534 502182159 501624718 500780754 500106354 499721756 498856697 498394585
2879.6 498394585 497750244 497143288 496566010 495801926 495033722 494000778 492724342 491492310 490947075
2888.3 490947075 490336914 489727974 489094086 487710953 486431541 485956421 485508995 484605713 483778992
2897 483778992 482607803 481870422 481674156 481177101 480302162 478922958 478115807 477649612 477247505 476427574
2906.6 476427574 475228233 474471169 473583069 472718773 471528893 470359192 469062881 467305107 465700073
2915.3 465700073 464416924 463478889 462022705 460843239 459701843 458440895 457704697 456871948 456359482
$$ packed form
2851.7E14997215r28154p04765n00412J2779m84390p80830m09241L23639J71432k17018
2861.3E11480255l48358k44942n59082j035080o04515r63821j310234r75075n95398
2870E04843750p28645n87693m15878r29375n57441q43964o74400l84598q65059m62112
2879.6D98394585o44341o06956n77278p64084p68204j032944j276436j232032n45235
2888.3D90947075o10161o08940o33888j383133j279412m75120m47426r03282q26721
2897D83778992j171189p37381j96266m97055q74939j379204q07151m66195m02107q19931
2906.6D76427574j199341p57064q88100q64296j189880j169701j296311j757774j605034
2915.3D65700073j283149r38035j456184j179466j141396j260948p36198q32749n12466
$$ plain form
2924 456359482 455877228 455730515 455722122 455914650 456035156 455392532 455216408 455027962 455143700 455939636
2933.6 455939636 456978493 457763977 457761612 458122253 458804245 459588165 460551567 461160088 461519432 462433052
2943.3 462433052 463477364 463783112 464179993 464700508 465301819 466217270 466632690 466499786 466879425
2952 466879425 467463531 467721748 468059387 468454704 469151955 469340744 469386520 469803734 470322456 471351585
2961.6 471351585 471808548 471986275 472238426 472832870 473706551 474198799 474757156 475008507 475642014 476402817
2971.2 476402817 476823387 477433167 478110085 478475876 478680649 479562683 480004044 480359840 480920906 481096916
2980.9 481096916 481300735 481308250 481608963 481584740 481538925 481724281 481829681 481944389 481877785 482321815
2990.5 482321815 482515450 482340775 481711807 481299057 481418419 481169167 481071892 480455856 480230141 480289879
$$ packed form
2924D56359482m82254j46713q393J92528J20506o42624j76124j88446J15738P95936
2933.6D55939636J038857P85484k365L60641O81992P83920R63402O08521L59344R13620
2943.3D62433052J044312L05748L96881N20515O01311R15451M15420j32904L79639
2952D66879425N84106K58217L37639L95317O97251J88789M5776M17214N18722J029129
2961.6D71351585M56963J77727K52151N94444Q73681M92248N58357K51351O33507P60803
2971.2D76402817M20570O09780O76918L65791K04773Q82034M41361L55796N61066J76010
2980.9D81096916K03819P515L00713k4223m5815J85356J05400J14708o6604M44030
2990.5D82321815J93635j74675o28968m12750J19362k49252r7275o16036k25715N9738
$$ plain form
3000.2 480289879 479967995 479624710 478682899 478056526 477413979 476563988 476023827 475956459 475816727 475145264
3009.8 475145264 474370346 473406258 473230667 473335648 472935638 472235832 471239967 470152664 469548988
3018.5 469548988 469707947 469155273 468052711 466809769 466437798 466676025 465680771 464736595 463818016
3027.2 463818016 462840729 462261200 462085838 461485329 459999809 459550514 459244957 458612900 458046837
3035.9 458046837 457134361 456040001 455153999 454855576 454194603 453112564 451937714 451001625 450380440
3044.5 450380440 450044708 449672775 448373642 446938400 445847664 445381393 444742508 443841209 443400345
3053.2 443400345 442512093 441801414 441241951 440412598 439560051 438732033 437936478 436977043 436399193 435985794
3062.9 435985794 435490837 434819069 433852310 432909126 432351532 431956024 431271133 430624847 429954643 429081993
$$ packed form
3000.2D80289879l21884l43285r41811o26373o42547q49991n40161o7368j39732o71463
3009.8D75145264p74918r64088j75591J04981m00010o99806r95865j087303o03676
3018.5D69548988J58959n52674j102562j242942l71971K38227r95254r44176r18579
3027.2D63818016r77287n79529j75362o00509j485520m49295l05557o32057n66063
3035.9D58046837r12476j094360q86002k98423o60973j082039j174850r36089o21185
3044.5D50380440l35732l71933j299133j435242j090736m66271o38885r01299m40864
3053.2D43400345q88252p10679n59463q29353q52547q28018p95555r59435n77850m13399
3062.9D35985794m94957o71768r66759r43184n57594l95508o84891o46286o70204q72650
$$ plain form
3072.5 429081993 427977943 427481155 427164841 426204948 425490608 424906349 424448929 423715363 423031464
3081.2 423031464 422676620 422123642 421410408 420355988 419982948 419511719 418388901 417711906 417463875
3089.9 417463875 416779137 415526161 414965248 414227219 413545113 413251457 412365685 411488457 411034355
3098.5 411034355 411112747 410652504 409704552 408619423 407955399 407895737 407225189 406463509 405577278 404794350
3108.2 404794350 403740273 402827873 402514420 401463356 400899963 400505409 399682274 398932266 398082123
3116.9 398082123 397482986 396852798 396088905 395303841 394600639 393527679 392615280 392140045 391429291
3125.5 391429291 390785637 390173569 389548340 388856621 388106575 386982307 386235313 385799179 384881363
3134.2 384881363 384313431 383473434 382993660 382623291 381505814 380544739 379821663 379347229 378229256
$$ packed form
3072.5D29081993j104050m96788l16314r59893p14340n84259m57420p33566o83899
3081.2D23031464l54844n52978p13234j054420l73040m71229j122818o76995k48031
3089.9D17463875o84738j252976n60913p38029o82106k93656q85772q77228m54102
3098.5D11034355P8392m60243r47952j085129o64024n9662o70548p61680q86231p82928
3108.2D04794350j054077r12400l13453j051064n63393l94554q23135p50008q50143
3116.9C98082123n99137o30188p63893p85064p03202j072960r12399m75235p10754
3125.5C91429291o43654o12068o25229o91719p50046j124268p46994m36134r17816
3134.2C84881363n67932q39997m79774l70369j117477r61075p23076m74434j117973
$$ plain form
3142.9 378229256 377044792 376353226 375953140 375733986 374860878 373720894 372613525 371890984 371184845
3151.6 371184845 370605278 370143776 369391747 368861389 367840767 366982040 366547852 365845299 364862175
3160.3 364862175 363898239 363265572 362339973 361481743 360764885 360288315 359655151 358655930 358040199 357221718
3169.9 357221718 356434250 355678673 354843254 354103012 353519020 353184280 352464561 351268463 350176430
3178.6 350176430 349980621 349309502 347968330 347297249 346815758 346588097 345875473 344571114 343812103
3187.3 343812103 343294144 342538185 341623840 340788078 340076027 339536552 338962822 338322754 337771721 337245750
3196.9 337245750 336450768 335575600 334700012 333813972 333597946 333259964 332710495 332372322 331746597 330832901
3206.5 330832901 329926376 329697990 329229622 328319702 327774315 327341576 326808090 325872536 325271912 324854546
$$ packed form
3142.9C78229256j184464o91566m00086k19154q73108j139984j107369p22541p06139
3151.6C71184845n79567m61502p52029n30358j020622q58727m34188p02553r83124
3160.3C64862175r63936o32667r25599q58230p16858m76570o33164r99221o15731q18481
3169.9C57221718p87468p55577q35419p40242n83992l34740p19719j196098j092033
3178.6C50176430j95809o71119j341172o71081m81491k27661p12624j304359p59011
3187.3C43812103n17959p55959r14345q35762p12051n39475n73730o40068n51033n25971
3196.9C37245750p94982q75168q75588q86040k16026l37982n49469l38173o25725r13696
3206.5C30832901r06525k28386m68368r09920n45387m32739n33486r35554o00624m17366
$$ plain form
3216.2 324854546 324190483 323737450 323177872 322330742 321381798 320420418 320081902 320247574 319756508 319490070
3225.8 319490070 319175148 317930908 317293301 317199574 316629295 315533504 314963360 314661560 314165974
3234.5 314165974 313858528 313125153 312467899 312098579 311948318 311369209 310439796 310091400 309673443 309447727
3244.2 309447727 309006748 308317604 307777653 307073631 306491432 306149139 306136265 305534592 304751186 304563866
3253.8 304563866 304391956 303799896 303097363 302760296 302334938 301980648 301143665 300495167 300776825 300449562
3263.4 300449562 299690762 299051418 298504887 297857857 297625046 297770557 297431583 296844902 296443672 296341705
3273.1 296341705 295667572 295365925 295233040 294358883 294091415 293710766 293371334 293240910 292845898 292566528
3282.7 292566528 292168350 291893005 291495552 291149731 290973053 290598354 290368710 290313129 289865112 289060535
$$ packed form
3216.2C24854546o64063m53033n59578q47130r48944r61380l38516J65672m91066k66438
3225.8C19490070l14922j244240o37607r3727n70279j095791n70144l01800m95586
3234.5C14165974l07446p33375o57254l69320j50261n79109r29413l48396m17957k25716
3244.2C09447727m40979o89144n39951p04022n82199l42293j2874o01673p83406j87320
3253.8C04563866j71910n92060p02533l37067m25358l54290q36983o48498K81658l27263
3263.4C00449562p58800o39344n46531o47030k32811J45511l38974n86681m01230j01967
3273.1B96341705o74133l01647j32885q74157k67468l80649l39432j30424l95012k79370
3282.7B92566528l98178k75345l97453l45821j76678l74699k29644n5581m48017q04577
$$ plain form
3292.4 289060535 288380222 287757759 287661877 287641678 287223701 286753769 286188831 286118813 286201382 285834579
3302 285834579 285379620 285220089 284937763 284289341 284128933 284024391 283345928 282809067 282469082 281840515
3311.7 281840515 281363316 281243515 281003609 280764236 280648174 280116653 279167366 278500061 277841015 277332287
3321.3 277332287 277072258 276566086 276320171 276052341 275368423 274619179 274305725 273856316 272917480 272390690
3330.9 272390690 271745186 271266632 271134758 270459499 269649067 269175701 268725739 267963600 267352161 266627407
3340.6 266627407 266306896 266616745 266334267 265739574 264883823 264228230 263750706 262872753 262611446 262742519
3350.2 262742519 262377720 261795292 261206741 260508137 260106087 259893017 259640617 259529438 259166660 258566074
3359.9 258566074 258221550 258219357 257910976 257517891 257505951 257258301 256793003 256472988 256207752 256118355
$$ packed form
3292.4B89060535o80313o22463r5882k0199m17977m69932n64938p0018Q2569l66803
3302B85834579m54959j59531k82326o48422j60408j04542o78463n36861l39985o28567
3311.7B81840515m77199j19801k39906k39373j16062n31521r49287o67305o59046n08728
3321.3B77332287k60029n06172k45915k67830o83918p49244l13454m49409r38836n26790
3330.9B72390690o45504m78554j31874o75259q10432m73366m49962p62139o11439p24754
3340.6B66627407l20511L09849k82478n94693q55751o55593m77524q77953k61307J31073
3350.2B62742519l64799n82428n88551o98604m02050k13070k52400j11179l62778o00586
3359.9B58566074l44524k193l08381l93085j1940k47650m65298l20015k65236q9397
$$ plain form
3369.5 256118355 255970535 255193577 254676533 254501419 254471340 254741001 254298725 253763542 253133144 252765179
3379.2 252765179 252965794 252870789 253076725 252950764 252740479 252456322 251987381 252008724 251850586 251792850
3388.8 251792850 251596985 251535950 251705894 251667938 251082439 250474949 251182175 251303577 250345306 249767895
3398.4 249767895 250191212 250878544 250459042 250328846 250183315 249659328 249509678 249240875 249506283 250416374
3408.1 250416374 250604191 250062523 250197697 250407028 250431919 250644150 250470581 250357914 250490456 250585957
3417.7 250585957 250554829 250746365 250960369 251029396 251087685 251085148 251173382 251113853 251788502 252617645 252653408
3428.3 252653408 252779751 253038006 252966042 252623768 252908287 253327217 253459702 253661518 254020462 254913120
3438 254913120 255577335 255814285 256450348 257293129 257325802 257417717 257566853 257605877 258344975 258236561
$$ packed form
3369.5B56118355j47820p76958n17044j75114l0079K69661m42276n35183o30398l67965
3379.2B52765179K00615r5005K05936j25961k10285k84157m68941K1343j58138n7736
3388.8B51792850j95865o1035J69944l7956n85499o07490P07226J21402r58271n77411
3398.4B49767895M23317O87332m19502j30196j45531n23987j49650k68803K65408R10091
3408.1B50416374J87817n41668J35174K09331K4891K12231j73569j12667J32542R5501
3417.7B50585957l1128J91536K14004O9027N8289k537Q8234n9529O74649Q29143L5763
3428.3B52653408J26343K58255p1964l42274K84519M18930J32485K01816L58944Q92658
3438B54913120O64215K36950O36063Q42781L2673R1915J49136L9024P39098j08414
$$ plain form
3447.6 258236561 258745632 259818630 260199089 260861073 261484604 262124386 262357559 262910976 263779240
3456.3 263779240 264067001 264331684 264656258 265651169 266579342 267177429 267710190 268241425 268866901 269429626
3466 269429626 270473690 271056175 271343384 271779785 272362652 273396683 274300308 274856224 275539074 276509495
3475.6 276509495 276785622 277473831 278489113 278989582 279738541 280436230 281407509 281978588 282662487
3484.3 282662487 283370380 283921204 285315609 286326008 287312565 288276863 289245224 290014629 290291080
3493 290291080 291377411 292585335 293503399 293938026 294302807 294996204 295945930 297071056 297654514
3501.6 297654514 298710289 299682369 300235043 301328335 302350273 303585625 304945869 305560303 306106834
3510.3 306106834 307143574 307821522 308807564 309972134 310927620 312139053 313288307 314253349 314926815
$$ packed form
3447.6B58236561N09071J072998L80459O61984O23531O39782K33173N53417Q68264
3456.3B63779240K87761K64683L24574R94911R28173N98087N32761N31235O25476N62725
3466B69429626J044064N82485K87209M36401N82867J034031R03625N55916O82850R70421
3475.6B76509495K76127O88209J015282N00469P48959O97689R71279N71079O83899
3484.3B82662487P07893N50824J394405J010399R86557R64298R68361P69405K76451
3493B90291080J086331J207924R18064M34627L64781O93397R49726J125126N83458
3501.6B97654514J055775R72080N52674J093292J021938J235352J360244O14434N46531
3510.3C06106834J036740O77948R86042J164570R55486J211433J149254R65042O73466
$$ plain form
3519 314926815 315800476 316935349 318446198 319581490 319776382 320474892 321595840 323120270 324403000
3527.7 324403000 325757866 326802406 327580414 328737144 329825668 331320801 332259178 333959312 335537796
3536.4 335537796 335661774 336905746 338331604 339632988 340575752 342430382 344309578 345084038 346204224
3545 346204224 347040100 348609200 349649239 351571007 353343811 354825859 357088356 356723213 357797508
3553.7 357797508 359644165 361663551 364089508 364982948 366778908 368657303 370140533 371187973
3561.4 371187973 373084183 374480934 375275536 378664055 379738197 379780540 380098991 381444092 384880028
3570.1 384880028 387060394 389043159 390634155 392593536 394256287 395988007 398233986 399459763
3577.8 399459763 401970940 404053497 405299568 406981544 409329033 411267586 412550087 416457405
$$ packed form
3519C14926815Q73661J134873J510849J135292J94892O98510J120948J524430J282730
3527.7C24403000J354866J044540P78008J156730J088524J495133R38377J700134J578484
3536.4C35537796J23978J243972J425858J301384R42764J854630J879196P74460J120186
3545C46204224Q35876J569100J040039J921768J772804J482048K262497l65143J074295
3553.7C57797508J846657K019386K425957Q93440J795960J878395J483230J047440
3561.4C71187973J896210J396751P94602L388519J074142M2343L18451J345101L435936
3570.1C84880028K180366J982765J590996J959381J662751J731720K245979J225777
3577.8C99459763K511177K082557J246071J681976K347489J938553J282501L907318
$$ plain form
3585.5 416457405 418806038 418954391 420668144 421057663 423862610 426981735 430175781 431679955 432202148
3594.2 432202148 435341568 436301155 438639259 442007637 443774223 446728592 447858162 449197693
3601.9 449197693 451806335 453823891 456647453 460000496 463030090 463569489 466803474 467873840
3609.6 467873840 467727852 474023247 475967674 475377808 479675407 480333023 484442902 489304810 490709190
3618.3 490709190 491659889 492297058 495644913 499359016 502267075 504433594 507011681 509781647 512915421
3627 512915421 519608459 520604095 512698936 517621536 523088303 529019356 532233124 531541519 534386444
3635.7 534386444 538183403 540658264 542116737 544485283 547995949 550826225 552668343 554824371
3643.4 554824371 557800140 561720123 567047081 567323227 566364746 571934853 574400635 574496231 574154816
$$ packed form
3585.5D16457405K348633J48353J713753L89519K804947L119125L194046J504174N22193
3594.2D32202148L139420R59587K338104L368378J766586K954369J129570J339531
3601.9D49197693K608642K017556K823562L353043L029594N39399L233985J070366
3609.6D67873840j45988O295395J944427n89866M297599O57616M109879M861908J404380
3618.3D90709190R50699O37169L347855L714103K908059K166519K578087K769966L133774
3627E12915421O693038R95636p905159M922600N466767N931053L213768o91605K844925
3635.7E34386444L796959K474861J458473K368546L510666K830276J842118K156028
3643.4E54824371K975769L919983N326958K76146r58481N570107K465782R5596l41415
$$ plain form
3652.1 574154816 578513832 582664223 586916351 592317352 586809235 589118805 594626007 596572990
3659.8 596572990 598447495 599780998 602900925 604354706 605589409 608026886 610291214 615121574
3667.5 615121574 616635628 616336365 618591995 613575478 615934677 623987389 633180351 632633972 617313156
3676.2 617313156 621174965 628995743 634184952 632065048 631324768 633514099 635640526 637760735
3683.9 637760735 638857155 639050751 642376556 649153137 642718582 639944534 646850739 641141891
3691.6 641141891 641933746 647434692 648817291 650381775 650799713 651178818 652508316 653258972 655878906
3700.3 655878906 658136139 653262787 652023010 656973801 658692474 659057007 659928207 662464828 666207733
3709 666207733 659736786 663625336 667876358 653987732 658092194 662954788 663875961 664469452 666543198
$$ packed form
3652.1E74154816M359016M150391M252128N401001n508117K309570N507202J946983
3659.8E96572990J874505J333503L119927J453781J234703K437477K264328M830360
3667.5F15121574J514054k99263K255630n016517K359199Q052712R192962n46379j5320816
3676.2F17313156L861809P820778N189209k119904p40280K189331K126427K120209
3683.9F37760735J096420J93596L325805O776581o434555k774048O906205n708848
3691.6F41141891P91855N500946J382599J564484M17938L79105J329498P50656K619934
3700.3F55878906K257233m873352j239777M950791J718673L64533Q71200K536621L742905
3709F66207733o470947L888550M251022j3888626M104462M862594R21173N93491K073746
$$ plain form
3717.7 666543198 668058319 665216827 666578522 671884689 669101639 665167618 670232849 671612167
3725.4 671612167 670387955 667957001 667765045 671297226 672820129 678447952 675949402 667667999
3733.1 667667999 675599670 675374298 667963333 670078354 672078857 672275543 674977036 678580322 674193039
3741.8 674193039 676257019 686170807 674171448 661894073 671577072 677046127 682481613 679474258
3749.5 679474258 670567932 679191818 672491989 668488922 675001984 679165497 682256927 677428665
3757.2 677428665 679916534 685839233 677557526 675395813 679634781 681345901 681729355 684788742
3764.9 684788742 682668152 678162842 680949249 685901718 686964722 678527908 680130615 683364868
3772.6 683364868 683849716 684947586 684473877 685239258 685965347 688413391 687345123 679387436 681960068
$$ packed form
3717.7F66543198J515121k841492J361695N306167k783050l934021N065231J379318
3725.4F71612167j224212k430954j91956L532181J522903N627823k498550q281403
3733.1F67667999P931671k25372p410965K115021K000503J96686K701493L603286m387283
3741.8F74193039K063980R913788j1999359j2277375R682999N469055N435486l007355
3749.5F79474258q906326Q623886o699829m003067O513062M163513L091430m828262
3757.2F77428665K487869N922699q281707k161713M238968J711120L83454L059387
3764.9F84788742k120590m505310K786407M952469J063004q436814J602707L234253
3772.6F83364868M84848J097870m73709P65381P26089K448044j068268p957687K572632
$$ plain form
3781.3 681960068 684399796 686212616 688897247 685936508 684501114 685391312 686141357 686684647 686095047
3790 686095047 686514511 687450180 687569046 686934967 688249512 691350632 688513718 684182968 685743942
3798.7 685743942 690200577 696258163 690854340 680453033 683204117 685848694 690548782 696340332
3806.4 696340332 687716675 682384720 686328506 688635178 689230576 689465561 688988113 690458450 696011505
3815.1 696011505 693430328 681221237 686306305 691519547 696348953 699361343 682998886 683519135
3822.8 683519135 688181229 689993744 692650833 692471466 688287277 688787003 690430603 693466339 694989090
3831.4 694989090 687283630 690471725 696972733 690469513 690116272 698439941 690812683 685861282
3839.2 685861282 693025742 688081436 687984772 694484940 692070999 688075485 690116272 691508713 691884537
$$ packed form
3781.3F81960068K439728J812820K684631k960739j435394Q90198P50045N43290n89600
3790F86095047M19464R35669J18866o34079J314545L101120k836914m330750J560974
3798.7F85743942M456635O057586n403823j0401307K751084K644577M700088N791550
3806.4F96340332q623657n331955L943786K306672N95398K34985m77448J470337N553055
3815.1F96011505k581177j2209091N085068N213242M829406L012390j6362457N20249
3822.8F83519135M662094J812515K657089j79367m184189M99726J643600L035736J522751
3831.4F94989090p705460L188095O501008o503220l53241Q323669p627258m951401
3839.2F85861282P164460m944306r6664O500168k413941l995514K040787J392441L75824
$$ plain form
3847.8 691884537 693572998 692638092 694032135 699371338 695440750 697209396 681391068 682023849
3855.6 682023849 692063751 691432953 689787369 691447144 692997513 695230484 690972672 691720047
3863.3 691720047 699071350 694201508 686795731 689135056 694156799 700953217 693850555 684154968
3871 684154968 687935486 694578781 698396683 688318329 688971558 693023834 693224945 695040283 698567810
3879.7 698567810 693773270 686786957 692030106 692772827 693644714 698289261 687252350 688503418
3887.4 688503418 691627197 692247391 697269058 697865601 689114456 688892899 691955948 690623169 691889648
3896.1 691889648 693563919 695412903 696818085 688695526 693346176 694862900 689756012 693847885
3903.8 693847885 691141510 689804535 689836426 690672150 692546539 691994324 692187958 692330322 693294449
$$ packed form
3847.8F91884537J688461r34906J394043N339203l930588J768646j5818328O32781
3855.6F82023849J0039902o30798j645584J659775J550369K232971m257812P47375
3863.3F91720047P351303m869842p405777K339325N021743O796418p102662r695587
3871F84154968L780518O643295L817902j0078354O53229M052276K01111J815338L527527
3879.7F98567810m794540o986313N243149P42721Q71887M644547j1036911J251068
3887.4F88503418L123779O20194N021667N96543q751145k21557L063049j332779J266479
3896.1F91889648J674271J848984J405182q122559M650650J516724n106888M091873
3903.8F93847885k706375j336975L1891Q35724J874389n52215J93634J42364R64127
$$ plain form
3912.5 693294449 693723068 692590866 693635788 696195984 693136520 689453735 693166962 693288956 690061874
3921.1 690061874 691940918 693635406 694766388 692554703 689300079 690454025 692056274 693494873
3928.8 693494873 692775497 692549133 694696884 691932068 690514908 692246857 691859436 692258301 692842178
3937.5 692842178 692202148 691774292 691722260 693732452 694395905 689231720 688535614 690340958 691070404
3946.2 691070404 692861633 692033768 692758942 692666016 689240341 690704041 691623459 690895538 691263046
3954.9 691263046 691915436 692342224 691544800 692042694 692201538 692381592 692322388 690704651 691170120 691581345
3964.5 691581345 691513596 692238388 692506714 692581711 691868515 690871429 691686859 692628784 692139130 691939621
3974.2 691939621 691656647 691133575 691042938 691187897 691222305 691233215 691511536 691751175 691893692 691538925
$$ packed form
3912.5F93294449M28619j132202J044922K560196l059464l682785L713227J21994l227082
3921.1F90061874J879044J694488J130982k211685l254624J153946J602249J438599
3928.8F93494873p19376k26364K147751k764816j417160J731949l87421L98865N83877
3937.5F92842178o40030m27856n2032K010192O63453n164185o96106J805344P29446
3946.2F91070404J791229q27865P25174r2926l425675J463700R19418p27921L67508
3954.9F91263046O52390M26788p97424M97894J58844J80054n9204j617737M65469M11225
3964.5F91581345o7749P24792K68326P4997p13196r97086Q15430R41925m89654j99509
3974.2F91939621k82974n23072r0637J44959L4408J0910K78321K39639J42517l54767
$$ plain form
3983.8 691538925 691526260 691789246 691969452 692010345 692213745 693328476 692793350 692104950 692609100 692557068
3993.5 692557068 692452087 691700439 691210022 691211853 691582870 692062073 691719360
4000.2 691719360
$$ packed form
3983.8F91538925j2665K62986J80206M0893K03400J114731n35126o88400N04150n2032
3993.5F92557068j04981p51648m90417J831L71017M79203l42713
4000.2F91719360
##END=$$ End of the data block
