##TITLE=$$ Begin of the data block
##JCAMP-DX=5.00 $$ ACD/SpecManager v 10.08
##SPECTROMETER/DATA SYSTEM=Varian
##DATE=08 Jan 2013 16:21:08
##DATA TYPE=INFRARED SPECTRUM
##DATA CLASS=XYDATA
##ORIGIN=
##OWNER=
##NPOINTS=3735
##FIRSTX=399.26403809
##LASTX=4000.35498047
##MAXX=4000.35498047
##MINX=399.26403809
##MAXY=74.23281860
##MINY=24.95399284
##XFACTOR=1.0000000000
##YFACTOR=0.000000100000000
##FIRSTY=46.25334549
##DELTAX=0.96440572
##XUNITS=1/CM
##YUNITS=TRANSMITTANCE
##XYDATA=(X++(Y..Y))
399.3 462533455 468829880 470782738 471227264 466868401 458345413 454551086 454635277 454011574 459157906
407.9 459157906 465446625 463622589 459568748 460576744 462911224 456732330 452587204 455198326
415.7 455198326 456789856 460311394 460652008 455267410 457328339 458291740 459246788 457946014 457475739
424.3 457475739 461828613 463332481 458254051 455058136 452107887 449499207 453389854 455553169
432.1 455553169 454082108 456316757 458948479 457820740 455734329 454638062 453612518 454533539 456227455
440.7 456227455 453966408 451858063 455416374 458646469 459152031 459350357 458287506 456655350 457216644
449.4 457216644 457750587 454990005 452724915 454075089 455060654 452568436 451274185 451643372 451312943
458.1 451312943 455916519 455620804 450469437 449633713 453304787 457799759 455423241 448611069 446075020
466.8 446075020 445547447 449306374 452494278 448370857 446556587 448648796 446741753 447536850 448379974
475.5 448379974 444894028 441966705 443558998 442948608 440364075 444295769 448347359 445804138 439295120
484.1 439295120 437555237 438362389 438401909 440344238 441314888 443701515 444645615 440326996 438149033
492.8 438149033 439016190 439611092 439814339 438793755 435748596 436863823 439287987 438551292 438704147
501.5 438704147 437179871 437545929 438884048 436964645 436098557 437765770 437553978 434078674 432207260
510.2 432207260 433077087 433014069 433298683 434693832 434546928 432392426 430686913 432753029 434200439
518.9 434200439 430326653 427506523 427121811 427175484 428163834 427955704 426548233 425095978 425727806
527.5 425727806 425401039 423794060 423158302 423800774 426183586 427155647 426366768 425336533 425341492 424271584
537.2 424271584 422638817 423362961 423407669 423212776 422659416 423018494 423262634 422597885 423348045 420925026
546.8 420925026 418001137 417380333 418912964 420006218 417837715 416647491 417065849 419179153 419303780
555.5 419303780 417145615 416030960 415094757 414780655 415471497 416524200 414865303 413961754 414642448
564.2 414642448 414292259 415875626 416978760 416240311 415582085 415704155 415899315 414901619 413381424
572.9 413381424 413145523 414179420 414351616 414934959 414763145 414991531 415789680 413882484 413217926
581.5 413217926 414052849 413807564 413078842 413120117 413701973 413385887 413255501 414339867 415630684 416276321
591.2 416276321 417704811 418191452 416594276 415830612 417452583 418836823 418079376 417105980 416239624
599.9 416239624 416302299 417892609 419034576 418813171 418337479 416856079 414123497 414721832 415640945
608.5 415640945 414490967 414654274 414436760 413850441 413169022 412595825 412016945 411628914 411788864 412001457
618.2 412001457 413174095 413704529 414145432 414219780 413905754 413988571 414937973 417645950 418506775 419054451
627.8 419054451 420725937 422539024 424494133 424977493 424823380 424964142 426536713 428944588 431041908
636.5 431041908 432363510 432354469 432939072 433895645 435647812 437712708 437880783 437728081 438497620 440668793
646.2 440668793 443515701 444976768 444654503 443952293 444740372 446372795 447381058 448123245 449807816
654.8 449807816 451059036 449792671 448076744 447593040 448376160 449332161 448764343 448306923 449397049
663.5 449397049 449447861 448527832 449227791 450777168 449411926 449434853 451113625 451774445 451922035 453189468
673.2 453189468 454098587 454631081 455689545 457010384 458367577 459083252 460085602 461123047 462453194
681.8 462453194 464700737 465752831 465995102 466789474 467109451 466618500 467660103 469746704 470181122
690.5 470181122 470278511 471120529 472106743 472699547 473255196 473998795 474367485 474556961 474653397 475268555
700.2 475268555 476290779 477284241 478458405 479439049 480265236 480668755 480846748 481348877 482152252
708.8 482152252 483441315 484815483 485599403 485860367 485779610 485736275 486435280 487709808 488488998 488636284
718.5 488636284 489689636 491278954 492163353 492948837 493351059 493107948 493120079 494779892 496661491
727.2 496661491 497678108 499358635 500470085 500825195 501423111 501682205 501733513 502186432 502918663
735.8 502918663 504085388 505632172 506079292 505934296 505828972 506018028 506824951 507687454 508462181
744.5 508462181 509654160 511654320 512058449 511372795 511346741 511734695 512283630 512557678 514010048
753.2 514010048 515017853 515943336 517452202 518497353 519744186 519550934 520339127 522148132 523000183
761.9 523000183 523665504 524140167 525269165 526303406 527381134 527680550 527111015 526522980 526727905
770.6 526727905 527921562 528158989 528511086 528336334 528186531 528933029 528812866 528482132 529018288 529547157
780.2 529547157 528584671 528706322 529829063 530846252 531757126 531628761 532198257 532541542 532646446
788.9 532646446 532488861 532193451 532765579 532822495 533194351 534089737 534329453 533568993 532380600 530845375
798.5 530845375 530130272 529949417 529278717 528990936 528109970 527319412 525578842 522732162 520126724
807.2 520126724 517715073 516537819 516065903 515961685 514508858 512578888 511557961 509965591 508478241
815.9 508478241 507291451 506538734 506287575 506187668 505737610 505333557 505446510 506466141 508187752
824.6 508187752 509790421 513013611 516001778 518140793 520512810 521824532 524913139 529272804
832.3 529272804 531942902 533228683 535648727 538754959 540737305 542952805 544789085 546503181
840 546503181 548235474 550382957 552281570 553862495 555972710 557496719 558453369 558122292 559284859
848.7 559284859 560235214 561136436 564375534 566203880 568219261 569820709 570912743 572024841 573431015
857.4 573431015 575282860 576182785 577946854 578690758 579988060 580712852 579647522 579709816 579875984
866 579875984 580452576 580389824 580390816 580232201 579483986 577841568 575749664 574975166 573904572 573268051
875.7 573268051 572289200 571664200 571941032 571465645 570440140 569268456 568868866 568350983 567944870
884.4 567944870 566935692 565893173 565394287 564661713 563685379 562563934 563080482 563057404 562624245
893 562624245 562584343 562452621 562972984 563777390 564353447 562789993 561818771 561669235 561712532 561855240
902.7 561855240 561217232 562584343 564047813 565524673 567335968 569054070 570677834 571476974 571894646
911.4 571894646 570909691 570964012 570784187 569331970 567188263 565314789 564977188 563334923 561259804
920 561259804 558479309 556134338 553452911 548832893 545135384 542584305 541029968 538537750 535624580
928.7 535624580 533328590 531230507 528727226 525399590 523109131 521473465 520409355 519814110 519678841
937.4 519678841 518861351 517503738 517202148 516416435 515594711 514719315 514519997 514649773 514015388 513505592
947.1 513505592 512657394 512216225 511748772 511614952 511901245 511979256 511507797 510190659 508633308 506045685
956.7 506045685 503819008 501557388 499292145 497787666 496390610 494987640 492728271 490922737
964.4 490922737 488451157 485723190 483894920 481862144 480491295 478709679 476362762 474166908
972.1 474166908 471824951 468610649 465261459 462320404 458422699 454729309 451751480 448753319
979.8 448753319 444951401 440147552 435276756 430086746 424845810 420355301 415508690 410766411
987.6 410766411 406858292 402396927 398007202 393921127 389947891 385871468 382003784 378593674
995.3 378593674 375186119 372286339 368731079 365145950 362545357 360016518 357262459 355328407
1003 355328407 353521690 350795097 349045181 347980499 346881027 344995956 343415031 342525024 340386391
1011.7 340386391 338137360 336237907 334783821 332833099 330830040 329290771 327832108 326433449
1019.4 326433449 323240852 319818306 317287331 315390987 313245296 311239929 309600277 307415638
1027.1 307415638 306017799 304283600 302926464 301316261 299891834 299288902 298567524 298791599 298207932
1035.8 298207932 298183174 299064503 300743713 301862106 303011990 305323505 305693645 306251945 305952625
1044.5 305952625 305800571 306173744 305131569 304631824 303534775 302586155 301405716 300388908 299740200
1053.1 299740200 299331512 298613739 297123756 296992683 296543999 297048092 297812023 298673515 300458736
1061.8 300458736 302283363 304565582 306410103 308369198 309422703 311751537 313921757 314697094
1069.5 314697094 315982933 316959457 318206100 318171082 319151821 319978943 319994030 321034279 322033463
1078.2 322033463 323726196 323888512 324150543 324728813 325880966 327639618 328723946 330964622 332632294
1086.9 332632294 333689384 334033432 335201340 336766968 338426819 341260185 342709961 344116135
1094.6 344116135 345369377 346889420 347823410 348260574 350072784 351641464 353219757 353918076 354619789
1103.3 354619789 355640869 357320137 359616013 360433311 360871277 361488266 362487907 363180580 364241371
1112 364241371 365635490 366392670 366691093 366582222 367249184 367608414 368112030 368378792 368035774 368084526
1121.6 368084526 368087959 368323250 367742462 368136940 369389648 370452957 371955261 373304634 375166245
1130.3 375166245 376682243 378060379 379860344 382303276 384413071 385912666 388182640 390703926
1138 390703926 393148422 394703789 395841408 396924591 397883682 398983040 399678421 400307884 401201591
1146.7 401201591 402331581 402676125 402352753 402256584 402528687 402442474 401719856 401532326 401301270 401356049
1156.3 401356049 400928268 399932785 399679642 398740387 398042068 397470016 397312775 398302193 399411583
1165 399411583 401020584 402660370 404651260 406251945 407527542 410081940 413250275 416053085 418729935
1173.7 418729935 421548309 424576073 427266426 428847198 430878029 433700981 436236763 438785782
1181.4 438785782 441001854 442643204 444534378 445870132 446718254 448320732 449588356 450282593 450699692
1190.1 450699692 451018448 451179619 451275177 451412964 450811920 450156975 449468307 448782654 448391685 447370033
1199.7 447370033 446084976 445311928 444638863 443790359 442899475 441949615 441091003 440705872 440717125 440251999
1209.4 440251999 439689980 439550133 439465103 439713707 439503136 438968582 438900299 438570900 438334732 438305473
1219 438305473 438261757 438429375 438219604 437647057 437573662 437589264 437078285 436599312 435855179 435029335
1228.6 435029335 434382172 433636665 433231430 432609253 431720619 431211853 430764275 430136642 429724808 429772835
1238.3 429772835 429464989 428997192 429106636 429123764 428749962 428152695 427406273 426655502 426321831 426181717
1247.9 426181717 425600395 425186348 425034218 424670143 424479752 424647598 424503593 424318161 424345551 424019508
1257.6 424019508 423991280 423822556 423667259 424257317 424471893 424586906 425212250 426191750 426744270 426953163
1267.2 426953163 427632637 428823051 429971695 430717812 431608543 432263641 432876625 433766365 434918442
1275.9 434918442 436304321 437385445 438453217 439708977 440963707 442009277 443232079 444353027
1283.6 444353027 445447311 447020226 448627625 450206223 451400833 452447739 453464165 454424629
1291.3 454424629 455001831 455546951 456705742 457808838 458775635 459572983 460390968 460744286 460929070
1300 460929070 461264763 461430244 461787491 461837692 462165451 462481956 462151527 461662292 461290627 460954018
1309.7 460954018 460495186 460146370 459611778 459265404 458974724 458667030 458493347 458617935 459205704 459466438
1319.3 459466438 460147133 461268883 462398567 462952232 463276711 464244690 464710770 465129776 465504951
1328 465504951 465862236 466009331 465727119 465519066 464745598 463988647 463486404 463393517 463357620 463305397
1337.6 463305397 463606110 463496552 463488235 463858871 464758873 465319519 465492058 465839615 466435547 467554665
1347.3 467554665 468090668 468388672 468165092 468168259 468297310 467844391 467717705 467080956 466857681 466845970
1356.9 466845970 466468391 465758209 465169144 465034332 464505463 464262657 463892441 463786316 463433723 462909584
1366.6 462909584 462365952 461213951 460710373 460108566 459868202 460027046 460404243 460740433 460477905
1375.2 460477905 460656662 460108528 459534149 459041557 459027443 459038849 458449326 457478561 455795097 454941635
1384.9 454941635 454193802 453449364 451487045 449641609 449080582 448040009 446883125 445107040 443622169
1393.6 443622169 440992661 437433090 435938683 434307442 433223076 430554428 427957878 426314926
1401.3 426314926 424054832 422082710 420159569 417465820 415361633 414544525 413105965 411254196
1409 411254196 409860954 408063431 406438141 404814987 403553696 402897034 402575264 402209320 401618347
1417.7 401618347 402006378 399378662 398898430 400016403 400185280 401179504 401044426 401574669 402737350
1426.3 402737350 403448219 404627228 405305023 406253128 406654930 407717247 409376907 411290283 413388863
1435 413388863 414442406 415116196 416530266 418760376 419866066 420961227 422748108 424371223 426149292
1443.7 426149292 426763191 427943039 428947258 429891396 430537872 431594925 433505745 434276619 435658951
1452.4 435658951 436564178 438180351 440041122 440711555 441687126 441930542 445726776 447017860 449156685
1461.1 449156685 450986443 452272720 454942398 455594482 456582489 458397179 461145973 463578606 466055069
1469.7 466055069 469339638 471476250 474158211 475281487 477956963 480957031 483275757 485947990
1477.5 485947990 488340187 490567627 492311020 494026146 495611916 496996689 498737373 500460815
1485.2 500460815 502079201 503613663 504375114 505622292 506057014 504809875 504549904 504542618 504203262
1493.8 504203262 503935127 503326797 498011856 497907791 496942024 493419304 492640381 491530876 490828400
1502.5 490828400 489862518 490234032 490303154 484912872 481544991 482116280 483990593 482947769 483350945
1511.2 483350945 482860832 480908813 480736580 479912605 479052010 476453476 475150604 476692963 478308105
1519.9 478308105 477643471 474403114 475338211 477004967 478734283 477835922 478896179 481162720 482067757
1528.6 482067757 482890587 483821297 485027542 486030388 487015686 486629829 488029556 489229279 490112038
1537.2 490112038 492145348 489892349 487728424 491006050 492910080 493391800 494442444 495542221
1545 495542221 495279884 496751556 497178688 498085823 498345680 497597466 498715515 499068489 500152740
1553.6 500152740 499088974 499539261 500877151 501145859 496646881 490484200 495120964 494325142 494761658
1562.3 494761658 493173332 491299820 488768883 486359520 485334358 483386841 483070030 475013657
1570 475013657 472545738 470936165 467628937 464832764 461457977 459920883 448651085 447129517
1577.7 447129517 444101868 439771500 435468712 429885674 426412048 420580139 416863708 411793861
1585.5 411793861 407436981 402761078 397172661 393948174 388210640 384938850 379196625 375523567
1593.2 375523567 371264610 365915260 363047409 357887154 355605392 350781746 348081665 344462662
1600.9 344462662 341004486 338301086 333384285 332206230 328572464 327274323 324081535 322670326
1608.6 322670326 321499329 317903118 317557869 314701862 314532566 312174454 312476311 313021965 307402935
1617.3 307402935 309010983 307525234 308648911 307095699 307904530 307359581 305365295 307393951 306761551
1626 306761551 308847027 307474957 308837223 309618282 310488930 311797314 312036800 315005054 315389233
1634.6 315389233 317570343 315588245 318285103 320584564 321876602 324076805 324654312 328200455
1642.4 328200455 329034805 331046982 332551422 332541885 336664085 335557480 338636208 339880104 343370056
1651 343370056 345611992 347404099 348109093 345684052 348947716 349691162 352138100 353424225 355481071
1659.7 355481071 357612152 359297600 362531433 363060684 366862717 368942833 372189941 375475845
1667.4 375475845 378436470 383257446 384741058 389082756 390806732 394885979 398726692 402264061
1675.1 402264061 406222420 409301109 414030113 417430191 422193222 425464058 429955368 435156784
1682.9 435156784 436901627 442630539 445921288 451990585 456484604 460833855 465281982 469597626
1690.6 469597626 474720268 479275856 484578209 489685783 495128593 496658211 501289520 507156944
1698.3 507156944 513376808 519357948 517747536 524265060 529353485 533582764 536238441 539170609
1706 539170609 541813774 544499283 548751755 551765862 553859138 556390686 559462013 562657547 563642120
1714.7 563642120 564230843 567196159 568216095 565572472 570379257 574240608 576434441 577821693
1722.4 577821693 578528099 579188881 581047745 582928047 584033394 585899734 588072968 588364868 589054565
1731.1 589054565 592436752 595329475 593138199 591789093 595953255 599910316 602217331 604888992
1738.8 604888992 605865364 604868164 608621330 611825752 613356056 615308685 619092827 622438507 624679871
1747.5 624679871 627442589 628918648 633329735 635406418 636411972 640911636 643955765 647143478
1755.2 647143478 650212631 650625763 652316437 655205231 657780533 661187897 661388168 662033463 665610809
1763.9 665610809 667406845 669248123 671162338 672772522 671529388 673360062 677519684 678197937
1771.6 678197937 677250214 676214523 680063629 682398605 681987228 684036636 684809341 686488876 687574768
1780.3 687574768 687279968 687970963 689670029 691548996 690914841 691272964 692656631 693809204 694631348
1788.9 694631348 696435089 697771149 698359146 697652130 696142960 699018097 700214157 700263596 701963348
1797.6 701963348 704009552 705106201 703880463 705194016 705058212 705809860 707361755 707669830 708765564
1806.3 708765564 709259415 709768219 710792847 712334900 711628342 711753540 713169479 713580856 714505844
1815 714505844 714760361 715777740 716051941 716715317 717629700 717403030 718084183 718003922 719526367 720893860
1824.6 720893860 718982773 718793564 720569611 722695236 723012009 720527496 720487061 722421722 723015137
1833.3 723015137 723550415 724226990 724769821 725337677 724396362 725102692 725655060 726287384 726873245 728288345
1842.9 728288345 729977798 725977783 727220001 728460541 728484344 728416290 728786469 729962616 729852219
1851.6 729852219 730524750 730764160 731176529 731336746 731343079 731711426 731244812 731871719 732055893 732738266
1861.3 732738266 732950592 732987900 733429108 733494568 734276352 733970261 734596329 733868332 732936630 733826065
1870.9 733826065 734544220 735401459 735188217 735796814 735999832 736075668 736236420 736239548 736829605 736967316
1880.6 736967316 737277069 736716080 736952057 736868362 736579971 737316742 737513733 738603210 738520279 737444839
1890.2 737444839 737829819 738632812 738682861 738745651 738989410 738384171 739095230 739211426 739424286 739534836
1899.8 739534836 739240112 739647293 739595871 740104523 739967117 740028915 740139313 739967728 739956284 739879608
1909.5 739879608 740156479 739806213 740567245 740701523 740736237 740577927 740354691 741928024 740792618
1918.2 740792618 739912186 740501251 741288605 742037201 741122055 740667725 740757370 741228867 741383591 742027512
1927.8 742027512 742327271 742194366 742328186 741996002 742086639 741365585 741322632 741547241 741831055 742270279
1937.5 742270279 741945953 741947632 741358185 741980209 741760483 740173950 740911865 741792984 742091599 741734848
1947.1 741734848 742102509 741877060 741218414 741016388 740983505 741356277 741743011 742243652 741679764 741644897
1956.7 741644897 741669235 741176605 740980911 740580750 740605850 740451508 741098557 741647034 741692657 741593094
1966.4 741593094 740773239 740287933 740005112 740344086 740632553 741065826 741220703 741207199 741214600 740636368
1976 740636368 740692062 740472565 740572586 740638885 740724030 740864029 740491638 740720978 740332336 740066452
1985.7 740066452 739677582 739641647 740071869 739713593 739807510 739919968 739851761 739431152 739737549 739669724
1995.3 739669724 739156113 739265747 738923187 739021606 738959198 739171371 739081726 738737411 738818665 738611450
2005 738611450 738714142 738258286 738225861 738113861 737887650 737918243 737702408 737791290 737429581 737605667
2014.6 737605667 737622910 737221375 736574783 736475067 736976776 736789703 736993256 736693192 736758881 736522903
2024.2 736522903 735797882 735799408 735678101 736007614 735928040 736180038 736133194 735809555 735500031 734814835
2033.9 734814835 735065994 734908905 734769363 734591751 734877853 735252228 735010147 734725571 733922806 734191818
2043.5 734191818 733990555 733583298 733649826 733856277 734267273 733756790 733458710 732971420 733071289 732938919
2053.2 732938919 732617645 732973785 732934647 733380051 733253860 733242187 733018494 732691803 732631683 732230759
2062.8 732230759 732536926 732411194 732547455 732516479 732271576 732119598 732116089 732470322 731969528 731976471
2072.5 731976471 732072983 732304687 732298203 732251968 732493134 732012024 732289734 732004471 731526871 731462326
2082.1 731462326 731437988 731370544 731090927 731300583 730980988 730973740 730762863 730776443 730842514 730150909 730319519
2092.7 730319519 730658264 730899506 730257721 729950943 729960709 729718094 729950638 729751205 729837570 729418564
2102.4 729418564 729281235 729408493 729326172 729333344 729120941 729295349 728693848 728575745 728483582 728073120
2112 728073120 728016129 728136139 728594666 727966537 727880325 727918015 727769318 727655334 727479782 728022232
2121.6 728022232 727882690 727918167 727779770 727450562 727100525 726937714 727110214 726898041 727244720 727158356
2131.3 727158356 727571564 727710114 727160187 727024612 726691208 727235947 727545319 727776337 727602081 727210083
2140.9 727210083 727555008 727526550 727189789 726870804 727254868 727084808 726972122 727390289 727594910 727780304
2150.6 727780304 727604675 727514420 726887970 727175598 727480011 727149429 727380295 727382812 727861328 727729492
2160.2 727729492 727553940 727547760 727325363 727564774 727835770 728035507 727788086 727876663 727447510 727206116
2169.9 727206116 727525711 727511368 727786942 728063202 728696289 728735352 728731155 728384552 727787094 727886810
2179.5 727886810 727623367 728009567 728419266 728739319 728749924 728431168 728361740 728277740 728576355 728322067
2189.1 728322067 728272705 728571930 729216843 729420013 729009476 729087219 728652344 728410263 728055344 728315201
2198.8 728315201 728904724 729148407 729588242 729236755 729035416 728786621 728937378 728880005 728765869 729165649
2208.4 729165649 729127121 729750290 729773560 729709549 729748230 729636002 729738770 729479218 729808426 729993134
2218.1 729993134 730026245 729663391 729681015 729821014 729273529 729047852 728728561 729319229 729735641 729857941
2227.7 729857941 729893188 729447708 729584885 729429016 729326859 729386368 729770126 729883499 729784088 729807663
2237.4 729807663 729427948 729357681 729103928 729378738 729493103 729509888 729744186 729435883 729408493 729080429
2247 729080429 729136276 729342422 729496384 729614868 729824982 730231171 729641037 729266510 729172211 729350052
2256.7 729350052 729418411 729436417 729434204 729077530 729465637 729253464 729123917 729265289 729321060 729507446
2266.3 729507446 729417648 729514618 729350128 729675293 729539185 729123917 728696442 728453293 729193878 729360428
2275.9 729360428 729495163 729182281 729054108 728828659 728269653 728405685 728194351 728491440 728478317 728448563
2285.6 728448563 728342209 728112717 728710175 728867187 728841476 728583298 728884048 728908463 728745880 728949280
2295.2 728949280 728816910 729044189 728432617 728363571 728577118 728692017 729143066 729289703 729468994 728784790
2304.9 728784790 729202499 729470978 729035873 729279404 729337387 729897614 730234680 731016388 730945129 730093460
2314.5 730093460 729923401 729901047 730304413 730285034 731023178 731546326 731371765 731549454 731841202 732034149
2324.2 732034149 731856613 731566620 731095886 731971283 732552719 732805023 732997055 732930603 733445358 732876740
2333.8 732876740 733069687 733319168 733879395 734428253 733910370 734074707 733831253 733412476 733203049 733090820
2343.4 733090820 732370377 731659393 730401001 728301773 727176437 727725906 729536743 730213318 731212769
2352.1 731212769 732080841 731680679 731909409 732396240 734854507 735393600 735156937 733597870 732659454
2360.8 732659454 732745895 730856247 732022400 732188797 732902451 732882004 729966202 728033752 728448944
2369.5 728448944 728950119 726621933 725963211 725586472 724604111 723614807 722327576 721951447 721144638
2378.2 721144638 720609665 719736938 718960266 718370438 717566452 717288666 716868591 716671906 716163864 715784607
2387.8 715784607 715588074 715389175 715481720 715296860 715175247 714419632 713915558 713855820 713761368 713793106
2397.4 713793106 713606415 713434067 712966309 712893753 712806091 712633896 712359085 711949615 712037201 711798553
2407.1 711798553 711483078 711080399 710784988 710255890 710030975 710231094 709651489 709382706 709220810 709288864
2416.7 709288864 709293289 708917236 708213806 707403946 707462769 707130203 706842422 706872940 706919174 706688385
2426.4 706688385 706165543 705739899 704898529 704869614 704581985 704299469 704607086 704288177 704261932 704152832
2436 704152832 703845749 703238602 702633438 702129288 701700745 701899872 702002640 701893768 701564331 701293106
2445.7 701293106 700792618 700296555 699911652 699507980 699455261 699256668 699187012 698728638 698300552 697749557
2455.3 697749557 697160263 697149277 696654587 696392822 696006165 695746994 695740585 695470581 695043030 694270020
2465 694270020 693881226 693206558 693065491 693065796 692486420 692348557 692268982 692334213 691783524 691025162 690404968
2475.6 690404968 689924545 689819565 689671249 689857559 689735031 689056473 688264084 687964401 687425461 686616211
2485.2 686616211 686304550 685994186 686031113 685720520 685375366 685184937 684704590 684091644 683302917 682929687
2494.8 682929687 682670670 682371750 681530762 680996704 680840683 680298157 680084076 679698410 679630661 679354858
2504.5 679354858 678845749 678551788 678030701 677698822 677323456 677074890 676441879 675919724 675612411 675218887
2514.1 675218887 675147705 674833145 674500732 673907471 673553391 673348160 672842178 672318344 671670837 671040268
2523.8 671040268 670523758 670425034 670078430 669937897 669639893 669330673 669502792 668820953 668395920 667954178
2533.4 667954178 667503052 667241440 666889801 666779175 666320190 666263046 665731125 665006332 664765167 664629440
2543.1 664629440 664503174 664126053 664232025 663720779 662999115 662446060 661763153 661314163 660717163 660557098
2552.7 660557098 660459824 660334549 659804840 659210129 658916473 658390884 657947845 657422409 657276459 656964340
2562.4 656964340 656718369 656662445 656348572 656013412 655323715 655004578 654642105 654333420 654024124 653602066
2572 653602066 653382874 652854080 652605209 652095261 651455307 651030045 650800858 650497894 649921875 649845581
2581.6 649845581 649752426 649698868 649168625 648595200 648243256 647477264 647123718 646772766 646680527 646475983
2591.3 646475983 645822601 645535812 645520782 645259933 644604797 644053421 643440857 643151703 642883148 642529831
2600.9 642529831 642382889 642164154 641855927 641076736 640490036 639868164 639514656 639281235 638571930 638294334
2610.6 638294334 637925148 637680130 637245712 636443558 635903015 635701103 635618095 634863014 634480782 634527550
2620.2 634527550 633894730 632983093 632617950 632345963 631945419 631754799 631264343 630898552 630440636 629954262
2629.9 629954262 629312744 628512955 628323479 628040810 627449379 626548042 626393242 626478806 625897751 625520210
2639.5 625520210 625239143 625135307 624363670 623395653 622632713 622049179 621919479 621479149 621363945 620979500
2649.1 620979500 620289459 619852676 619425354 619171448 618946762 618667297 618170319 618012390 617691956 617265816
2658.8 617265816 616949844 616221771 615520248 614935417 614680519 614331207 614203796 614046707 613566284 613296623
2668.4 613296623 613041115 613069115 612549477 611865921 611191826 610581017 610780449 610970459 610808029 609922218
2678.1 609922218 609335213 609300613 609067993 608642387 608035469 607697983 607208061 606909294 606601334 606217728
2687.7 606217728 606210670 606119957 605784912 605183868 604858360 604451103 604058151 603924522 603555412 602937508
2697.4 602937508 602578697 602477303 601889267 601726608 601550751 601168938 601144409 600720673 600205421 599739113
2707 599739113 599690666 599608955 599116859 598390617 597779999 597850533 597933235 597796555 597316666 597107773 596735649
2717.6 596735649 596194801 596062088 595551567 595446892 595269775 594956551 594873123 594780655 594744682 594139290
2727.3 594139290 593506432 593052139 592903214 592581291 592284775 592403755 592134171 591859169 591294250 590782127
2736.9 590782127 590798264 590913429 590661011 590360298 590470047 590250816 589903603 589398689 588907509 588747864
2746.5 588747864 589225273 589636154 589014969 588529358 587966995 587702942 587698479 587300072 587269630 587117920
2756.2 587117920 586563683 585970879 585772095 585552826 585338745 585210228 584667664 584105606 583699951 583640709
2765.8 583640709 583573990 583305359 582846642 582676048 582593803 582289047 582328110 581900215 581548843 580980797
2775.5 580980797 580176506 579972076 579633026 579426727 579153748 578963470 578456993 577845688 577443657 576643295
2785.1 576643295 576214218 575903206 575850296 575593567 574905167 574291267 573695564 573264732 572633781 572309036
2794.8 572309036 571791039 571250496 570929031 570241585 569589500 568990021 568651276 567929611 567087593 566364288
2804.4 566364288 565844116 565479927 564612312 564380188 564160728 563347130 562282677 561166534 560478363
2813.1 560478363 559942627 559481087 558832512 558216400 557637100 557211876 556487999 555457611 554862976
2821.8 554862976 554037437 553173714 552141991 551553497 551596832 550953789 549903488 549011345 548100777
2830.4 548100777 547117310 546784554 546125450 544881554 543735809 542444153 541370506 540250854 539130402
2839.1 539130402 537473640 536033325 534931831 533074684 531445770 529816093 528353310 526777153
2846.8 526777153 524693642 522399368 520246506 518764839 517260857 516257057 515234375 514547234
2854.6 514547234 514586143 514104500 513948441 513875961 513795700 513665047 513167496 512947311 512622223 511868362
2864.2 511868362 511162987 510534096 509617844 508757820 507896080 507333031 506775551 505879707 505305290 504304008
2873.8 504304008 503097610 502414551 502181892 501686401 500903778 500524216 499875374 498872757 497780647
2882.5 497780647 496942139 496319466 495771141 495011253 493774643 492727890 491762428 491375999 490868568
2891.2 490868568 489615746 488746338 488190880 487773552 486974258 485666924 484497604 483836174 483221474
2899.9 483221474 482422905 481547852 480662460 480254669 479719429 479303970 478487549 477026901 476229172
2908.6 476229172 475406494 474234543 473005295 472023544 470912590 469495087 467725563 465875587 464926682
2917.2 464926682 463670235 462424545 461537781 460656624 460053062 459200363 458368187 457442551 457299309
2925.9 457299309 457510719 457369003 457221336 457051468 457552185 457586594 457522888 458053589 458816299 459435539
2935.6 459435539 459333763 459934196 461011124 461965485 462763634 462991714 463475990 464411125 464926224
2944.2 464926224 464942322 465516663 466019325 466211243 467043037 467897224 468582306 468996048 468843880 469202957
2953.9 469202957 470154228 470305290 470440369 471391602 472056084 472112236 472194214 473007545 473968506 474159775
2963.5 474159775 474303284 475044670 475788612 476578026 477069969 476822853 477287598 478469467 479466934
2972.2 479466934 480046043 480186195 480373802 480946846 481719856 482079048 482490692 483078346 483511658 483516617
2981.8 483516617 483062210 483123589 483726540 484268875 484178543 484106331 484080925 483544083 483480721 484063988
2991.5 484063988 484711456 484559937 484182091 483817787 483264351 483098526 482676239 482171936 481826019 481836166
3001.1 481836166 481782074 481337738 480778236 479880562 479264069 478521690 478043976 477877159 477454529 476992531
3010.8 476992531 476279068 475906792 475330696 474705353 474333153 473666229 472922516 472168961 471429214 470863113
3020.4 470863113 470835800 470072365 468791313 467855721 467040024 466862106 466273804 465197525 464230576
3029.1 464230576 463642654 463117638 462489090 462290649 461663361 460709496 459687386 458875427 457905960
3037.8 457905960 456816101 456274643 455587387 455134850 454508705 453708305 452905121 451820450 450964508
3046.5 450964508 450177460 449661827 448749809 447756729 447257309 446562271 445654640 444819107 444380341 443762665
3056.1 443762665 442751846 441758957 441153755 440436211 439375343 438555717 438010635 437848816 437021790
3064.8 437021790 435888443 435129509 434498291 434060173 433376312 432813148 431650658 430323639 429600945
3073.5 429600945 429211121 429307594 428587570 427491837 426974449 426609573 426178246 425596428 424759216 423874321
3083.1 423874321 423403664 422780838 422234268 421809502 421040611 420275536 419705887 419136505 418131447
3091.8 418131447 417275238 416683464 416163483 415709190 414868965 414036713 413584938 413252068 412753487 411995087
3101.4 411995087 410679665 409688759 409488525 408986778 407960167 407038193 406585426 405858231 405198479
3110.1 405198479 404635506 403918114 403586540 402682571 401578293 400871124 400525322 400358467 399581642
3118.8 399581642 398426590 397556267 396979332 395721169 394647408 394413261 393767967 392937622 392394371
3127.5 392394371 391861000 391140709 390188103 388981247 388263969 387603951 386759262 386494484 385570297
3136.1 385570297 384253616 383338242 382684517 382047424 381293831 380900879 380292625 379543495 378649788
3144.8 378649788 377795105 377216606 376384468 375854492 375573349 375000458 374002533 372887306 371825066
3153.5 371825066 370944595 370061188 369206886 368894463 368144302 367216835 366607285 365975456 365298843 364235420
3163.1 364235420 363163834 362571144 362430649 361728783 360743370 359962158 359061661 358251534 357141342
3171.8 357141342 356431694 355938721 355232086 354690285 354278030 353887978 352811394 351572418 350449753
3180.5 350449753 349736938 349248123 348444405 347833672 347149239 346523590 345577126 344735031 344577789 344165993
3190.1 344165993 343356400 342416382 341740761 341231346 340454521 339307938 338611298 337866821 336920700
3198.8 336920700 336887741 336388092 335648346 334943619 334104691 333835449 333381538 332753487 331793633 331030197
3208.5 331030197 330562897 329908142 329477501 328975830 328768005 328159103 326780319 326048431 326082993 326012459
3218.1 326012459 325356293 324276886 323221130 322387123 321724854 321414413 321057167 320775146 320442123
3226.8 320442123 319663525 319217758 318578129 317863827 317392483 316592903 315798664 315239639 314940815 314568920
3236.4 314568920 314111538 313822365 313547726 312722473 311925411 311888313 311566772 310914021 310014019 309143200
3246.1 309143200 308932648 308720512 308136806 307563419 307111530 306516438 306221294 305659199 304780865 304869099
3255.7 304869099 304878941 304076347 303430443 303146534 302753086 302224293 301412125 300800304 300572395 300041790
3265.4 300041790 299713078 299481354 299423370 299326649 298748989 298276386 297698135 297322273 297014637 296644421
3275 296644421 296245327 295615807 295212250 294845524 294781036 294470787 293831272 293900070 293964443 293153763
3284.7 293153763 292186527 292094879 292024441 291576748 291457748 290942326 290245037 290358734 290108280 289388752
3294.3 289388752 289465160 289360886 288685913 288201580 287977142 287479572 286747398 286373234 286004810 286010532
3303.9 286010532 285833416 285319843 285413055 285232849 284494381 283601456 283077278 282558022 282038860 281935596
3313.6 281935596 281481571 281253338 280949936 280013618 279391785 279319897 279164677 278711815 278249226 277787437
3323.2 277787437 277565384 276887436 276009102 275719852 275402622 274943981 274037762 273188305 272845573 272571640
3332.9 272571640 271928616 271053524 270873566 270511818 269336967 268367138 267949181 267329578 266426563
3341.6 266426563 266309929 266453075 265862656 264986134 264382305 264031334 263873844 263341312 262664738 262742271
3351.2 262742271 262665691 261785469 260961952 260830841 260537395 260041275 259976254 259780674 259450188 259057007
3360.8 259057007 258915176 258453465 257853622 258147430 258104191 257292786 256291714 255837383 255769863 255592098
3370.5 255592098 255267525 254640160 254688034 254910431 254636917 253883514 253338070 253602295 253161850 252512264
3380.1 252512264 252747860 253019600 252353115 251641979 251844292 252062988 252128696 252122440 252170162 251864967
3389.8 251864967 251631451 251729488 251145687 250596428 250063972 250007668 250593796 250615234 250286751 249812794
3399.4 249812794 249941425 250527020 250612507 250244675 249712067 249610100 249700279 249639969 249565983 249672260
3409.1 249672260 249945393 249685307 249539928 250080147 250075264 250010586 250164108 250010891 250107346 250165939
3418.7 250165939 250629864 251054173 250554123 250124416 250235367 250960159 251428642 251672783 251779327 251503792
3428.3 251503792 251910019 252916775 253493767 253244915 253101654 253072262 253080769 253538914 253981266 254505310
3438 254505310 254800358 254853535 255200214 255979176 256451168 256706429 257568588 258088131 258366566 258655777
3447.6 258655777 258891315 259360924 260265694 261177597 261446381 261960716 262446880 262935028 263068962 263209915
3457.3 263209915 264622173 265348949 265670662 266452427 267137680 267419033 267587395 268859062 269869690
3466 269869690 270031090 270529232 271464958 272195740 272745762 273673401 274425220 274649029 274821815 275773926
3475.6 275773926 276922951 277891293 278625870 279033375 280017757 281314945 282390747 282323704 282381668
3484.3 282381668 283563042 284682636 286066666 287051163 287245369 287636757 288589039 289502239 290031509
3493 290031509 291036720 291986561 292995892 294019051 294725342 295757103 296889458 297880440 298565063
3501.6 298565063 299230671 299828434 300257778 301238518 302751827 304154396 305260677 305953808 306609383
3510.3 306609383 307875061 308859100 309785480 310763683 311420841 312246323 313343620 314665565 315582085
3519 315582085 316144142 316893101 318478680 320183487 321149864 322026749 322675095 324400711 326138191
3527.7 326138191 327084694 328164482 329226799 330555267 331615906 332782059 333426971 334549675 335821152
3536.4 335821152 336430359 338492126 340258598 341624870 342640533 343454475 344541588 345521545 347012787
3545 347012787 348423805 350390663 351627998 353167076 354459267 355681496 358142548 358412857 359616470
3553.7 359616470 361290665 363111000 365412025 366169243 367893219 369746704 371750107 372927780
3561.4 372927780 374431343 376286163 376768875 379665375 381101189 382359276 383832130 384067612 387701302
3570.1 387701302 390225296 391362534 392797966 395145149 397273178 398898201 400948067 402345924
3577.8 402345924 404851418 406567192 407628593 409618797 412086372 414289360 415562897 419074860
3585.5 419074860 420562248 419988747 422807159 424360161 427674103 430608940 433528671 435482025
3593.2 435482025 436218224 439605179 440450630 442582741 445742493 446752510 449846611 451383743 452638588
3601.9 452638588 455933914 458191986 459975243 462918701 466622162 467991829 471210213 471151695 470760918
3610.6 470760918 477304382 479639244 480298729 484988403 485051918 488870544 493221016 494631653 497228546
3619.3 497228546 497529449 499214363 502909813 506354675 509066353 512310524 514859200 517491112
3627 517491112 523947067 524643364 518502808 522538719 527630844 533742599 536269035 535988655 538663750
3635.7 538663750 542336731 545706711 547124977 548963432 552061157 555512810 558126068 559743233
3643.4 559743233 562241898 566014023 571546593 571771698 571788826 578686028 578851776 577106857 578076401
3652.1 578076401 583133736 587183342 591446686 597359276 592004471 594025574 599249763 600953827
3659.8 600953827 603207207 604731369 607565804 609613914 611382484 613580933 615497284 620145416
3667.5 620145416 622267570 622346725 624422684 619563103 621454582 629294434 638593864 637733994 621148186
3676.2 621148186 625253983 632952995 637843361 636595993 636691513 638607330 640631638 643086929 644076614
3684.9 644076614 644802551 648791962 655145874 647483978 644109497 651809235 646743011 646891861 652046585
3693.5 652046585 653594513 656183167 656574326 656073303 657807236 659037704 661969452 664784088 659939728
3702.2 659939728 658090057 661939621 662634201 663347015 664940567 667352448 671068420 665308914 668666458
3710.9 668666458 671811218 657723846 662225876 667584152 668929214 670082855 672334442 673576126
3718.6 673576126 670460358 671696472 677656937 675190659 670017471 674123993 675466690 675100327
3726.3 675100327 673118668 673266220 676606598 678047256 684428940 683128204 675064087 683175659
3734 683175659 684206161 673599701 673024750 676062851 677070312 679630737 682774582 679028702 682065048
3742.7 682065048 692709503 681855011 668131866 677807693 683070908 687856293 683709183 675221329
3750.4 675221329 685970612 679381485 673993759 680886841 684834213 687036285 681851883 684446564
3758.2 684446564 690719757 683455505 681249390 685155792 686616592 687129288 690615692 688150024
3765.9 688150024 683465652 686657333 691930008 693705368 684817352 685079956 687634583 687851639 689153519
3774.5 689153519 689118347 690050583 690840759 693681641 693477402 684913559 687415619 690530319 691487579
3783.2 691487579 693471451 691198883 690187988 691069031 691841125 692575531 691791916 691719742 691967926
3791.9 691967926 691981049 691888809 693314896 696303024 693467026 690120621 692196503 696053848 701225204
3800.6 701225204 694704590 684901123 688415833 691612167 696311188 701410522 693248062 688423157
3808.3 688423157 691922455 693843918 694469910 695111160 695112076 696631699 702489243 700947189 687094955
3817 687094955 691414261 696781158 701442184 703486557 686217346 687460556 692358856 694585648
3824.7 694585648 697818832 697798080 694039154 694742966 696093140 699118118 700924454 692378235 695184174
3833.4 695184174 702279129 696320724 695809021 702992477 694059677 690557404 698598785 693606491
3841.1 693606491 692873764 699375305 697913284 694142761 695893021 697015991 696939087 698764343 698740692
3849.8 698740692 700585785 706203613 699961166 699653931 689067535 688311462 696654129 695763626 693913422
3858.4 693913422 696131516 699020081 701803284 696820297 697084503 704025726 698005981 690895157
3866.2 690895157 694060364 699281082 705631943 698747406 690224380 693828812 699582291 703331985
3873.9 703331985 694427948 694486542 697821884 697679291 699371643 703610153 699582214 691948929 697306595
3882.6 697306595 698718185 699794159 704801254 692908249 692724228 696150360 697856979 702666626
3890.3 702666626 702036285 694454041 695036621 697634811 696078491 697007904 698941650 701341171 701867523
3898.9 701867523 692903976 697505722 699053116 694669800 699426041 697260056 696215363 696234970 695980072
3907.6 695980072 697721252 698268738 698376389 697926254 698004837 697677460 697396393 698913345 700710754
3916.3 700710754 697181091 694436722 699018173 698772049 695230560 697202835 698663940 699692154
3924 699692154 697969818 695351486 695991974 697212982 699264832 698522263 696892471 697662354 695422440
3932.7 695422440 694818420 696604385 696484604 696869888 697755890 697624512 697138672 696990891 699177322
3941.4 699177322 700327225 695780029 695074844 696505737 697061996 698169403 696314774 697136459 697730484
3950.1 697730484 694885178 696557388 697661972 696696091 696630096 697030945 697165756 696556168 696991577
3958.7 696991577 696876755 696979980 696902008 695772934 696289520 696670609 696781540 697523041 697687531 697231293
3968.4 697231293 696560745 695981140 696679535 697212219 696427231 696514359 696797943 696510468 695897675 696166992
3978 696166992 696648178 695781250 695957260 697042236 697188644 696565323 696353149 696279297 696439133 696858902
3987.7 696858902 696769409 697194672 696738205 696640854 697254181 697000504 697460480 697538910 697256775 696943359
3997.3 696943359 696754608 696493835 696187439
4000.2 696187439
##END=$$ End of the data block
