##TITLE=$$ Begin of the data block
##JCAMP-DX=5.00 $$ ACD/SpecManager v 10.08
##SPECTROMETER/DATA SYSTEM=Varian
##DATE=08 Jan 2013 16:21:04
##DATA TYPE=INFRARED SPECTRUM
##DATA CLASS=XYDATA
##ORIGIN=
##OWNER=
##NPOINTS=3735
##FIRSTX=399.26403809
##LASTX=4000.35498047
##MAXX=4000.35498047
##MINX=399.26403809
##MAXY=74.39492035
##MINY=24.97788811
##XFACTOR=1.0000000000
##YFACTOR=0.000000100000000
##FIRSTY=46.44607925
##DELTAX=0.96440572
##XUNITS=1/CM
##YUNITS=TRANSMITTANCE
##XYDATA=(X++(Y..Y))
399.3D64460793J2943687m413300n743751j517296n464020r568062K296486J735001
407D54729538K131691P495003L082847L195038o024437o070633j735801j860543N261460
415.7D60204163Q25042o035537o480713K03438K060585Q58306j036796q89549L539619
424.3D53248558M952240K868118j344528k125854m823838n830536j17378K858315N762825
433D55447922O298828j936379o644554j330414J629372p72209J81656L946686M361953
441.7D61182861j327057k12516j008377l392067j487389k426109J710014L792763L630638
450.4D60462761J63956p454758r02214K220802k580108l802109p105904J050339J0096817
459.1D52149582K357330m118728j934166L645706J841469j895714k538796q76960j184502
$$ y = [464460793, 477404480, 472991180, 467247429, 465730133, 460266113, 450698051, 452994537, 454729538, 456861229, 464356232, 467439079, 470634117, 464609680, 458539047, 456803246, 454942703, 460204163, 461029205, 454993668, 448512955, 448716393, 450776978, 451635284, 450598488, 449708939, 453248558, 458200798, 461068916, 459724388, 457598534, 452774696, 446944160, 446826782, 449685097, 455447922, 461746750, 459810371, 453165817, 451835403, 453464775, 452692566, 452874222, 456820908, 461182861, 459855804, 459643288, 458634911, 455242844, 453755455, 451329346, 453039360, 456832123, 460462761, 460626717, 453171959, 452269745, 454490547, 451910439, 448108330, 441002426, 442052765, 452149582, 454506912, 450388184, 448454018, 452099724, 453941193, 452045479, 449506683, 448629723, 447445221]
467.7D47445221J32484R07288n1079J655464L228760q59489l055420J041221o29272
476.4D49815178m752808n74836j941719j915284J460953J560211Q31185l738861j555939
485.1D39188080J273575j20392J069603o08597m010963n79987K577133n25474J583137
493.8D39846115p46307k136765J980057j47591J507073L42941K23084J226120p413140
502.5D34681587l360290J576919J141129J031112R62716m99535k518959J200867J255989
511.1D35471535k894516k363701J60484J309128K46773j379013k63253J130600m089965
519.8D27328072l144570J792412O4659O54259K622566J517601r98344k492638k576942
528.5D24767075n25742O37970j91574n76325j206626O22520J959839K093963k41432
$$ y = [447445221, 447577705, 448484993, 448433914, 450089378, 453318138, 452458649, 449403229, 450444450, 449815178, 445062370, 444487534, 442545815, 440630531, 442091484, 443651695, 444482880, 440744019, 439188080, 440461655, 440341263, 441410866, 440802269, 436791306, 436211319, 438788452, 438262978, 439846115, 439099808, 436963043, 438943100, 438795509, 440302582, 440645523, 440868607, 442094727, 434681587, 431321297, 432898216, 434039345, 435070457, 436033173, 435533638, 433014679, 434215546, 435471535, 432577019, 430213318, 430373802, 431682930, 431929703, 430550690, 430287437, 431418037, 427328072, 424183502, 425975914, 426040573, 426694832, 429317398, 430834999, 429836655, 427344017, 424767075, 424241333, 424879303, 424687729, 424111404, 422904778, 423527298, 425487137, 427581100, 427339668]
537.2D27339668m113693j898613J563988M21181n20821O07071n60379p03125m78249
545.9D21657028j288566n72205j729736j33057j40114j060066L42484j016617J74522
554.5D16233673M12407k14958K01378l49350j717873j555824J352005M17862L06129
563.2D15085449j9111l66974N70259r21669K76375P51457O83822j035232j150589J375618
572.9D15249405j666184j057510K025986Q27942m2878J0758j126595j459961R33152
581.5D13694115O19011m54140M61082J082459M33311m28009k19536M55323M85840j81046
591.2D15948410N40657J290932J09062j095047M63066R75838j081162j73607N21546
599.9D17499695J15890l78952l43628J131363j09214r68552j219635j621628M22363
$$ y = [427339668, 423225975, 421327362, 422891350, 423312531, 422791710, 423398781, 422838402, 422135277, 421657028, 420368462, 419796257, 418066521, 417933464, 417793350, 416733284, 417075768, 416059151, 416233673, 416646080, 416431122, 416632500, 416283150, 414565277, 413009453, 414361458, 414779320, 415085449, 415066338, 414699364, 415269623, 414347954, 414624329, 415375786, 416059608, 415024376, 413873787, 415249405, 413583221, 412525711, 414551697, 415379639, 415336761, 415347519, 414220924, 412760963, 413694115, 414313126, 413858986, 414320068, 415402527, 415835838, 415407829, 415188293, 415643616, 416129456, 415948410, 416489067, 417779999, 417889061, 416794014, 417257080, 418232918, 417151756, 416978149, 417499695, 417615585, 417236633, 416893005, 418024368, 417915154, 416946602, 415726967, 414105339, 414527702]
608.5D14527702J279068l14598j756248j239510L46451R31168k37542n11093l28407
617.2D12696991p27577K70576J241417J045342m32701Q6021Q44841P03697J647148
625.9D17375755N93796J81847J736450K584152J854515J227226K94762j99013J866799
634.6D27516289J757774J003189K116432K016602M23508n90210R42001J766586J221428
643.3D38173599J220169J284104J545944N93948k98614N27305R56307J376877J962318
651.9D47341957J667595N48592m42238R1133N71327K2163r47990o09550K02369k5367
661.6D48419991Q52203J339264Q2550o72531J16729J831627K7733j460647Q97369N17960
671.2D51952248R31015K071037J291618k43187k72445J275673K317009J248893Q51326
$$ y = [414527702, 415806770, 415492172, 413735924, 412496414, 412842865, 413774033, 413536491, 413025398, 412696991, 411969414, 412239990, 413481407, 414526749, 414094048, 414180069, 415024910, 415728607, 417375755, 417969551, 418151398, 419887848, 422472000, 424326515, 425553741, 425848503, 425649490, 427516289, 429274063, 430277252, 432393684, 434410286, 434833794, 434243584, 435185585, 436952171, 438173599, 439393768, 440677872, 442223816, 442817764, 442519150, 443046455, 444002762, 445379639, 447341957, 449009552, 449558144, 449115906, 449207039, 449778366, 449800529, 448852539, 448242989, 448445358, 448419991, 449272194, 450611458, 450694008, 450021477, 450138206, 451969833, 451997566, 450536919, 451434288, 451952248, 452883263, 454954300, 456245918, 456002731, 455730286, 457005959, 459322968, 460571861, 461423187]
679.9D61423187J378784P88727L98827Q41636J714287J353798K22321M12521J222572
688.6D69756660R10569l03650J36108J023712Q62961P34329L83759Q69675J580352
697.3D75954475K96059o53076L78990J571655J792832R41238J12038k86904k75955
705.9D79831352J24245J118660K162170J338768Q60901J085434M76952L62320Q99849
714.6D88260651P76405j12991Q73527J254578P38144J279373N11093M97322M84238
723.3D94562340K13623M89502P46918J008987N48286J580086J947403O13403J92109
732E01902657J41944N33600J096230N33447n2872Q74405J057473Q55903Q46634M8180
741.6E07837601l63121M92477J130905M93431J664811J419525l12844K66533K87667
$$ y = [461423187, 462801971, 463590698, 463989525, 464831161, 466545448, 467899246, 468121567, 468534088, 469756660, 470667229, 470363579, 470499687, 471523399, 472386360, 473120689, 473504448, 474374123, 475954475, 476250534, 475597458, 475976448, 477548103, 479340935, 480282173, 480394211, 480107307, 479831352, 479955597, 481074257, 483236427, 484575195, 485436096, 486521530, 486998482, 487360802, 488260651, 489037056, 488924065, 489797592, 491052170, 491790314, 493069687, 493580780, 494078102, 494562340, 494775963, 495265465, 496012383, 497021370, 497569656, 499149742, 501097145, 501710548, 501902657, 502044601, 502578201, 503674431, 504207878, 504155006, 505029411, 506086884, 506942787, 507789421, 507837601, 507474480, 507966957, 509097862, 509591293, 511256104, 512675629, 512362785, 512629318, 512916985]
750.3E12916985R574M98391J575050R03931M92706J380997O76040O88553P86400J279068
760E21207695J560631Q31032K62565M29688J245727P75566O81420N64804O23398J32522
769.6E28315048k32010N02968m76074m72260O11916J740227N91354j182213n54466
778.3E28844490J65024J285934J85891n55344M97818J088714M25530p60155Q30307
787E32008209J183548O20880Q2817o04934N21087N90554L95317Q36220K6588j136856
796.6E34523430p78160j164284j243095m37889l99209p30247j925354j349754j252747
805.3E25242691k175293k259254j788216j013756j157684q75549o99730m25034j864204
814E12983971l303681k116089r57451l39622k32735O71959J65444o6071L20511K97241
$$ y = [512916985, 512926559, 513424950, 515000000, 515903931, 516396637, 517777634, 518453674, 519142227, 519928627, 521207695, 522768326, 523599358, 523861923, 524291611, 525537338, 526312904, 526994324, 527559128, 528182526, 528315048, 528083038, 528586006, 528109932, 527637672, 528249588, 529989815, 530581169, 529398956, 528844490, 529009514, 530295448, 530481339, 529925995, 530423813, 531512527, 531938057, 531177902, 532008209, 533191757, 533812637, 533895454, 533290520, 533811607, 534402161, 534797478, 535633698, 535660286, 534523430, 533745270, 532580986, 531337891, 530900002, 530500793, 529770546, 527845192, 526495438, 525242691, 523067398, 520808144, 519019928, 518006172, 516848488, 515972939, 515273209, 514848175, 512983971, 509680290, 507564201, 506606750, 506267128, 506034393, 506706352, 506871796, 506805725, 507126236, 507423477]
823.6E07423477J994057J718597J813813K596244L230477K710762J361580L438224
831.3E26287231L287201J900940J987038L412666L063927J369133K605171J245156
839E45158463J670875K757607K037544J665001P99865J840439J493454Q94509L28521
847.7E58646278J298752K183304J195107J494140J688309K095070R63859Q69522N41802
856.4E70976143J690941L345604J469955J583672L03688R64088J314736q06351j93253
865.1E80649223K18621M05540J29471N65376j285171k185479r72900j043854o68373
873.8E75812454j312446p77512m31633j72653o30875r17320l23486j008759j150474
882.4E69087296k085419o61736Q2169l49045J45416o63299p72972j021920n83572p68051
$$ y = [507423477, 509417534, 511136131, 512949944, 515546188, 518776665, 521487427, 522849007, 526287231, 529574432, 531475372, 533462410, 536875076, 539939003, 541308136, 543913307, 545158463, 546829338, 549586945, 551624489, 553289490, 554089355, 555929794, 557423248, 558317757, 558646278, 559945030, 562128334, 563323441, 564817581, 566505890, 568600960, 569564819, 570434341, 570976143, 572667084, 576012688, 577482643, 579066315, 579370003, 580334091, 581648827, 580842476, 580649223, 580867844, 581273384, 581402855, 581968231, 580683060, 578497581, 577524681, 576480827, 575812454, 574500008, 573722496, 573290863, 573118210, 572487335, 571570015, 571246529, 570237770, 569087296, 567001877, 566340141, 566422310, 566073265, 566218681, 565555382, 564782410, 563760490, 563176918, 562408867]
892.1E62408867K19498N36117j28403M54522m25377K88810l57437j22223K93503r94186
901.7E62173691k76871k50854J069526J826020J755714J668167J686478J803589P49778
910.4E72205238K93694o35338J10741l94097j673393k093353j829338p51305j644249
919.1E63588600j683235l039818l223152k835579l435745l123131l119583j404991
926.8E41723366k670937l329887k412262l128166k593499k491073j783676j066437
934.5E22247429l95432n48439r20410j063232j700745m35905n53933j050796j158638
943.2E14419899o24390N98755n30090q93021n20477o02226o75507j87492N22537L34473
952.8E11842461l03650j193848j749611k282677k150306k342186k118378j595764j752853
$$ y = [562408867, 562628365, 563164482, 563036079, 563490601, 563065224, 563354034, 562996597, 562874374, 563167877, 562173691, 561896820, 561645966, 562715492, 564541512, 566297226, 567965393, 569651871, 571455460, 572205238, 572498932, 571863594, 571974335, 571580238, 569906845, 567813492, 565984154, 565232849, 563588600, 561905365, 558865547, 555642395, 552806816, 549371071, 546247940, 543128357, 541723366, 539052429, 535722542, 533310280, 530182114, 527588615, 525097542, 523313866, 522247429, 521851997, 521303558, 520383148, 519319916, 517619171, 517183266, 516629333, 515578537, 514419899, 513795509, 514394264, 513864174, 512971153, 512450676, 511848450, 511172943, 510985451, 511507988, 511842461, 511538811, 510344963, 508595352, 506312675, 504162369, 501820183, 499701805, 498106041, 496353188]
961.5D96353188j577301j898079j672821k316895k819748k136116k178688j773567
969.2D79979973j791344k229500k204628k283744l139115l454704k947426l248711
976.9D58680801l637886l823814l603859l670731m724197n299835m649048m267693
984.7D25003738m533805m748612m719620m636116m384613l923912m169731m399948
992.4C89487381m323387l499794l649292l994141k895927k710724k920723l291397
1000.1C62201996k742996k608605k142067j581001k186928j511421j900330j564941
1007.8C45963707j045685r95521j317330k468834j808700j484375j315651k112046
1015.5C33415565k536506k080803j572914j630898l355140k673054k031403j658764
$$ y = [496353188, 494775887, 492877808, 491204987, 488888092, 486068344, 483932228, 481753540, 479979973, 478188629, 475959129, 473754501, 471470757, 468331642, 464876938, 461929512, 458680801, 455042915, 451219101, 447615242, 443944511, 439220314, 433920479, 429271431, 425003738, 420469933, 415721321, 411001701, 406365585, 401980972, 398057060, 393887329, 389487381, 385163994, 381664200, 378014908, 374020767, 371124840, 368414116, 365493393, 362201996, 359459000, 356850395, 354708328, 353127327, 350940399, 349428978, 347528648, 345963707, 344918022, 343922501, 342605171, 340136337, 338327637, 336843262, 335527611, 333415565, 330879059, 328798256, 327225342, 325594444, 322239304, 319566250, 317534847, 315876083]
1023.2C15876083j844711k318134j969090j856842j256332k097645j099892j417541
1031C02015896j473198m36344j192589j08318P5645Q57735L85666P70034J478062Q15640
1040.6C03188229J428356N02624P68051j19419k1000K11506o89392m88682j647319
1049.3C03132954l44906m31690j188279j092605j204815l93067L5058k01359j727238
1058B96584053l37601O85349J328239J632843J678295K808800K177010K249050J416645
1066.6C10222683K303009J996212Q84762J030941O84891J610164K62413P85809L09105
1075.3C20089989L7765J716500J503753J518250m38423l46032K27776J467171J558838
1084C27335587R75914K534980R83048J515846R54208P43981K267494K140808K330475
$$ y = [315876083, 314031372, 311713238, 309744148, 307887306, 306630974, 304533329, 303433437, 302015896, 300542698, 300106354, 298913765, 298805447, 298881092, 299738827, 300124493, 300894527, 302372589, 303188229, 304616585, 305119209, 305887260, 305767841, 305746841, 305958347, 305268955, 304780273, 303132954, 302788048, 302356358, 301168079, 300075474, 298870659, 298477592, 298512650, 298311291, 296584053, 296246452, 296931801, 298260040, 299892883, 301571178, 304379978, 306556988, 308806038, 310222683, 312525692, 314521904, 315406666, 316437607, 317122498, 318732662, 318995075, 319780884, 320089989, 320127754, 321844254, 323348007, 324866257, 324427834, 324081802, 324309578, 325776749, 327335587, 328311501, 330846481, 331829529, 333345375, 334299583, 335043564, 337311058, 339451866, 341782341]
1092.7C41782341P08885P40204Q07495J226578J977043J703148J611290Q88367J503219
1101.4C52948570J407891J202468J213799J490784J395721P07893P27883L97682J325111
1110C62817802J399308Q70781P77549J005669O02531j00021O05812n50957j90544J412468
1119.7C68650398R85184p32193j045151N54085l37181K01454R54971L45230J220627
1128.4C70797424K341767K537536J328545J518860J765251J685486J654167K000503
1136.1C85629539K458840K236595K607498J827965J534958J214981N11017J016922
1143.8C99038315J166229L68424K99186J558914Q15239q4152l72772o39801K10571
1152.5D02360153l01895l89824j05972m33808k34985m19464p49664q43582q14667m02641
$$ y = [341782341, 342491226, 343231430, 344038925, 345265503, 347242546, 348945694, 350556984, 351445351, 352948570, 354356461, 355558929, 356772728, 358263512, 359659233, 360367126, 361095009, 361492691, 362817802, 364217110, 365087891, 365865440, 366871109, 367473640, 367373619, 367979431, 367428474, 367237930, 368650398, 369635582, 368903389, 367858238, 368412323, 368075142, 368276596, 369231567, 369576797, 370797424, 373139191, 375676727, 377005272, 378524132, 380289383, 381974869, 383629036, 385629539, 388088379, 390324974, 392932472, 394760437, 396295395, 397510376, 398021393, 399038315, 400204544, 400572968, 400872154, 402431068, 403246307, 403162155, 402789383, 402149582, 402360153, 402058258, 401668434, 401562462, 401128654, 400893669, 400474205, 399724541, 398880959, 398066292, 397663651]
1162.1C97663651L66706K58294R65690J589890J472473K061996J811600K233086K440300
1170.8D10863686K333145K521629K986069L102760K681008K726020K099724K515793
1178.5D31829834K354698J976662K534180K286415K186889J880684J552353J051521
1186.2D47653236N68962R27811J277237N27878K08778K55127j60331J4266p36579r94873
1195.9D49541512m17366n83954o61774q50830n19905o15044j224937j107483q25615
1204.5D42734604n25971p79647m94309J20545k16637m52576k61001j06430j21918O9580
1214.2D39966240k33498o17675n52636k22168K41166j679K15149J7204o99959l19862
1223.8D37792282j82114m37622o49337n05333m28238q80089p75032n60494n02395l26958
$$ y = [397663651, 398030357, 398288651, 399254341, 400844231, 402316704, 404378700, 406190300, 408423386, 410863686, 413196831, 415718460, 418704529, 421807289, 424488297, 427214317, 429314041, 431829834, 434184532, 436161194, 438695374, 440981789, 443168678, 445049362, 446601715, 447653236, 448222198, 449150009, 450427246, 450955124, 451163902, 451419029, 451258698, 451272964, 450536385, 449541512, 449124146, 448540192, 447878418, 447027588, 446507683, 445892639, 444667702, 443560219, 442734604, 442208633, 441428986, 440934677, 441055222, 440838585, 440386009, 440125008, 440018578, 439896660, 439966240, 439732742, 439115067, 438562431, 438340263, 438581429, 438579750, 438794899, 438812103, 438112144, 437792282, 437610168, 437172546, 436523209, 436017876, 435589638, 434709549, 433934517, 433374023, 432871628, 432544670]
1233.5D32544670n15175q97903p09992m15420l38898k06871j75934j01852j38664j50261
1243.1D28893700o36101q07800l76893k76756l08838p69462k73972Q2970l64800k38266
1252.8D24923782l22418M5509J66245j81160j44958J47018L17116l3798p821O9962
1262.4D24979477J47629P24792Q00362J83525R6931N67360J142083J006431P47833
1271.1D30396423J395684J080207N43442N64804J198998J550026R80797J056442J106758
1279.8D39873581J187096J156692J159058J194229J254349J567535J232643J482582
1287.5D50107765J744118J335602R28650O10809O50787J105996J229782Q75969P51266
1296.2D59340744N99136O74591N03464N31159J77574j02654N14336J12877j97296j31264
$$ y = [432544670, 432029495, 431131592, 430421600, 430006180, 429667282, 429460411, 429284477, 429182625, 429043961, 428893700, 428257599, 427449799, 427072906, 426796150, 426487312, 425717850, 425443878, 425526848, 425162048, 424923782, 424601364, 424646873, 424813118, 424631958, 424487000, 424634018, 424951134, 424917336, 424909515, 424979477, 425127106, 425851898, 426652260, 426835785, 426932716, 427500076, 428642159, 429648590, 430396423, 431792107, 432872314, 433415756, 433980560, 435179558, 436729584, 437710381, 438766823, 439873581, 441060677, 442217369, 443376427, 444570656, 445825005, 447392540, 448625183, 450107765, 451851883, 453187485, 454116135, 454726944, 455377731, 456483727, 457713509, 458589478, 459340744, 459939880, 460614471, 461117935, 461649094, 461826668, 461724014, 462238350, 462351227, 462153931, 462022667]
1305.8D62022667m883j06087l93486m62570m21562j15128n08575l76816q6746j77002
1315.4D59369812k03705j10397N41496N86434P43026Q02574R21250R09729O37550O98548
1325.1D64896317L54042M35752J5793K2354J17722o6986J00670o44226p58019o65054
1334.7D63808365k49672P5111N4856N39283K73705J25122R6893L96309K72751M20113
1344.4D65812836R36317Q31223R60464K45285K04354J33399l51486m78821k95753J17683
1354D68115501m05502j40381k9945k64893n85403p24106q84476p95517J91574l51638
1363.7D64125214k1172k98347o15578l51029r06829p18537q54988o0768L22571J7662
1373.3D60638199j43662j06849N37986l54843l68995m58298k37732j1215l69911o75621
$$ y = [462022667, 462017784, 461911697, 461518211, 461055641, 460634079, 460518951, 460010376, 459633560, 459546814, 459369812, 459166107, 459055710, 459597206, 460183640, 460926666, 461729240, 462650490, 463560219, 464197769, 464896317, 465250359, 465686111, 465701904, 465724258, 465841980, 465774994, 465875664, 465231438, 464473419, 463808365, 463558693, 463633804, 463688660, 464227943, 464501648, 464626770, 464723663, 465119972, 465392723, 465812836, 466749153, 467580376, 468540840, 468786125, 468990479, 469123878, 468772392, 468293571, 467997818, 468115501, 467709999, 467569618, 467539673, 467274780, 466689377, 465965271, 465080795, 464285278, 464476852, 464125214, 464104042, 463805695, 463190117, 462839088, 461932259, 461213722, 460358734, 460297966, 460620537, 460638199, 460494537, 460387688, 460925674, 460570831, 460201836, 459743538, 459505806, 459494591, 459124680, 458449059]
1382.9D58449059j492196r72137j395302j601753j928864j073303l4218j078872j249848
1391.6D47622566j645317j937485l319397l294067j088104j507340j239662l128700
1399.3D30462494k018395p95517k591095k447662j767349k659912k193871j235199
1407.1D14753494j632118j782074j470070j287002r74541j662483j443596q67691o53267
1415.7D02980652j35002o96678m12407j886826j67198R92317J61820P21702j34697
1424.4D01423683P94602J370697O38733J048164N72357N04189O46782J654052J825638
1433.1D10478897J466446J639366J314850J310692P28454K033692J315651J349716
1440.8D21637764J688309J026344J625175Q73566J166268J127128J310883P77397N50651
$$ y = [458449059, 456956863, 455984726, 454589424, 452987671, 451058807, 449985504, 449951286, 448872414, 447622566, 445977249, 444039764, 440720367, 437426300, 436338196, 434830856, 433591194, 430462494, 428444099, 427648582, 425057487, 422609825, 420842476, 418182564, 415988693, 414753494, 413121376, 411339302, 409869232, 408582230, 407607689, 405945206, 404501610, 403633919, 402980652, 402845650, 402148972, 401736565, 399849739, 399682541, 400674858, 400836678, 401558380, 401423683, 402218285, 403588982, 404227715, 405275879, 405848236, 406352425, 406999207, 408653259, 410478897, 411945343, 413584709, 414899559, 416210251, 416938705, 418972397, 420288048, 421637764, 423326073, 424352417, 425977592, 426851158, 428017426, 429144554, 430455437, 431232834, 431783485]
1449.5D31783485J681977J309242J618919O84548J602554K282295J340218Q09517K51427
1458.2D43364182L127174Q28972K074432J624680J247978K451630R79805K204322J774521
1466.8D59677696K343598K314682K174186K973481K507782L083190J235886K599831
1474.6D78910332K739143K064972K285576K403259K472763J995964J637497J268845
1482.3D95778351J859207K092667J544571J484260J268158Q34618J391792n760j646080
1491E04601784r1057K09579l31306o44417j029320m886512J72653r49326l481788n18303
1500.6D93051987j195031j328735r13086Q20618J168671l088608n194016n1346J544152
1509.3D84814606r40666R0560j085090j511307R5139r70726p30668k323188j801529
$$ y = [431783485, 433465462, 434774704, 436393623, 437078171, 438680725, 440963020, 442303238, 443112755, 443364182, 446491356, 447320328, 449394760, 451019440, 452267418, 454719048, 455698853, 457903175, 459677696, 462021294, 464335976, 466510162, 469483643, 471991425, 475074615, 476310501, 478910332, 481649475, 483714447, 486000023, 488403282, 490876045, 492872009, 494509506, 495778351, 497637558, 499730225, 501274796, 502759056, 504027214, 504861832, 506253624, 506247864, 504601784, 504510727, 504720306, 504389000, 503744583, 502715263, 497828751, 498001404, 497052078, 493570290, 493051987, 491856956, 490528221, 489615135, 490435753, 491604424, 488515816, 483321800, 483270454, 484814606, 483873940, 483964500, 482879410, 481368103, 481463242, 480492516, 479761848, 477438660, 475637131]
1518D75637131J503525J864624n86548k015763J127930M19464J557808n8975N94940
1526.6D80044136J298943O43196J739540J469612J329536J476403R83009j485481J293602
1535.3D88792496J303215Q05435J781540k390518k748795L227387J119918L11089K158775
1544D94360542J860428k11906J593170O10390R06105P06977o03446P00263L50228Q42972
1553.6E01115723j991120N75295J774940Q17108j845321n760460J92833n56297R01451
1562.3D95224152j036263j320991k583275k579422j163788k113495j98021p963142
1570D76265755k910614j849594l285790k708931k971535o94236j2214814k282524k968712
1578.7D44379005m079132m041824n320702l233871n857544m193268n486908m268608
$$ y = [475637131, 477140656, 479005280, 478418732, 476402969, 477530899, 477950363, 479508171, 479449196, 480044136, 481343079, 481986275, 483725815, 485195427, 486524963, 488001366, 488984375, 487498894, 488792496, 490095711, 490901146, 492682686, 490292168, 487543373, 490770760, 491890678, 492201767, 494360542, 496220970, 496009064, 497602234, 498212624, 499118729, 499825706, 499222260, 499922523, 500272751, 501115723, 499124603, 499699898, 501474838, 502291946, 500446625, 494686165, 494878998, 494322701, 495224152, 494187889, 492866898, 490283623, 487704201, 486540413, 484426918, 484228897, 476265755, 473355141, 471505547, 468219757, 465510826, 462539291, 461845055, 449630241, 447347717, 444379005, 440299873, 436258049, 430937347, 427703476, 421845932, 417652664, 412165756, 407897148]
1586.4D07897148m290809n450058l298836n794907l471184n705223l519401m147454
1594.1C72219276n293731l091431n295792k455444m802284k419396l896522l900948
1601.9C41063728k227935m425164j724281l937645j196098l255730j530952j391869
1609.6C21374054l380966k9335k802258K1572j905765J02978n10807n690785J766377
1618.2C08945065j339951J343155j425800P93266q05054j910839K085705o1436K206364
1626.9C09830475k144547J318779O05469Q16059J365299J99261K927513M7894K711468
1635.6C17677670j372509K744750J798058J298599K701683N52674L097343M54445K392921
1644.3C31345634K233925J44577K517243j214142M534111J377411L353271K229920
$$ y = [407897148, 403606339, 398156281, 394857445, 389062538, 385591354, 379886131, 376366730, 372219276, 366925545, 363834114, 358538322, 356082878, 351280594, 348861198, 344964676, 341063728, 338835793, 334410629, 332686348, 328748703, 327552605, 324296875, 322765923, 321374054, 317993088, 317963753, 315161495, 315183067, 313277302, 313380280, 312869473, 307178688, 308945065, 307605114, 308948269, 307522469, 308315735, 307510681, 305599842, 307685547, 307624111, 309830475, 307685928, 309004707, 309610176, 310426235, 311791534, 311990795, 314918308, 314966202, 317677670, 316305161, 319049911, 320847969, 322146568, 324848251, 325400925, 328498268, 328952713, 331345634, 333579559, 333724136, 336241379, 335027237, 339561348, 340938759, 344292030, 346521950]
1652C46521950j175881L80745J831M037628O80047K540969J247063J868858K370682
1660.7C58473892J837044L683701L62968L401337K243347K982101K820816K470742
1668.4C78275948L970413K233772N232964K177581M216729L960342L834801L572883
1676.1D07475433K924004M948654L608437M729919K899933M527893N550766J978188
1683.8D38643227L904914L308220O576844M634819M833717M835625L709182M831467
1691.5D75278015M496689N395622N318375M426498J007309O320915N853615N034600
1699.3E13131638M262924M42352O991463N476608M961166L111573K520713K630654
1707E43529091K670402L776093K902222K555542K736740K721634K558403O84967Q11424
$$ y = [346521950, 345346069, 345726814, 345728645, 349766273, 350446320, 352987289, 354234352, 356103210, 358473892, 360310936, 363994637, 364357605, 367758942, 370002289, 372984390, 375805206, 378275948, 382246361, 384480133, 389713097, 391890678, 396107407, 400067749, 403902550, 407475433, 410399437, 415348091, 418956528, 423686447, 426586380, 431114273, 436665039, 438643227, 442548141, 445856361, 452433205, 457068024, 461901741, 466737366, 470446548, 475278015, 479774704, 485170326, 490488701, 494915199, 495922508, 502243423, 508097038, 513131638, 517394562, 517836914, 524828377, 530304985, 535266151, 538377724, 540898437, 543529091, 546199493, 549975586, 552877808, 555433350, 558170090, 560891724, 563450127, 564135094, 564946518]
1715.6E64946518L379288J985664k938805L846703L564835K204055J676331J142006
1723.4E79806595N87997J331253J971169J559601J882515K329788K09770J64833L694687
1732E93538208L771858k598305l002395M835815M135781K588424L451386Q05359j465836
1740.7F06060295M095764L062401J137085K154121L826600L130569K435493K861329
1748.4F28763657J289978M417572J600151P28416M488678L194046L540573L290558
1756.2F51313629N70526J345749K820435K938843L603897L15933K29339L600159K354736
1764.8F69093246J703415J400681J726990p87430J979599M229202K9297j754761n03082
1773.5F77117157M162521K444916n00259K190323J058273J530762M36935o69098J309815
$$ y = [564946518, 568325806, 570311470, 567372665, 571219368, 574784203, 576988258, 578664589, 579806595, 580394592, 581725845, 583697014, 585256615, 587139130, 589468918, 589678688, 589843521, 593538208, 597310066, 594711761, 591709366, 596545181, 600680962, 603269386, 606720772, 607526131, 606060295, 610156059, 613218460, 614355545, 616509666, 620336266, 623466835, 625902328, 628763657, 630053635, 634471207, 636071358, 636799774, 641288452, 644482498, 648023071, 651313629, 651884155, 653229904, 656050339, 658989182, 662593079, 662909012, 663138351, 666738510, 669093246, 670796661, 672197342, 673924332, 673136902, 675116501, 679345703, 679375000, 677620239, 677117157, 681279678, 683724594, 683224335, 685414658, 686472931, 688003693, 688440628, 687771530, 689081345]
1782.2F89081345J942825J703567m12216M90113J649169J255799M38385J680221J390839
1790.9F99220047L84445j052246j201401L190232J489410K6932J153412J762924J182327
1799.5G06156082r20410J472931l19138O44226J578446L35693J159516N99289N44281
1808.2G11250916J111221J558990q98513J85699J313248K36435J029739L01590Q61282
1816.9G16950607o9122M61960J025390K9984Q32214j21612J722793J825180j930236
1825.6G20727158l61557J672210J944199K62604k766571M18624K390290L72543M21829
1834.3G25081329P73011N62133M35868r17359P03049J68533O93283R91211J753922
1842.9G30244980J456451n202789J558456J924744K41852k72827L83072J201629n1651
$$ y = [689081345, 691024170, 692727737, 692315521, 692805634, 694454803, 695710602, 696148987, 697829208, 699220047, 699604492, 698552246, 697350845, 700541077, 702030487, 702057419, 703210831, 704973755, 706156082, 705235672, 706708603, 706389465, 707033691, 708612137, 708947830, 710107346, 710706635, 711250916, 712362137, 713921127, 713022614, 713208313, 714521561, 714757996, 715787735, 716089325, 716950607, 716881485, 717343445, 718368835, 718398819, 719231033, 719109421, 720832214, 722657394, 720727158, 720365601, 722037811, 723982010, 724244614, 721478043, 721896667, 724286957, 724659500, 725081329, 725854340, 726416473, 726852341, 725934982, 726638031, 726806564, 727499847, 728491058, 730244980, 731701431, 726498642, 728057098, 729981842, 730223694, 729950867, 730333939, 731535568, 731483917]
1851.6G31483917O51856l34397K30179L94211N8060L74145n12085P08542L32718R49249
1861.3G34336395M44031q9722P4997q8882J134033j6861R24301m85153j600876O77033
1870.9G35309296P38296N11704l42560O74820J96457K68860K36969K7999Q10700K23694
1880.6G38656235K64969n90210L67508M9591l19977N77850j56250Q80661r2087j070175
1890.2G38568115L19596P33108K31247M41666N14755o24237O06842M1504K29111P3471
1899.8G41135178l07389M28238q9416O99920j91726j1597J90582n02166j27869m1809
1909.5G41181946M26712N5923Q00858k05918j80053K15225r0866J191940j195907n42069
1919.1G41657791P71561O74057O93741j035309n55725K76108M45938j10855K97393
$$ y = [731483917, 732135773, 731801376, 732031555, 732425766, 732483826, 732857971, 732345886, 733054428, 733387146, 734336395, 734780426, 734690704, 734765701, 734676819, 735810852, 735793991, 736718292, 736233139, 734632263, 735309296, 736047592, 736559296, 736216736, 736891556, 737088013, 737356873, 737593842, 737621841, 738432541, 738656235, 738921204, 738330994, 738698502, 738748093, 738428116, 739005966, 738849716, 739730377, 739638290, 738568115, 738887711, 739620819, 739852066, 740293732, 740808487, 740184250, 740791092, 740832596, 741061707, 741135178, 740827789, 741256027, 741166611, 741866531, 741674805, 741663208, 741853790, 741351624, 741223755, 741181946, 741608658, 741664581, 742465439, 742259521, 742079468, 742294693, 742203827, 743395767, 742199860, 741657791, 742429352, 743103409, 743797150, 742761841, 742206116, 742482224, 742928162, 742817307, 743114700]
1927.8G43114700L24021n2033J22833J2055N1041r14536J1520j5411j831O73065J88065
1938.4G43513489J09863n53589Q79440j30844j830215N36575P46765K53754l30200
1947.1G43195038L15933N8212k51388j97373l03650L7156J47628K84043k24686K46811
1956.7G43307724k39639l45536k15454m48074L79257o9198O08902L39889k03781k36206
1966.4G42877884o75659k3651j29929K07443j13678J72959Q9569j04676M22898k89383
1976G42433777j78757m16946n570J26496J08184K80381q4610J22223o67038k35291
1985.7G41482849R7046J28555p629k70996L48434l10516n10864j50376M31443j71051
1995.3G41066895m26026k2812l61786M35028P0572K17896l88870p37992L42636N4703
$$ y = [743114700, 743438721, 743386688, 743509521, 743521576, 743572617, 742658081, 742669601, 742654190, 742652359, 743325424, 743513489, 743623352, 743069763, 743949203, 743818359, 741988144, 742524719, 743271484, 743525238, 743195038, 743510971, 743569183, 743317795, 743120422, 742816772, 742853928, 743001556, 743285599, 743060913, 743307724, 743068085, 742722549, 742507095, 742059021, 742438278, 742369080, 742977982, 743317871, 743114090, 742877884, 742202225, 742178574, 742048645, 742256088, 742142410, 742315369, 742404938, 742300262, 742723160, 742433777, 742255020, 741838074, 741832504, 741959000, 742067184, 742347565, 742262955, 742385178, 741718140, 741482849, 741579895, 741708450, 741700821, 741429825, 741778259, 741467743, 740956879, 740806503, 741237946, 741066895, 740640869, 740618057, 740256271, 740691299, 740761871, 740979767, 740590897, 739852905, 740195541, 740250244]
2005G40250244l8681l60870J20468r9259m27246j39007J33362L45993k53220J00708
2014.6G39632492l41949k74887m45176k21862L62472j94931M32205m41437l05633j37634
2024.2G38063660m21295O3323m40826J15738P7896J93634j62887j52894M4632m33044
2033.9G36947937r0408l49655R8342l24020O943L54233j02005j08719o00891J61819
2043.5G35993576o10199l71170R1324j42059M45556j19858Q6518l06473q2855j49231
2053.2G34835129l25470P4310k4643M78668q2626J54266k76489l11584o3935l65448
2062.8G34092178L50952m71725K2507N37948p9269q55637m22516L64991l15628L97644
2072.5G33621445J26342K93046K43606k35290O0577l68042J14212l84750j99967j58462
$$ y = [740250244, 740211563, 739850693, 739971161, 739871902, 739444656, 739305649, 739439011, 739785004, 739531784, 739632492, 739290543, 739015656, 738570480, 738348618, 738711090, 738516159, 738948364, 738506927, 738201294, 738063660, 737642365, 737705688, 737264862, 737380600, 737458496, 737652130, 737489243, 737336349, 737380981, 736947937, 736857529, 736507874, 736606216, 736282196, 736289139, 736643372, 736541367, 736432648, 735831757, 735993576, 735383377, 735012207, 735103531, 734961472, 735407028, 735287170, 735373688, 735067215, 734984360, 734835129, 734509659, 734583969, 734559326, 735037994, 734955368, 735109634, 734833145, 734521561, 734457626, 734092178, 734443130, 733971405, 733993912, 734531860, 734452591, 733596954, 733174438, 733539429, 733223801, 733621445, 733747787, 734040833, 734284439, 734049149, 734109726, 733741684, 733855896, 733471146, 733271179, 733112717]
2082.1G33112717k30790K18125j76697l052l85437j46103j63650K48489J96610l63770
2091.7G32306442P4387j59302J67999l56674k23541l58429k83585M69437q4763K46964
2101.4G31798935n42679l91846J46637O8589j43433k76566N15137m50439j94855k88010
2111G30241470j24130N18875l38516q7128l36685N1041j78299l51258n6457j60751
2120.7G29178162L14941N2414J43509k51083j23520l39203N569M86221n03082r079
2130.3G28954849p629M60739O4774l45154p9727o57959J91574P3623K91138K59781
2140G29206009J34430K81525l28599k04162l99552K9755m0359M13131N90210O6452
2149.6G29748840R8038o12564k64435j67389J66016J58386M2496K86102k2812L05710
$$ y = [733112717, 732881927, 733100052, 732923355, 732920303, 732534866, 732388763, 732225113, 732473602, 732670212, 732306442, 732380829, 732221527, 732389526, 732032852, 731809311, 731450882, 731167297, 731636734, 731551971, 731798935, 731256256, 730864410, 731011047, 731079636, 730936203, 730659637, 731174774, 730724335, 730529480, 730241470, 730117340, 730636215, 730297699, 730210571, 729873886, 729924927, 729746628, 729395370, 729338913, 729178162, 729493103, 729545517, 729689026, 729437943, 729314423, 728975220, 728980789, 729467010, 728963928, 728954849, 728947220, 729407959, 729472733, 729127579, 729047852, 728389893, 728581467, 728655090, 728946228, 729206009, 729340439, 729621964, 729293365, 729089203, 728689651, 728719406, 728679047, 729092178, 729682388, 729748840, 729846878, 729234314, 728969879, 728802490, 728968506, 729126892, 729169388, 729455490, 729432678, 729738388]
2159.3G29738388l55148l33100k10800J18637L72391m9744M17862J94626J90125l69644
2168.9G29713593m27094k59628J38473Q30384M6463L07235J80207J06430k19117l39279
2178.5G30077667J09024m02908Q6594K66189L93219j42898l19138k15225j37863M41131
2188.2G30155792m85992K08740O66428L72543K43301j10778k20871o89927p0266j97907
2197.8G29871063N79834N22919j62277M98199j76849j21689k72446K1515O7673J94549
2207.5G31022491N39246j56784K20261l72544l52020r1019J65863K17667l43094K98233
2217.1G31148300J83945L62701l09524m07486J76544j12762J89132J41068M44717j44958
2226.8G31671677j82877j85318l71475K57492L1280J98060M4097K14463N3253l7918
$$ y = [729738388, 729383240, 729050140, 728839340, 728957977, 729330368, 729280624, 729698486, 729893112, 730083237, 729713593, 729286499, 729026871, 729165344, 729995728, 730042191, 730349426, 730529633, 730636063, 730416946, 730077667, 730186691, 729783783, 729870377, 730136566, 730529785, 730386887, 730067749, 729852524, 729714661, 730155792, 729669800, 729878540, 730544968, 730917511, 731160812, 731050034, 730829163, 730139236, 730068970, 729871063, 730450897, 730973816, 730811539, 731309738, 731132889, 731011200, 730738754, 730760269, 730827942, 731022491, 731561737, 731404953, 731625214, 731252670, 730900650, 730809631, 730975494, 731193161, 730850067, 731148300, 731332245, 731694946, 731385422, 730977936, 731154480, 731041718, 731230850, 731371918, 731816635, 731671677, 731488800, 731303482, 730932007, 731189499, 731220779, 731418839, 731462936, 731677399, 731730652, 731692734]
2236.4G31692734j20850l35541N1423l16468K14234j15281P7897L62625P1640L71551
2246G31953964n32455j79520o9427J23748L7995k0065L29513n15060j06888L662N89981
2256.7G31615448r6664p44706j6327o3095O64292k33002r5978J48545j55182L07235
2266.3G31330566O7444K83890j78833Q0261k06909l17078m03823l72773N66483p4921
2275.9G30774307M04511J68228j56784k46735n27649l25622m85382N82962J73111M24804
2285.6G30785751R1019o50940J45035j90735L78189l1967K05383L67584j39160j37100
2295.2G30823059l48434N60379o57883o59256J99585K72064P22809L53012K29645k17133
2304.9G31277847M78287j10397k98157J19171n94940L48740J15737P07016O85120J48544
$$ y = [731692734, 731571884, 731236343, 731287766, 730971298, 731185532, 731070251, 731148148, 731510773, 731582413, 731953964, 731421509, 731241989, 731172562, 731296310, 731334305, 731314240, 731643753, 731128693, 731021805, 731025467, 731615448, 731518784, 730774078, 730757751, 730694656, 731358948, 731125946, 731029968, 731178513, 731023331, 731330566, 731398010, 731681900, 731503067, 731583328, 731376419, 731059341, 730655518, 730282745, 730849228, 730774307, 731178818, 731347046, 731190262, 730943527, 730415878, 730090256, 729604874, 730187836, 730360947, 730785751, 730876770, 730225830, 730370865, 730180130, 730558319, 730526352, 730731735, 731099319, 730960159, 730823059, 730474625, 731035004, 730377121, 729717865, 729917450, 730189514, 730912323, 731265335, 731494980, 731277847, 731756134, 731645737, 731347580, 731466751, 730871811, 731220551, 731336288, 732043304, 732728424, 732876968]
2314.5G32876968K39258o86798k18277J25351Q70209J001739j30081r78775o4239N82199
2324.2G33617554j30692M36554K68784P13119N97382L13568l82004m28848O50635j302567
2333.8G34353485q13827M60968M29077K10495j22528J42822m9439J61515Q15048J32828
2343.4G35720444k138291o53152m43268j831512j355668r1018J739197P79419J148529
2352.1G32874680J528396J027527J438446p46460J394806j17722r59701j000824j88980
2360.8G35250168J538925j101685n12924k057724p06634n09339j381607j493759j355820
2369.5G27669601J564942j72196j000976j120072o03485j65710r54437q41294j388397
2378.2G22987976o73828q08411m82940n27878j041336k85263o43006l23410l09524
$$ y = [732876968, 733116226, 732429428, 732211151, 732336502, 733206711, 734208450, 734078369, 733099594, 733035355, 733617554, 733486862, 733923416, 734192200, 734905319, 735502701, 735816269, 735434265, 735005417, 735656052, 734353485, 733539658, 734000626, 734429703, 734640198, 734517670, 734660492, 734611053, 734772568, 735587616, 735720444, 733582153, 732929001, 732485733, 730654221, 729298553, 729207535, 730946732, 731726151, 732874680, 734403076, 735430603, 736869049, 736122589, 737517395, 737399673, 736439972, 735439148, 735250168, 736789093, 735687408, 735174484, 733116760, 732410126, 731900787, 730519180, 729025421, 727669601, 729234543, 729062347, 728061371, 726941299, 726337814, 726172104, 725217667, 724376373, 722987976, 722314148, 721505737, 721022797, 720494919, 719453583, 719168320, 718525314, 718201904, 717892380]
2386.8G17892380k60239j03531j80664N7450n52674l60565k16141K4185q0337l08991
2396.5G15910873j15661l97492l93676o21262q9188P8049k45666m59366l92227Q9416
2406.1G13363800o9199Q4153n07584n34744m0741o6986k26746m42428J08871k20871
2415.8G11447525j93405j88217l18375k32925q11081n07279q2168K4032m33120j24512
2425.4G08580475r0714n65872k95868o67114k21558k47726k60696k671k06756L7460
2435.1G06058960n4092k32163j012649o33622k26364l97415J24512N6381L5706k76413
2444.7G03442841o10657o89469q8424j84555n14298n1346l13186j89438n14298j47094
2454.3G00140076l64991j014556k02485k27661J70822j10397m86832l94668l19214
$$ y = [717892380, 717632141, 717528610, 717347946, 717405396, 716852722, 716492157, 716276016, 716300201, 716219864, 715910873, 715795212, 715397720, 715004044, 714382782, 714293594, 714371643, 714125977, 713666611, 713274384, 713363800, 713294601, 713378754, 712871170, 712336426, 712295685, 712228699, 712001953, 711559525, 711668396, 711447525, 711254120, 711065903, 710747528, 710514603, 709703522, 709196243, 709114075, 709138107, 708704987, 708580475, 708489761, 707923889, 707628021, 706960907, 706739349, 706491623, 706230927, 706228256, 706021500, 706058960, 706004868, 705772705, 704760056, 704126434, 703900070, 703502655, 703627167, 703683548, 703719254, 703442841, 702832184, 702142715, 702054291, 701869736, 701355438, 701304092, 700990906, 700801468, 700287170, 700140076, 699775085, 698760529, 698558044, 698330383, 698501205, 698390808, 697903976, 697509308, 697190094]
2463F97190094k78931q77304m09164n99365m36173Q698j38932j31988l55454j9073
2472.7F93952408n04837o85120m88663l24783j38931k77481k2354m21677o49261m37394
2482.3F90001907q2931n49240p38678k93122l93219P2480n00641o71387k98614k91443
2492F86255112j32447n76324n30624m65851m08249o11191m90570k57111k85263k58636
2501.6F82238846n55802q4762l67584m30756k81219n79682m63409n63813k69241n53436
2511.2F78089142k89002j30005m18090k91748n92118o44684p18154j00403j80817m56161
2520.9F74267960l26538m53568k89078l73306O4163k68249j67694k96555q41522m85382
2530.5F70830231p97196m18777l78571J55411K58102l89938l67737r52530n00259m39911
$$ y = [697190094, 696911163, 696033859, 695624695, 695025330, 694589157, 694597855, 694458923, 694326935, 693971481, 693952408, 693447571, 692762451, 692273788, 691949005, 691810074, 691532593, 691510239, 691088562, 690439301, 690001907, 689918976, 689369736, 688631058, 688337936, 687944717, 688017197, 687516556, 686845169, 686546555, 686255112, 686122665, 685546341, 685015717, 684549866, 684141617, 683530426, 683039856, 682782745, 682497482, 682238846, 681683044, 681598282, 681230698, 680799942, 680518723, 679939041, 679475632, 678911819, 678642578, 678089142, 677800140, 677670135, 677252045, 676960297, 676368179, 675723495, 675005341, 674904938, 674724121, 674267960, 673941422, 673487854, 673198776, 672825470, 672889633, 672621384, 672453690, 672157135, 671315613, 670830231, 670033035, 669614258, 669235687, 669391098, 669649200, 669259262, 668891525, 667938995, 667438736, 666998825]
2540.2F66998825m13742m52576l28750K41699l50723k25067l97034m63410m96139n38101
2549.8F63574982m61045o90307q5984K1134R5978l49350m42505m53873p53326k72370
2559.5F60183334l97796k06604p73926o82144n4932k11334p5073o63147o44760m98276
2569.1F55975342l23029n09186n95779r2316j07727L6698m30298l33252n42526q57773
2578.7F52220154l38898R3231L34244m80270o55899p52564m15039j17721l55530r3842
2588.4F49437866n60455l19214m48456m63943q0567k59552l99704q75930m28620m30908
2598F45170517m52576j98974k25067r4681m53491n47257n88303k63290l95889o04325
2607.7F41346664n12466m94995j43356l63236m87480n73387k30103n62019q07114l08189
$$ y = [666998825, 666585083, 666132507, 665803757, 666045456, 665694733, 665469666, 665072632, 664609222, 664113083, 663574982, 663113937, 662423630, 662337646, 662358780, 662454758, 662105408, 661662903, 661209030, 660455704, 660183334, 659785538, 659578934, 658805008, 658122864, 658067932, 657856598, 657781525, 657118378, 656473618, 655975342, 655652313, 655143127, 654547348, 654455032, 654347305, 654384003, 653953705, 653620453, 653077927, 652220154, 651881256, 651974487, 652308731, 651828461, 651172562, 650419998, 650004959, 649887238, 649531708, 649437866, 648877411, 648558197, 648109741, 647645798, 647565231, 647305679, 646905975, 646030045, 645601425, 645170517, 644717941, 644518967, 644293900, 644199219, 643745728, 643198471, 642610168, 642346878, 641950989, 641346664, 640834198, 640339203, 640195847, 639832611, 639345131, 638771744, 638541641, 637979622, 637172508, 636864319]
2617.3F36864319o85959L4981J03340p24335p26051l05176k77557q54454p59583m29420
2627F32240105Q9073k35329n12008n46647n92804m3640n37567o68945n51872k16561
2636.6F28423805j33056l54805l58239j091499p72934o02417m63219l41682k62527
2645.3F24043427k1134o78673k92625k98004m56887n71823m93850P934n40008j82228
2654.9F20516129k89307n44510k05269l65143o07490q47092m07905m02451m26750r1210
2664.6F16329002k2697l20282l65067l04679n99251k19803k97585j71508l78838o92863
2674.2F12956429R9334j45912l88527p01446j031838l21693M9667j99051k73208n53589
2683.9F09490166o15158j7777n02739m15306J13793j68343m48914q64868l44925j92642
$$ y = [636864319, 636178360, 636213341, 636316681, 635592346, 634866295, 634561119, 634283562, 633429108, 632669525, 632240105, 632329178, 632093849, 631581841, 631035194, 630442390, 630398750, 629861183, 629192238, 628640366, 628423805, 628290749, 627935944, 627577705, 626486206, 625713272, 625110855, 624647636, 624305954, 624043427, 624022293, 623343620, 623050995, 622752991, 622296104, 621724281, 621230431, 621238365, 620698357, 620516129, 620226822, 619682312, 619477043, 619111900, 618504410, 617657318, 617249413, 616846962, 616420212, 616329002, 616306305, 615986023, 615620956, 615316277, 614717026, 614497223, 614199638, 614028130, 613649292, 612956429, 613055763, 612909851, 612521324, 611819878, 610788040, 610466347, 610516014, 610316963, 610043755, 609490166, 608875008, 608857231, 608354492, 607939186, 608052979, 607884636, 607435722, 606570854, 606225929, 606033287]
2693.5F06033287l65868r2926k24990o36292m34875R2048l12996j44806l03459p59964
2703.1F02849159n57136k59400K32773j48239m95148o03523m6120J14441q58726q44841
2712.8E99383240l42713M9324N2872k518p04574r27925k60506j84860Q2893j29509
2722.4E97015724j52283j89628p9689j45607p12166m11682n30434l14102l25050o8283
2732.1E94086800Q2588n56870M2420j65291m49982k12974k54288m33464j90506L03230
2741.7E92251663j83716K4491k66457p46269k81448l3455k04506l79067j7013k71530
2751.4E89892693j63651k12974k49024M3755n23339o47354o07414L0365J82342k42538
2761E87502861m70428p41692l68843k82173q0261l24593n13039k02675O028n7488k69432
$$ y = [606033287, 605667419, 605574493, 605349503, 604713211, 604278336, 604370384, 604057388, 603912582, 603609123, 602849159, 602292023, 602032623, 602265396, 602117157, 601622009, 601018486, 600972366, 601086807, 600228081, 599383240, 599040527, 599089851, 599142723, 599140205, 598435631, 597507706, 597247200, 597062340, 597145233, 597015724, 596863441, 596673813, 596594124, 596448517, 595736351, 595324669, 594794235, 594480133, 594155083, 594086800, 594169388, 593612518, 593654938, 593489647, 593039665, 592826691, 592572403, 592138939, 591948433, 592251663, 592067947, 592092438, 591825981, 591079712, 590798264, 590764809, 590560303, 590181236, 590164223, 589892693, 589729042, 589516068, 589267044, 589310799, 588787460, 588140106, 587532692, 587563057, 587745399, 587502861, 587032433, 586290741, 585921898, 585639725, 585559464, 585234871, 584721832, 584519157, 584525185, 584467697, 584198265]
2771.6E84198265L9673n27306l91159k60658p71179n70908m97436n0698j72958l79410
2781.3E80616226q21113p51801l97797q42094j05438J46026j73492n93948p08809m67797
2790.9E75899963n01480l80974p53822j88293n1880n75333o54297q98056r32121o45561
2800.5E70318146j28594p58171q37555p84073q60366k7466k40898o41594r38187m43573
2810.2E64657669m16412r91707m53606m69093o36864p60116q06199o58721m09394r08890
2819.8E58146667j205863m81301q43849o64406m20761n33104p44743j455460j108589
2828.5E50688591p93648n28259n33981o38123o03218r02138j042137j227569r60427
2837.2E43459091j314926j698341j314583j074143j099548j671944j861648j731148
$$ y = [584198265, 584237938, 583710632, 583319473, 583058815, 582287636, 581716728, 581219292, 581168594, 580995636, 580616226, 579795113, 579043312, 578645515, 577803421, 577697983, 577844009, 577670517, 577076569, 576367760, 575899963, 575398483, 575017509, 574263687, 574075394, 574023514, 573448181, 572793884, 571895828, 570963707, 570318146, 570189552, 569431381, 568593826, 567809753, 566949387, 566921921, 566681023, 566039429, 565101242, 564657669, 564241257, 563249550, 562795944, 562326851, 561689987, 560929871, 560123672, 559464951, 559055557, 558146667, 556940804, 556459503, 555615654, 554951248, 554530487, 553997383, 553252640, 551797180, 550688591, 549894943, 549366684, 548832703, 548194580, 547591362, 546689224, 545647087, 544419518, 543459091, 542144165, 540445824, 539131241, 538057098, 536957550, 535285606, 533423958, 531692810]
2844.9E31692810j809769j878051j962014k100372j636238j368027j640625j330681
2852.6E17967033j281318n82314L44m10767m54598l20930J5831k64168o00281l58924
2862.3E13709908Q735k43454q77113q40302p40051o85654j067924q94051m30488m70162
2871.9E07469444n95817j023598p57103q02078q22716n75485n63851l68538n48934
2880.6E01411324n16777p80297j050262j001854n86319n90439j395988j258164j006546
2889.3D93224678n10254n18570j092567r66721q80470n16281n18799q65555j078911
2897.9D86276550p47680n50118r90105q61244q26072p79648m90876m39491q83064j048622
2907.6D78659630q11691o07110o34498j712952j647682j134605j529389j442528j155014
$$ y = [531692810, 529883041, 528004990, 526042976, 523942604, 522306366, 520938339, 519297714, 517967033, 516685715, 516103401, 516103745, 515692978, 515238380, 514917450, 514933281, 514669113, 514068832, 513709908, 513718643, 513475189, 512598076, 511757774, 511017723, 510332069, 509264145, 508370094, 507939606, 507469444, 506873627, 505850029, 505092926, 504290848, 503468132, 502892647, 502328796, 501960258, 501411324, 500894547, 500114250, 499063988, 498062134, 497475815, 496885376, 495489388, 494231224, 493224678, 492714424, 492195854, 491103287, 490136566, 489256096, 488739815, 488221016, 487355461, 486276550, 485528870, 484978752, 483988647, 483127403, 482301331, 481521683, 481030807, 480591316, 479708252, 478659630, 477847939, 477240829, 476606331, 474893379, 473245697, 472111092, 470581703, 469139175, 467984161]
2916.3D67984161j148567j508598j208687j097336j119728j003570q83103k65961m88739
2925D59259872l56521k67601l4065N63278P6828j4305O3247P3815J33476L63007M84123
2935.6D60345154M43840P33719O71234Q50487Q15658M48914L43094P52830J082459
2944.2D66487389P13005O92787K96593Q354O59065R59282L40423Q8501N26658M88700
2953.9D71260757L52517J2436J52549O34117M47579K75955M66232P28112O32972O27556
2963.5D75590782L86963N15442Q83942P23648O73408M97322O67305M80004M66423Q40034
2973.2D81725273M48914K18315N29098Q36640J64566R4147N83305L12233K20756L5630
2982.8D85168877P4958J25733J83906M48533K38533k00997J68762M52996l23487l39622
$$ y = [467984161, 466835594, 465326996, 464118309, 463020973, 461901245, 460897675, 460014572, 459748611, 459259872, 458903351, 458635750, 458601685, 459164963, 459241791, 459227486, 459290733, 459364548, 459498024, 459861031, 460345154, 460788994, 461522713, 462193947, 463044434, 463860092, 464309006, 464652100, 465404930, 466487389, 467200394, 467893181, 468189774, 468198128, 468857193, 469816475, 470156898, 470245399, 470772057, 471260757, 471613274, 471625710, 471778259, 472412376, 472859955, 473135910, 473602142, 474330254, 474963226, 475590782, 475977745, 476493187, 477377129, 478100777, 478774185, 479271507, 479938812, 480418816, 480885239, 481725273, 482174187, 482392502, 482921600, 483758240, 483922806, 484016953, 484600258, 484912491, 485133247, 485168877, 485243835, 485369568, 485553474, 486002007, 486240540, 486039543, 486208305, 486661301, 486337814, 485998192]
2992.5D85998192o3706K6246k48108l92189P7514o79550r41391n00450k47421K69661
3002.1D83298798j26877q67996p23000n60303q87871l93104r5291o28395o57006l2234
3011.7D78326721j95885r39292m69361l22304n19866r56154r93920l92685p36122o92291
3021.4D72108841r55391o95877n49240j271477o07757m18664o53800o25000n90516
3030.1D65741119q47511p46879q9417l87611p01905j133232j078415q30078p55691
3038.7D59170380m11148m60473q13751j482239j031723p52563p83653l96691r25064
3047.4D52113075j128158p27463k35634p09114j175842q96263p98874o95153o17599
3056.1D45128975m66766r61533p53517o87103r39179n13382r95064p34787m54445o32362
$$ y = [485998192, 485934486, 485960732, 485712624, 485320435, 485397949, 484718399, 483777008, 483276558, 483029137, 483298798, 483171921, 482303925, 481580925, 481020622, 480132751, 479739647, 479644356, 479015961, 478358955, 478326721, 478130836, 477191544, 476722183, 476399879, 475880013, 474923859, 473929939, 473537254, 472801132, 472108841, 471153450, 470457573, 469908333, 468636856, 468029099, 467610435, 466956635, 466331635, 465741119, 464893608, 464146729, 464057312, 463669701, 462967796, 461834564, 460756149, 459926071, 459170380, 458759232, 458298759, 457485008, 456002769, 454971046, 454218483, 453434830, 453038139, 452113075, 450984917, 450257454, 450021820, 449312706, 448136864, 447240601, 446441727, 445746574, 445128975, 444662209, 443700676, 442947159, 442260056, 441320877, 440807495, 439812431, 439077644, 438623199, 437990837]
3065.7D37990837n77392p81632o50444p14188j069259j363373n60646j16119k28920
3074.4D31928864k86294p89642o36711r59396o94084l86467j173439p88498k42768
3083.1D25971565o31637q39234n68390o88629m94041m93126q82797q74672p23992k35862
3092.7D19539185q74825j115761m88891l86963l35808o61354o97098j024246r23042
3101.4D13031197m67110p79152p94830o41899m31824o19888r17893q04176n30014o97785
3111.1D06346626o14509k39106p69538n44396o84318j299973q26492q17566p98264
3119.8C99752464l94859m83208j053314j169128j013794p73583n08842o68526n70183
3128.4C93117027n27801l94783m06990r19686j330146r07021k96898q05435j127777
$$ y = [437990837, 437413445, 436631813, 435981369, 435267181, 434197922, 432834549, 432273903, 432157784, 431928864, 431642570, 430852928, 430216217, 429256821, 428562737, 428176270, 427002831, 426214333, 425971565, 425339928, 424500694, 423932304, 423243675, 422749634, 422256508, 421373711, 420499039, 419775047, 419539185, 418664360, 417548599, 417059708, 416672745, 416336937, 415675583, 414978485, 413954239, 413031197, 412564087, 411784935, 410990105, 410348206, 409916382, 409296494, 408378601, 407574425, 407044411, 406346626, 405732117, 405493011, 404723473, 404179077, 403494759, 402194786, 401368294, 400550728, 399752464, 399357605, 398874397, 397821083, 396651955, 395638161, 394864578, 394355736, 393687210, 393117027, 392589226, 392194443, 391787453, 390867767, 389537621, 388630600, 388333702, 387528267, 386400490]
3137.1C86400490p78771n75294r17092p28721m84238j174888q27599m74892n71403
3145.8C79867592p22160j000519o61392o19736p65877o96335n42221q99238q82302
3154.5C73077812p26127j262703r13697l99704m67720j071319r11331m08478p89910
3163.1C66126823p62291r72938j095772r61914l41110o6567q52470p91740q23632p58285
3172.8C58700104q06084j111565p39479n85632m15649o97022r94377q19969q92334
3181.5C51637993j040421p50312l25356p23305p00645l11012r06945j196174o00319
3190.1C45083504o12793r02787n59539m43611p34139r23958p96928p09992n89714m82177
3199.8C38327866m98009n69992p79038p16209n86128j20926p15447j453743o39953
$$ y = [386400490, 385621719, 385046425, 384129333, 383400612, 382916374, 381741486, 380913887, 380438995, 379867592, 379145432, 378144913, 377483521, 376863785, 376097908, 375401573, 374859352, 373960114, 373077812, 372351685, 371088982, 370175285, 369775581, 369307861, 368236542, 367325211, 366916733, 366126823, 365364532, 364391594, 363295822, 362333908, 361992798, 361926231, 361073761, 360282021, 359458389, 358700104, 357894020, 356782455, 356042976, 355457344, 355041695, 354344673, 353350296, 352530327, 351637993, 350597572, 349847260, 349521904, 348798599, 348097954, 347786942, 346879997, 345683823, 345083504, 344470711, 343567924, 343008385, 342564774, 341830635, 340906677, 340109749, 339399757, 338810043, 338327866, 337829857, 337259865, 336480827, 335764618, 335178490, 335057564, 334342117, 332888374, 332248421]
3208.5C32248421o12221l69911j05477m86602n84107q66623q71162p40776l64113m48609
3218.1C26798820p68699q76961n51567k0065n01328n32646o45943o69822n84145r41772
3227.8C20705872o39229q54702n14317j60885l50437k66685q12607r89685q33740j80512
3237.4C15103073K45285m13608q41313p22770p08294p56360o5822R0771n25418o24809
3247C10780735q14362p77149m24499p33433p83672k04773k37751m19102m28467j66626
3256.7C05790901j45721l15113j38512r53732j065139l60661m15802m83150o26316
3265.4C01286755m24939p0324j25293l03879j31474m92019q13160n34363p13387M4594
3275B97722511p1068p51781j90582k99511l06072l32604m69112m51603n04360o3496
$$ y = [332248421, 331636200, 331266289, 331160812, 330674210, 330090103, 329223480, 328352318, 327611542, 327247429, 326798820, 326030121, 325153160, 324601593, 324581528, 324080200, 323547554, 322901611, 322231789, 321647644, 320705872, 320066643, 319211941, 318697624, 318536739, 318186302, 317919617, 317107010, 316117325, 315283585, 315103073, 315348358, 314934750, 314093437, 313370667, 312662373, 311906013, 311840191, 311930962, 311405544, 310780735, 309966373, 309189224, 308764725, 308031292, 307247620, 307042847, 306805096, 306385994, 305957527, 305790901, 305645180, 305330067, 305191555, 304237823, 303172684, 302812023, 302396221, 301913071, 301286755, 300861816, 300791492, 300666199, 300362320, 300230846, 299738827, 298925667, 298391304, 297677917, 297722511, 297651443, 296899662, 296709080, 296409569, 296103497, 295770893, 295301781, 294850178, 294345818, 294282322]
3284.7B94282322J07555l96080o65931l14827n96180m14353J43910m54369p43923m85458
3294.3B90462666r5978j44711n73082o33220l47386j50509k89192j81847j81102k01702
3303.9B87663937m02699n57461k60677m46796n34153o18325q86211m89998l4389k29855
3313.6B83203373l63312k40421l64285l87287m15439n73407q77475p14302k40441k76127
3323.2B78750877m08210q89931n43079K29835m03995r56917j035424j134357o28567
3331.9B72980232j40457k83985j36662l25603r34486p94087r48639j004867j8635M24595
3341.6B68817406n01271j071243o38485m15897o58989q75626l78666l2100k69280l56102
3351.2B63619747m57058m58813m75902n85575m34094j93309o08368l28694L60012l85379
$$ y = [294282322, 294389877, 293993797, 293327866, 293013039, 292416859, 292002506, 292146416, 291692047, 290948124, 290462666, 290366688, 290221977, 289648895, 289015675, 288668289, 288517780, 288228588, 288046741, 287865639, 287663937, 287261238, 286703777, 286443100, 285996304, 285462151, 284843826, 283957615, 283467617, 283433228, 283203373, 282840061, 282599640, 282235355, 281848068, 281432629, 280859222, 279981747, 279267445, 279027004, 278750877, 278342667, 277452736, 276909657, 277139492, 276735497, 275778580, 274743156, 273608799, 272980232, 272839775, 272555790, 272419128, 272093525, 271159039, 270364952, 269416313, 268411446, 268392811, 268817406, 268316135, 267244892, 266606407, 266190510, 265531521, 264655895, 264277229, 264245129, 263975849, 263619747, 263162689, 262703876, 262227974, 261642399, 261208305, 261014996, 260406628, 260077934, 260437946, 260052567]
3360.8B60052567n58587l01113k66914k41299p34882k44942K08321m48303m99630k65904
3370.5B56699314o44646m19120m62819n64632L35026J44005j21403k29988l94116j93081
3380.1B54148540n89332n25780n14545J37577M91066p31640o17256K04334L71513K8077
3389.8B52402554k82574n73883l46890L80287j71585l12385n9338l83472l00217j98574
3399.4B50153923L7079L89347J89857k58598m90894j97926N72071M83609k38438l26099
3409.1B50313931j63651r4738j98193p8468K58961K98252L0117J87359M11796N5066
3418.7B51020432O7386k975R5997K40592R575J28155K03896L51295M9610J34716O41098
3429.3B52939777M06781M66632J79863k55031M32815P68433k4128j52874K61631Q14076
$$ y = [260052567, 259493980, 259192867, 258925953, 258684654, 257949772, 257704830, 257913151, 257464848, 256965218, 256699314, 256054668, 255635548, 255172729, 254608097, 254943123, 255087128, 254965725, 254735737, 254341621, 254148540, 253559208, 253033428, 252518883, 252656460, 253147526, 252415886, 251798630, 252002964, 252374477, 252402554, 252119980, 251546097, 251199207, 251579494, 251407909, 251095524, 251036186, 250652714, 250352497, 250153923, 250191002, 250580349, 250770206, 250511608, 250020714, 249822788, 250394859, 250878468, 250640030, 250313931, 250150280, 250055542, 249857349, 249778881, 250037842, 250336094, 250366211, 250553570, 250965366, 251020432, 251087818, 251084843, 251180840, 251421432, 251431007, 251559162, 251763058, 252114353, 252163963, 252298679, 252939777, 253346558, 253813190, 253993053, 253738022, 254170837, 254939270, 254915142, 254762268, 255023899, 255837975]
3439B55837975Q94393J66798M73633L16086p2670M1866L93448Q26912q583J026897
3448.6B59896755J411038R1934k70004l5725P62939N95589O31867Q86421Q03261J092109
3458.2B65866184M05369J10245O40354P96852J62392N27916R93480K78111N04455N03998
3467.9B70789356N37148J059952J130390J106147Q69866N66559L19557L92761P38201
3476.6B77509937J179200R31606N68695P29160Q18615L63522m6788J104317J527291
3485.2B84685555J417884J130600K37656K73914N13535J226463J132317O17618O13938
3493.9B91849480O03161R07344R26915J519184J122112Q44974R82304Q87623J288299
3502.6C00931396N15290Q29258Q85963O75297R20982R78985J279431M93412P97767
$$ y = [255837975, 256732368, 256899166, 257372799, 257688885, 257616215, 257658081, 258051529, 258878441, 258869858, 259896755, 261307793, 261399727, 261129723, 261093998, 261856937, 262452526, 263084393, 263970814, 264774075, 265866184, 266271553, 266381798, 267022152, 267819004, 267981396, 268509312, 269502792, 269780903, 270285358, 270789356, 271326504, 272386456, 273516846, 274622993, 275492859, 276059418, 276378975, 276771736, 277509937, 278689137, 279620743, 280189438, 280918598, 281737213, 282100735, 282053947, 283158264, 284685555, 286103439, 287234039, 287471695, 287745609, 288259144, 289485607, 290617924, 291235542, 291849480, 292452641, 293359985, 294286900, 295806084, 296928196, 297773170, 298755474, 299643097, 300931396, 301446686, 302275944, 303161907, 303837204, 304758186, 305737171, 307016602, 307510014, 308307781]
3511.3C08307781J215573J407108J076183N04208R57489R63154J379413R01070P29751
3520C17441730J435338J714553J584015M31290R30405J182518J248359J132698M79889
3528.6C27580795Q28629J209907J317749J033898J618728J565896J353988J090698
3536.4C37600288R45435J829185R87015J020584J248894J319237J929741J713676P94373
3545C49388428M15039J765365O88401J659889K264175J886597K563782K00653J102638
3553.7C61934967J450615J662216K374611J147118K007675J225929P30133J133843
3561.4C73667107K773056K836113P62863K710418L87917J46866J947708J550636L357582
3570.1C90140266J950531K023964J878853J564560J685295J686859K026329Q96378
$$ y = [308307781, 309523354, 310930462, 312006645, 312510853, 313468342, 314431496, 315810909, 316711979, 317441730, 318877068, 320591621, 322175636, 322606926, 323537331, 324719849, 325968208, 327100906, 327580795, 328409424, 329619331, 330937080, 331970978, 333589706, 335155602, 336509590, 337600288, 338545723, 340374908, 341361923, 342382507, 343631401, 344950638, 346880379, 348594055, 349388428, 349803467, 351568832, 352257233, 353917122, 356181297, 358067894, 360631676, 360832329, 361934967, 363385582, 365047798, 367422409, 368569527, 370577202, 371803131, 372533264, 373667107, 376440163, 379276276, 380039139, 382749557, 383137474, 383284340, 385232048, 386782684, 390140266, 392090797, 394114761, 395993614, 397558174, 399243469, 400930328, 402956657, 403853035]
3577.8D03853035K398682K389640J290703K332459K760162J535950J188850M015656
3585.5D21765137K162399O7406K777443R66949K543068K716370K516517J098252P58247
3594.2D37371788L693428J642265K345276K902146J353073L073387K072601J751442
3601.9D56205406K344933J902542K458458L438949L459397Q41179M053077Q15354j161537
3610.6D74357758O349220K830582P2593M359017M52461L725738M609147K139358K877846
3619.3E01773720K27966Q05779L153839L828392K869301K828331K993278L228798O476631
3628E28186035N38139p425270N151406N396347N643387K656669p04689K758713L880615
3636.6E46081352L162918J829644K057838K822647K986984K631684K057762K686424
$$ y = [403853035, 406251717, 408641357, 409932060, 412264519, 415024681, 416560631, 417749481, 421765137, 423927536, 423994942, 426772385, 427739334, 430282402, 432998772, 435515289, 436613541, 437371788, 441065216, 442707481, 445052757, 447954903, 449307976, 452381363, 454453964, 456205406, 458550339, 460452881, 462911339, 466350288, 469809685, 470650864, 474703941, 475519295, 474357758, 480706978, 483537560, 483610153, 487969170, 488421631, 492147369, 496756516, 498895874, 501773720, 502001686, 502807465, 505961304, 509789696, 512658997, 515487328, 518480606, 521709404, 528186035, 528724174, 521298904, 526450310, 531846657, 537490044, 540146713, 539442024, 542200737, 546081352, 549244270, 551073914, 553131752, 555954399, 558941383, 561573067, 563630829, 566317253]
3644.4E66317253L677292M930649m85535m74319O449279K20566j294555J786880N968361
3653E87095871M820290M059295N307312n215797K226524N449028K181893K553215R66911
3661.7F09444542K061005K081909K235374J554833J149330N282554K520752J55220
3669.4F26485519K044754n868377K374611P808799Q480149j164933j5535469M682808
3677.1F29307861P788735M852257j310807L06320K463913J710816J431351N10559J089782
3685.8F48150787M923401O947174p507019l112030P728882n373611l05252N237808
3693.5F56690140J361618K183609M16794p36466J447449J367950L000412K266388n105743
3702.2F62892151j212692M602356J341400K67944J628113K730484K948456o274186
$$ y = [566317253, 569994545, 574925194, 574439659, 573965340, 580414619, 580635185, 579340630, 581127510, 587095871, 591916161, 595975456, 601282768, 596066971, 598293495, 603742523, 605924416, 608477631, 609444542, 611505547, 613587456, 615822830, 617377663, 618526993, 623809547, 626330299, 626485519, 628530273, 622661896, 625036507, 632845306, 641325455, 640160522, 624625053, 629307861, 637096596, 641948853, 640638046, 640944366, 643408279, 645119095, 646550446, 647061005, 648150787, 653074188, 660021362, 652514343, 649402313, 657131195, 651757584, 651452332, 656690140, 658051758, 660235367, 660652161, 659915695, 661363144, 662731094, 665731506, 667997894, 662892151, 661679459, 666281815, 667623215, 667891159, 669519272, 672249756, 675198212, 668924026]
3709.9F68924026L480454L938065j3364487M237594N321885Q67462Q22220K557067
3717.7F76784286J347275m045181J301727P426529j625290n827560L974151J384812
3725.4F80720749o27289k745514j0834L886261J850586O564637j693192q982773P493820
3734F86456451Q02842q429261k27356K008133O8741K997666M165725m193268K649765
3742.7F86299438R442292j3322830j0150834R986802N591812N333481l732758r778442
3750.4F79668961Q992767o888809m383393P166062L914795K627945m561844K338028
3758.2F88874512N839309o765899j479187L259201J045379N10941K909851k400207
3765.9F91793900m254303L162460M807815J218873q230744Q10623K681656k2583J137543
$$ y = [668924026, 672404480, 676342545, 662978058, 667215652, 672537537, 673404999, 674227219, 676784286, 678131561, 674086380, 675388107, 682814636, 681189346, 675361786, 679335937, 680720749, 680093460, 677347946, 677337112, 681223373, 683073959, 689638596, 687945404, 678962631, 686456451, 687259293, 678830032, 678602676, 680610809, 680679550, 683677216, 687842941, 683649673, 686299438, 695741730, 682418900, 672268066, 682254868, 687846680, 693180161, 689447403, 679668961, 688661728, 681772919, 677389526, 684555588, 688470383, 691098328, 686536484, 688874512, 694713821, 687947922, 686468735, 689727936, 690773315, 691284256, 694194107, 691793900, 687539597, 690702057, 695509872, 696728745, 688498001, 689308624, 691990280, 691967697, 693105240]
3774.5F93105240p553O80237M90570K783508j42212q031082K595138L128739J594925
3783.2F96197510K112732k978287j727295P06558J037979Q20542m30908l9597M87747
3791.9F96186981O15158k74124J358719L175507k984620m414444J367341M663925O362686
3800.6G06057129o939392r865723M042587K598343M675446N420608r497070m554214
3808.3F91937714L749618J318283L79410J331558P57523J251221N504379r08203j3161087
3817F92160416M149170M884262M266204L081360j5896682P28759M903107J403732J987839
3825.7G01668167j59836m230499K14081J909027L529968K295990p944259K659225O770477
3834.3G06712341p182235q72803R205170o576996m988633P328721n263596n51910O328125
$$ y = [693105240, 693097687, 693777924, 694268494, 697052002, 696909790, 688878708, 691473846, 694602585, 696197510, 698310242, 695331955, 693604660, 694311218, 695349197, 696169739, 695738831, 695699234, 696186981, 696802139, 696528015, 697886734, 701062241, 698077621, 693663177, 695030518, 699694443, 706057129, 699117737, 689252014, 693294601, 695892944, 700568390, 705988998, 696491928, 691937714, 695687332, 697005615, 697385025, 698716583, 699474106, 700725327, 706229706, 705321503, 692160416, 696309586, 701193848, 705460052, 708541412, 692644730, 693373489, 698276596, 699680328, 701668167, 701508331, 697277832, 697491913, 699400940, 702930908, 705226898, 697282639, 699941864, 706712341, 699530106, 698657303, 707862473, 701285477, 696296844, 703625565, 698361969, 697810059, 704138184]
3843G04138184k192536l342056J772003O88629j71966J998901N23300J768875N062333
3851.7G10245667m278489J348572j6739883M1580J0306473j103440j795959K501221
3859.4G00525742K628631L337174l783265J29624N121765p208099n763169L771668
3867.1F98760071N424118N895462p263794q829956L248749N927505L935089q825989
3874.8F98271255K36207L627853q4381K025451M421082n113907p632828N579377J912613
3883.5G03242722J636886M073563j3202210Q44803M839554J591339L732376o61773
3891.2G06097260p859345M86603K628708j534195J712188J599045J717758R60541q961487
3899.9F96847076M633713J624832l982544M609833k776947j638718n12390Q85620K119446
$$ y = [704138184, 701945648, 698603592, 700375595, 701064224, 700892258, 702891159, 703414459, 705183334, 710245667, 705967178, 707315750, 690575867, 690617447, 700923920, 699820480, 698024521, 700525742, 703154373, 706491547, 702708282, 702837906, 707959671, 700751572, 694988403, 698760071, 704184189, 710079651, 702815857, 693985901, 697234650, 703162155, 707097244, 698271255, 698507462, 702135315, 702050934, 704076385, 708497467, 703383560, 695750732, 701330109, 703242722, 704879608, 708953171, 695750961, 696595764, 701435318, 703026657, 706759033, 706097260, 698237915, 698724518, 701353226, 699819031, 701531219, 703130264, 704848022, 705808563, 696847076, 701480789, 703105621, 699123077, 703732910, 700955963, 699317245, 698804855, 699690475, 701809921]
3908.6G01809921j9760M68292K46964Q34579k4490p48367N52139J860275k418899l804779
3918.2F98755875L536834K59400k934342J454850J141357J102295j673889k594834
3926F99047546P80106J921692J577453j399688m41132K021027k260437j654434J692504
3934.6G01284637l44238k6703R19190m09622m43421p84302J400986J626129l531494
3943.3F99691162k19116J114578N23300J582260j555099J113739N07431l099518J205139
3952G00863876K75574n82504O93588M64172O9275j068954J74637l53394J05972O37894
3961.6G01280136j054306K63062L79028Q2626p9879k59324P57904m07638j035233Q71659
3971.3G00798035P29293n78994m02756l03955L23563J40838m90951K88467P49512K39410
$$ y = [701809921, 701790161, 702258453, 702505417, 703339996, 703315506, 702567139, 703119278, 704979553, 702560654, 698755875, 702292709, 702552109, 699617767, 701072617, 702213974, 703316269, 701642380, 699047546, 699827652, 701749344, 703326797, 701927109, 701485977, 703507004, 701246567, 699592133, 701284637, 700940399, 700913696, 701832886, 701423264, 700979843, 700195541, 701596527, 703222656, 699691162, 699472046, 700586624, 701109924, 702692184, 701137085, 702250824, 702758255, 699658737, 700863876, 701139450, 700556946, 701250534, 701714706, 701783981, 700715027, 700889664, 700536270, 700642242, 701280136, 700225830, 700488892, 700867920, 700950546, 700870667, 700611343, 701369247, 700961609, 699926376, 700798035, 701527328, 700948334, 700545578, 700241623, 700565186, 700706024, 700215073, 700503540, 701253052, 701492462]
3980.9G01492462k23694O3172j29700O714j87149j59836M16565j1215M85916l17230
3990.6G01436005l39508L23257o51321p8659k9984j0223K55508K56348J61895m10842
4000.2G00912476
$$ y = [701492462, 701268768, 701331940, 701202240, 701208954, 701021805, 700861969, 701278534, 701267319, 701753235, 701436005, 701096497, 701419754, 700768433, 700689774, 700659790, 700649567, 700905075, 701161423, 701323318, 700912476]
##END=$$ End of the data block
