##TITLE=$$ Begin of the data block
##JCAMP-DX=5.00 $$ ACD/SpecManager v 10.08
##SPECTROMETER/DATA SYSTEM=Varian
##DATE=08 Jan 2013 16:20:58
##DATA TYPE=INFRARED SPECTRUM
##DATA CLASS=XYDATA
##ORIGIN=
##OWNER=
##NPOINTS=3735
##FIRSTX=399.26403809
##LASTX=4000.35498047
##MAXX=4000.35498047
##MINX=399.26403809
##MAXY=74.56066132
##MINY=25.05209541
##XFACTOR=1.0000000000
##YFACTOR=0.000000100000000
##FIRSTY=44.94701767
##DELTAX=0.96440572
##XUNITS=1/CM
##YUNITS=TRANSMITTANCE
##XYDATA=(X++(Y..Y))
$$ plain form
399.3 449470177 447428741 456136742 466770706 459620285 445494423 445526772 463937225 463306427
407 463306427 456094475 462469635 468700180 466363029 456328049 454980087 460139771 463662453 458054352
415.7 458054352 457166710 460518265 448262978 457329140 458167305 457877998 461499519 459622459 456854439
424.3 456854439 459015999 464131775 461409836 459482002 457122688 450483894 448201675 455964546
432.1 455964546 461737747 460475235 461115608 457037239 453789291 455717964 454428444 452781906 452375679
440.7 452375679 451686325 450915604 456305962 456485023 453684731 455190125 453794823 451366768 451111755
449.4 451111755 456432266 457683830 456562386 458965263 455653992 453431892 451660881 449916077
457.1 449916077 454202042 457574959 457274017 455487785 451840706 447446632 447707367 448376236 450268745
$$ packed form
399.3D49470177k041436Q708001J0633964p150421j4125862L2349J8410453o30798
407D63306427p211952O375160O230545k337151j0034980j347962N159684L522682n608101
415.7D58054352q87642L351555j2255287R066162Q38165k89307L621521j877060k768020
424.3D56854439K161560N115776k721939j927834k359314o638794k282219P762871
432.1D55964546N773201j262512O40373m078369l247948J928673j289520j646538m06227
440.7D52375679o89354p70721N390358J79061k800292J505394j395302k428055k55013
449.4D51111755N320511J251564j121444K402877l311271k222100j771011j744804
457.1D49916077M285965L372917l00942j786232l647079m394074K60735O68869J892509
$$ plain form
465.8 450268745 451103287 450541840 450330582 445915489 446736908 450125771 450326080 449063911 445898628
474.5 445898628 442774467 442266350 446574211 446690559 441801682 441668243 443289909 444207153 444054756
483.2 444054756 439842682 439203300 440284538 438683815 439350357 441131401 440869370 438678055 439475784
491.8 439475784 442668114 442674713 439318047 436582527 438393822 438772278 438308182 439212112 440257568
500.5 440257568 440890961 438169365 436469116 435269928 436610222 438513412 435867500 432838097 432197342
509.2 432197342 434715805 435123901 434491768 432551880 430717010 432241936 430399933 428540382 428855743
517.9 428855743 428651962 427113380 424872551 426374512 429835243 431149406 430154991 429507942 429334030
526.6 429334030 429014282 426273384 423770943 424720726 425259857 425889626 424973259 424251671 424664803
$$ packed form
465.8D50268745Q34542n61447k11258m415093Q21419L388863K00309j262169l165283
474.5D45898628l124161n08117M307861J16348m888877j33439J621666R17244j52397
483.2D44054756m212074o39382J081238j600723O66542J781044k62031k191315P97729
491.8D39475784L192330O599l356666k735520J811295L78456m64096R03930J045456
500.5D40257568O33393k721596j700249j199188J340294J903190k645912l029403o40755
509.2D32197342K518463M08096o32133j939888j834870J524926j842003j859551L15361
517.9D28855743k03781j538582k240829J501961L460731J314163r94415o47049j73912
526.6D29334030l19748k740898k502441R49783N39131O29769r16367p21588M13132
$$ plain form
535.2 424664803 424516487 425134544 425325584 425786171 424722862 423825874 423490028 422123451 422943001
543.9 422943001 423456764 422511292 421963348 421146622 419509544 419371414 419616547 417773514 417058029
552.6 417058029 417956772 418089561 417018318 416633835 415276985 414625931 415922737 416281548 416191330
561.3 416191330 414843979 415123291 415487747 414919472 415929565 416138268 416255112 415685616 415401688
570 415401688 415451202 415181694 415662994 415741539 414877548 413839111 414666634 413268547 411595001 412875557
579.6 412875557 414025230 414497871 414372826 415048256 415206795 414794502 414644775 415336952 416332550 415548897
589.3 415548897 415500946 415803986 416208229 416117935 417315369 419802132 419369736 418355865 416823463
597.9 416823463 416413612 417134285 416936264 417043953 417062149 418042908 418128510 416970520 416362877 416820641
$$ packed form
535.2D24664803j48316O18057J91040M60587j063309q96988l35846j366577Q19550
543.9D22943001N13763r45472n47944q16726j637078j38130K45133j843033p15485
552.6D17058029Q98743J32789j071243l84483j356850o51054J296806L58811r0218
561.3D16191330j347351K79312L64456n68275J010093K08703J16844n69496k83928
570D15401688M9514k69508M81300P8545q63991j038437Q27523j398087j673546J280556
579.6D12875557J149673M72641j25045O75430J58539m12293j49727O92177R95598p83653
589.3D15548897m7951L03040M04243r0294J197434K486763m32396j013871j532402
597.9D16823463m09851P20673j98021J07689J8196R80759Q5602j157990o07643M57764
$$ plain form
607.6 416820641 416765633 415472565 415143433 414681435 414817009 414932022 413974190 412566757 411372490
616.3 411372490 412015152 412989731 413783607 413853645 413391876 413251648 414104500 415198936 415719109 417932587
625.9 417932587 420251923 420965576 420925713 422257004 424053726 425009041 426844025 427701988 427743187
634.6 427743187 428293304 429988365 432920685 434487495 434724312 435393906 436469269 437503281 438925438
643.3 438925438 440307121 441984444 444236450 445336609 445480423 445009880 444212723 445208397 447955132
651.9 447955132 449944572 450892715 451307144 450405464 449638519 449649391 448863106 448889885 450775414 451393471
661.6 451393471 450695877 451009369 451002197 450777969 451917725 453998032 452976265 452099152 453111992
670.3 453111992 453571815 454912071 456446686 456851845 457304420 458389244 459790039 461003380 462167435
$$ packed form
607.6D16820641n5008j293068l29132m61998J35574J15013r57832j407433j194267
616.3D11372490O42662R74579P93876P0038m61769j40228Q52852J094436N20173K213478
625.9D17932587K319336P13653l9863J331291J796722R55315J834984Q57963M1199
634.6D27743187N50117J695061K932320J566810K36817O69594J075363J034012J422157
643.3D38925438J381683J677323K252006J100159J43814m70543p97157R95674K746735
651.9D47955132J989440R48143M14429r01680p66945J0872p86285K6779J885529O18057
661.6D51393471o97594L13492p172k24228J139756K080307j021767q77113J012840
670.3D53111992M59823J340256J534615M05159M52575J084824J400795J213341J164055
$$ plain form
678.9 462167435 462910194 464047470 465342064 466339569 467672729 467951012 467802048 468164330 469173622
687.6 469173622 469977608 470875282 472791214 472949600 472928696 473958511 474197998 474315681 474798470 476245575
697.3 476245575 477223473 477376213 478049660 478952599 479689980 479795380 480777550 482577820 482889481 482555428
706.9 482555428 483018150 483647270 484794159 486795311 487958641 488113365 488225555 488816948 489644051
715.6 489644051 490639381 491488342 491481094 492235069 493931961 495543709 495822716 495229111 495657692 495675697
725.2 495675697 496452332 497829208 498346596 499827232 501453667 502419395 503055382 503529778 504183540
733.9 504183540 505292435 505772781 506488571 508650894 508730202 507850151 508455276 509471626 509989014
742.6 509989014 509927063 510174255 510647812 512175446 513266182 513434563 513926315 513951225 514041290 514355888
$$ packed form
678.9D62167435P42759J137276J294594R97505J333160K78283j48964L62282J009292
687.6D69173622Q03986Q97674J915932J58386k0904J029815K39487J17683M82789J447105
697.3D76245575R77898J52740O73447R02939P37381J05400R82170J800270L11661l34053
706.9D82555428M62722O29120J146889K001152J163330J54724J12190N91393Q27103
715.6D89644051R95330Q48961p248P53975J696892J611748K79007n93605M28581J8005
725.2D95675697P76635J376876N17388J480636J626435R65728O35987M74396O53762
733.9E04183540J108895M80346P15790K162323P9308q80051O05125J016350N17388
742.6E09989014o1951K47192M73557J527634J090736J68381M91752K4910R0065L14598
$$ plain form
752.2 514355888 515444908 516781883 517893600 518614998 518704720 519401588 520861359 522501411 523130264
760.9 523130264 524082947 525157166 525573082 526555939 527369881 528293839 528649597 528355255 527913475 528725624
770.6 528725624 530205727 530152664 530332375 530461044 530779686 530927582 530334091 529458084 529399376 530995102
780.2 530995102 530895538 530752182 531411438 531651764 531967430 532419128 534009628 534653397 534975891 535034676
789.9 535034676 534345894 534408836 534843292 535521736 535569954 535259781 534031792 532613983 531783752 530943375
799.5 530943375 530768929 530812988 530274658 528809166 527577095 525501137 523090553 521923714 520316658
808.2 520316658 518586311 517258835 515999870 514892120 513780975 511784019 510147552 509238205 508119698
816.9 508119698 507586441 507566833 508072891 507659988 507339706 507828827 508319473 509969864 511637115 514351387
$$ packed form
752.2E14355888J089020J336975J111717P21398Q9722O96868J459771J640052O28853
760.9E23130264R52683J074219M15916R82857Q13942R23958L55758k94342m41780Q12149
770.6E28725624J480103n3063J79711J28669L18642J47896n93491q76007n8708J595726
780.2E30995102r9564j43356O59256K40326L15666M51698J590500O43769L22494N8785
789.9E35034676o88782O2942M34456O78444M8218l10173j227989j417809q30231q40377
799.5E30943375j74446M4059n38330j465492j232071k075958k410584j166839j607056
808.2E20316658j730347j327476j258965j107750j111145j996956j636467r09347j118507
816.9E08119698n33257j9608N06058m12903l20282M89121M90646J650391J667251K714272
$$ plain form
826.5 514351387 517478867 519621048 521548615 523258018 526364441 529983673 533016396 535129814
834.2 535129814 537536240 539908257 541666260 544419250 546425819 548384132 549939842 551695862
841.9 551695862 554156227 556008568 557438965 558180161 560010872 560713463 561264572 562220840 563160439
850.6 563160439 565724373 566770973 567528877 568431816 570186882 572332649 573857002 576131401 576949310
859.3 576949310 577828178 579749298 581846733 582324486 581945724 582297401 582525253 583031425 583026199 583025360
868.9 583025360 581156044 579014702 577985001 576485214 575726929 575354958 575169792 573775024 573032608
877.6 573032608 572749405 571721687 571173820 570162430 569499588 568292732 567863121 568024597 567507858
886.3 567507858 567093964 565828285 564797096 564294815 563797989 562846680 562534904 562559776 562642517 563320923
$$ packed form
826.5E14351387L127480K142181J927567J709403L106423L619232L032723K113418
834.2E35129814K406426K372017J758003K752990K006569J958313J555710J756020
841.9E51695862K460365J852341J430397P41196J830711P02591N51109R56268R39599
850.6E63160439K563934J046600P57904R02939J755066K145767J524353K274399Q17909
859.3E76949310Q78868J921120K097435M77753l78762L51677K27852N06172n226q39
868.9E83025360j869316k141342j029701j499787p58285l71971j85166j394768p42416
877.6E73032608k83203j027718n47867j011390o62842j206856m29611J61476n16739
886.3E67507858m13894j265679j031189n02281m96826r51309l11776K4872Q2741O78406
$$ plain form
895.9 563320923 563478508 563726959 563145142 562511597 562371635 562467690 562266655 562059898 563775826 565200500
905.6 565200500 566561279 568101349 569841270 571302414 571959496 572784843 572071686 571687317 570678978
914.3 570678978 568972931 567648964 566169167 565266647 563358116 561252861 558120155 555124931 552800560
922.9 552800560 549508438 546006813 542818947 541351967 539704170 537187157 533882790 530265160
930.7 530265160 527461624 524877853 523296471 522482986 522135315 520946426 519558487 518870010 517899628
939.3 517899628 517222824 516349106 515844803 515268898 514439430 513988457 513435173 513214836 513236389 512767296
949 512767296 511617317 510936203 510238533 510304947 510988274 510373383 509072189 506661758 504112511 501884155
958.6 501884155 500239067 498744240 496947670 495186386 492348061 490711746 489408188 486974640
$$ packed form
895.9E63320923J57585K48451n81817o33545j39962R6055k01035k06757J715928J424674
905.6E65200500J360779J540070J739921J461144O57082Q25347p13157l84369j008339
914.3E70678978j706047j323967j479797r02520j908531k105255l132706k995224k324371
922.9E52800560l292122l501625l187866j466980j647797k517013l304367l617630
930.7E30265160k803536k583771j581382q13485l47671j188889j387939o88477r70382
939.3E17899628o76804q73718n04303n75905q29468m50973n53284k20337K1553m69093
949E12767296j149979o81114o97670O6414O83327o14891j301194k410431k549247k228356
958.6E01884155j645088j494827j796570j761284k838325j636315j303558k433548
$$ plain form
966.3 486974640 484590569 481812172 479607658 478013535 476586571 474586983 471719627 468749008
974.1 468749008 465541992 461919479 458403130 455096855 451356812 447777901 443802986 439011192
981.8 439011192 434333878 429504967 424686394 420115471 415258102 410542679 406062965 401974678
989.5 401974678 397936935 393102837 388711967 384619331 381258278 378390274 374946709 371138840
997.2 371138840 367653961 365782280 363413506 360523796 357207947 354257126 353020325 351480217
1004.9 351480217 350027046 348357430 346945190 345202637 343631516 342660141 340234375 338166504
1012.6 338166504 336612053 335074501 332908974 331155128 330091591 328090477 325687218 322750015
1020.3 322750015 320386200 318141193 315923328 313242989 310958920 309526253 307490845 306139774
$$ packed form
966.3D86974640k384071k778397k204514j594123j426964j999588k867356k970619
974.1D68749008l207016l622513l516349l306275l740043l578911l974915m791794
981.8D39011192m677314m828911m818573m570923m857369m715423m479714m088287
989.5D01974678m037743m834098m390870m092636l361053k868004l443565l807869
997.2C71138840l484879j871681k368774k889710l315849k950821j236801j540108
1004.9C51480217j453171j669616j412240j742553j571121r71375k425766k067871
1012.6C38166504j554451j537552k165527j753846j063537k001114k403259k937203
1020.3C22750015k363815k245007k217865k680339k284069j432667k035408j351071
$$ plain form
1028.1 306139774 304386330 303057575 301145477 299651756 299495277 298832264 298897190 298678188 299645119
1036.7 299645119 300271931 301150265 302315502 302580891 304367371 305484009 306329098 306517754 306968918
1045.4 306968918 306982594 305591278 304959259 304136276 303668995 302448616 301667671 300726490 299846230
1054.1 299846230 299164448 297483673 297252541 296168041 296348896 297737560 299167194 300711155 301975479
1062.8 301975479 304448376 306086960 308585625 310734825 312345543 313994904 315120316 316462669
1070.5 316462669 317594604 319283695 319621239 320523834 321378860 321371956 321546555 321876526 323640251
1079.2 323640251 323977470 324462585 325538902 326658058 327409172 329014969 331712875 331678352 332837181
1087.9 332837181 334434204 336025658 337905502 339201698 342005463 343708153 344466782 344795647 345915756
$$ packed form
1028.1C06139774j753444j328755j912098j493721j56479o63013O4926k19002R66931
1036.7B99645119O26812Q78334J165237K65389J786480J116638Q45089J88656M51164
1045.4C06968918J3676j391316o32019q22983m67281j220379p80945r41181q80260
1054.1B99846230o81782j680775k31132j084500J80855J388664J429634J543961J264324
1062.8C01975479K472897J638584K498665K149200J610718J649361J125412J342353
1070.5C16462669J131935J689091L37544R02595Q55026o904J74599L29971J763725
1079.2C23640251L37219M85115J076317J119156P51114J605797K697906l4523J158829
1087.9C32837181J597023J591454J879844J296196K803765J702690P58629L28865J120109
$$ plain form
1096.5 345915756 346954193 347738953 350014191 351890373 353675804 354706421 356287193 358248177
1104.2 358248177 359091377 359485588 360187454 361367111 361729126 362613678 363749962 365131302 366290665
1112.9 366290665 366589584 366813965 367061844 368038750 368267746 368527298 368694153 368827438 369019089 368203392
1122.6 368203392 368118019 368077087 368680763 369485474 370684586 372255096 373095627 374970131 377284088
1131.2 377284088 379586525 380881882 382630234 384878159 386269379 388255310 390571785 393145370
1139 393145370 395193939 397350349 398804703 398980446 399195213 399716530 400905266 401398201 402100716
1147.6 402100716 402955589 403412781 403590393 402702599 402261200 402149811 402150764 401866341 401453285 401263771
1157.3 401263771 400729599 400068245 398577385 397625999 397501335 397980728 398991776 400000572 401503143
$$ packed form
1096.5C45915756J038437P84760K275238J876182J785431J030617J580772J960984
1104.2C58248177Q43200L94211P01866J179657L62015Q84552J136284J381340J159363
1112.9C66290665K98919K24381K47879R76906K28996K59552J66855J33285J91651q15697
1122.6C68203392q5373m0932O03676Q04711J199112J570510Q40531J874504K313957
1131.2C77284088K302437J295357J748352K247925J391220J985931K316475K573585
1139C93145370K048569K156410J454354J75743K14767N21317J188736M92935P02515
1147.6D02100716Q54873M57192J77612q87794m41399j11389R53k84423m13056j89514
1157.3D01263771n34172o61354j490860r51386j24664M79393J011048J008796J502571
$$ plain form
1166 401503143 402973480 404951782 406849403 408385696 410452461 413191757 415921631 418541031 421248817
1174.6 421248817 423732071 426559906 429118271 431391220 433627739 436221581 439038925 441153374
1182.4 441153374 442850304 444030151 445609360 447786140 448954811 449119987 449555893 450506325 451410942
1191 451410942 451565552 451419258 451404648 450713921 450047226 449500427 448732452 448205910 446987762 445539284
1200.7 445539284 444936638 444273491 443453102 443078728 442807503 442404099 441930237 440975647 440124512 439811172
1210.3 439811172 439659500 439788437 439808121 439878922 439790573 439335594 439106903 439193459 439369164 439179039
1220 439179039 438984985 438505211 438003197 438253288 438263168 437654114 436604843 435876999 435666122 435101547
1229.6 435101547 434152336 433415985 433246574 432663689 431555748 430591049 430181541 430057144 429811516
$$ packed form
1166D01503143J470337J978302J897621J536293K066765K739296K729874K619400K707786
1174.6D21248817K483254K827835K558365K272949K236519K593842K817344K114449
1182.4D41153374J696930J179847J579209K176780J168671J65176M35906R50432R04617
1191D51410942J54610j46294j4610o90727o66695n46799p67975n26542j218148j448478
1200.7D45539284o02646o63147q20389l74374k71225m03404m73862r54590q51135l13340
1210.3D39811172j51672J28937J9684P0801q8349m54979k28691Q6556J75705j90125
1220D39179039j94054m79774n02014K50091R880o09054j049271p27844k10877n64575
1229.6D35101547r49211p36351j69411n82885j107941r64699m09508j24397k45628
$$ plain form
1238.3 429811516 429962311 429843407 429641609 429641190 429192810 428355942 427524223 427224808 427056465 426767616
1247.9 426767616 426347580 425909653 425479355 425077438 425123863 425217781 425038452 424803505 424763756 424644394
1257.6 424644394 424538269 424638176 424881172 425024567 424921455 425234413 425805626 426773109 427707138 428177338
1267.2 428177338 428545799 428891487 429905586 431190414 432174072 432739563 433424797 434395752 435512657
1275.9 435512657 437029152 438117943 438816452 439763756 441026917 442380791 443710060 444881973 446245575
1284.6 446245575 447865295 449205246 450752220 452268143 453485756 454170456 454622269 455557213 456731300
1293.3 456731300 457960472 458893967 459579124 460214844 460932846 461533127 461962242 461992836 461917992 462378082
1302.9 462378082 462564583 462511520 462733345 463036919 462884560 462378387 461809578 461285591 460916367 460556908
$$ packed form
1238.3D29811516J50795j18904k01798m19m48380q36868q31719k99415j68343k88849
1247.9D26767616m20036m37927m30298m01917M6425R3918j79329k34947l9749j19362
1257.6D24644394j06125R9907K42996J43395j03112L12958N71213R67483R34029M70200
1267.2D28177338L68461L45688J014099J284828R83658N65491O85234R70955J116905
1275.9D35512657J516495J088791O98509R47304J263161J353874J329269J171913J363602
1284.6D46245575J619720J339951J546974J515923J217613O84700M51813R34944J174087
1293.3D56731300J229172R33495O85157O35720P18002O00281M29115L0594p4844M60090
1302.9D62378082J86501n3063K21825L03574j52359n06173n68809n23987l69224l59459
$$ plain form
1312.5 460556908 460603294 460312309 459882393 459595490 459413986 460093002 460638199 461094398 461994095 463092995
1322.2 463092995 464041290 464716454 465247803 465456467 465839539 465956078 466070900 466273270 466523399 466612091
1331.8 466612091 465707207 464835014 464238968 464093857 464294701 464429626 464639893 464887123 465054550 464758072
1341.5 464758072 465288162 465997810 466273232 466739082 467501678 468476639 468756142 468779411 468684883 468830643
1351.1 468830643 468590164 468253899 468639565 468208885 467688828 467286072 467198677 467147217 466757355 466181374
1360.8 466181374 465530357 465531425 464350357 464286613 464401093 463675804 463309517 462357712 461230698 460484276
1370.4 460484276 460798683 461326447 461479034 461658401 461393394 461245689 460643845 460447731 460152206 459882431
1380.1 459882431 459698753 459094658 458229485 456675720 455699272 454899521 454156914 451937637 450281448
$$ packed form
1312.5D60556908M6386k90985m29916k86903j81504O79016N45197M56199Q99697J098900
1322.2D63092995R48295O75164N31349K08664L83072J16539J14822K02370K50129Q8692
1331.8D66612091r04884q72193n96046j45111K00844J34925K10267K47230J67427k96478
1341.5D64758072N30090P09648K75422M65850P62596R74961K79503K3269r4528J45760
1351.1D68830643k40479l36265L85666m30680n20057m02756q7395n1460l89862n75981
1360.8D66181374o51017J068j181068o3744J14480p25289l66287r51805j127014p46422
1370.4D60484276L14407N27764J52587J79367k65007j47705o01844j96114k95525k69775
1380.1D59882431j83678o04095q65173j553765r76448p99751p42607k219277j656189
$$ plain form
1388.7 450281448 450116920 449031029 447653847 446054649 444575577 441652184 438323097 436914330
1396.4 436914330 435122910 433690758 430447350 428392067 427568588 425585403 423479691 421243095
1404.2 421243095 418119888 415707436 414913445 413712540 411918602 410621834 409205475 407949867
1411.9 407949867 406215744 405019531 404470634 403658905 403302078 402740288 402760773 400598831 400159187
1420.6 400159187 401275864 401259689 402074051 402321472 402752724 403726540 404486961 405572701 406088524
1429.2 406088524 407072029 407758026 409454918 411342583 412684441 414497910 415712700 416441307 417202454
1437.9 417202454 419429970 420940437 422058258 423681908 424989471 426591263 427647552 429010773
1445.6 429010773 429778099 430915947 431781006 432468567 434254265 435177498 436722641 437899246 439635239
$$ packed form
1388.7D50281448j64528j085891j377182j599198j479072k923393l329087j408767
1396.4D36914330j791420j432152l243408k055283q23479j983185k105712k236596
1404.2D21243095l123207k412452p93991j200905j793938j296768j416359j255608
1411.9D07949867j734123j196213n48897q11729l56827n61790K0485k161942m39644
1420.6D00159187J116677j6175Q14362K47421M31252R73816P60421J085740N15823
1429.2D06088524R83505O85997J696892J887665J341858J813469J214790P28607P61147
1437.9D17202454K227516J510467J117821J623650J307563J601792J056289J363221
1445.6D29010773P67326J137848Q65059O87561J785698R23233J545143J176605J735993
$$ plain form
1454.3 439635239 441129189 441235962 443574142 444560699 446946640 447900352 449886513 451303139 452677002
1463 452677002 455397110 456651726 458336220 460055923 462815971 464765739 466493797 469716568 472366562
1471.7 472366562 474814720 476361847 479759293 482379227 484137421 486937561 489561348 491720161
1479.4 491720161 493282967 495093269 496956635 498662186 499985733 501448746 503368301 504647217
1487.1 504647217 505395088 506543312 506309052 505105019 505148926 505328293 504998627 504363785 503287811
1495.8 503287811 498370857 498347626 497395515 493778038 493101463 492310600 491383553 490367050 490527153
1504.5 490527153 490436172 486816101 483936806 483510857 484403191 484113007 484573288 483306160 481683350
1513.1 481683350 481664429 480697746 479981270 478280525 476860123 477736092 479272423 479528275 477681503
$$ packed form
1454.3D39635239J493950J06773K338180R86557K385941R53712J986161J416626J373863
1463D52677002K720108J254616J684494J719703K760048J949768J728058L222771K649994
1471.7D72366562K448158J547127L397446K619934J758194K800140K623787K158813
1479.4D91720161J562806J810302J863366J705551J323547J463013J919555J278916
1487.1E04647217P47871J148224k34260j204033M3907J79367l29666o34842j075974
1495.8E03287811m916954k3231r52111l617477o76575p90863r27047j016503J60103
1504.5D90527153r0981l620071k879295m25949Q92334k90184M60281j267128j622810
1513.1D81683350j8921r66683p16476j700745j420402Q75969J536331K55852j846772
$$ plain form
1521.8 477681503 478072815 478909264 480599594 480448685 481390686 483184319 483507385 484268265 485489006
1530.5 485489006 486731796 487842903 488955917 488446388 489641418 490765305 492077484 495298042
1538.2 495298042 496863213 490909996 491753197 493778114 494324493 495844383 497412910 496952629 498139229
1546.9 498139229 498975906 500555344 501010056 499707947 500648613 501444168 502859268 501222610 501311722
1555.6 501311722 502801437 503054886 497205315 488471947 494316635 495263443 496479645 495400391 493865013
1564.2 493865013 491217155 488662758 487648659 485544777 484884262 477479019 474705200 472569580
1572 472569580 469406700 466971169 464072952 463055305 450692520 448411140 445401459 441197281
1579.7 441197281 436877670 431550064 428310356 422515907 418510361 412917213 408301048 403972511
$$ packed form
1521.8D77681503L91312Q36449J690330j50909R42001J793633L23066P60880J220741
1530.5D85489006J242790J111107J113014n09529J195030J123887J312179L220558
1538.2D95298042J565171n953217Q43201K024917N46379J519890J568527m60281J186600
1546.9D98139229Q36677J579438M54712j302109R40666P95555J415100j636658Q9112
1555.6E01311722J489715K53449n849571q733368N844688R46808J216202j079254j535378
1564.2D93865013k647858k554397j014099k103882o60515p405243k773819k135620
1572D72569580l162880k435531k898217j017647j2362785k281380l009681m204178
1579.7D41197281m319611n327606l239708n794449m005546n593148m616165m328537
$$ plain form
1587.4 403972511 398820724 395459518 389597282 386094398 380242081 376608849 372416725 367441521
1595.1 367441521 364210434 358766823 356693153 352060547 349538231 345600433 341721497 339258614
1602.8 339258614 334924507 333600311 329614067 328250504 325039024 323277397 321498718 318312035
1610.5 318312035 318319664 315274525 315118103 313029232 313224125 312761879 308222828 310287094 308357677
1619.2 308357677 308982964 307041092 308109264 308169003 306247654 307806988 307152977 309447021 308206444
1627.9 308206444 309663754 310434170 311497707 312777424 312696972 315148869 314864521 317899876 317637615
1636.6 317637615 320382996 321529694 322910957 325591545 325471878 328216133 328927994 331534271 333978729
1645.3 333978729 334714241 337936516 336929398 340351906 341067314 344024048 345548897 342216377 344991798
$$ packed form
1587.4D03972511n151787l361206n862236l502884n852317l633232m192124m975204
1595.1C67441521l231087n443611k073670m632606k522316l937798l878936k462883
1602.8C39258614m334107j324196l986244j363563l211480j761627j778679l186683
1610.5C18312035P629l045139j56422k088871J94893m62246m539051K064266j929417
1619.2C08357677O25287j941872J068172N9739j921349J559334o54011K294044j240577
1627.9C08206444J457310P70416J063537J279717q0452K451897k84348L035355k62261
1636.6C17637615K745381J146698J381263K680588j19667K744255P11861K606277K444458
1645.3C33978729P35512L222275j007118L422508P15408K956734J524849l332520K775421
$$ plain form
1653.9 344991798 346090775 350086632 350926056 353668671 354925385 356779823 359080620 361001778
1661.6 361001778 364386635 364941025 368657494 370647278 373547935 376600609 379683762 384287643
1669.4 384287643 386192589 390845718 392497978 396781502 400798416 404785004 408433189 411166649
1677.1 411166649 415864525 419559441 424727669 427409286 431898994 438285789 443686180 449052925
1684.8 449052925 448785133 454149094 458512230 463016586 467424278 471300850 476344223 480996170
1692.5 480996170 486234283 491471329 497406006 498807526 503597984 509325752 514528122 518010254
1700.2 518010254 518597069 525893593 530853806 535360794 539063873 542214470 544579353 547039490
1707.9 547039490 551010666 554172668 556558151 558901901 561899109 565262184 566416969 566785202
$$ packed form
1653.9C44991798J098977L995857Q39424K742615J256714J854438K300797J921158
1661.6C61001778L384857N54390L716469J989784K900657L052674L083153M603881
1669.4C84287643J904946M653129J652260M283524M016914L986588L648185K733460
1677.1D11166649M697876L694916N168228K681617M489708O386795N400391N366745
1684.8D49052925k67792N363961M363136M504356M407692L876572N043373M651947
1692.5D80996170N238113N237046N934677J401520M790458N727768N202370L482132
1700.2E18010254N86815P296524M960213M506988L703079L150597K364883K460137
1707.9E47039490L971176L162002K385483K343750K997208L363075J154785L68233
$$ plain form
1715.6 566785202 570226517 572792091 568923378 572592278 576206856 578333549 579836311 580829391
1723.4 580829391 581430855 582604980 584515038 586207237 588347702 590733948 590759163 591016808 594662704
1732 594662704 598657341 597813759 594137611 597268333 601245270 604347801 607502022 608337669 607573242
1740.7 607573242 611300697 614000778 615283241 617714577 621657333 624710121 626894951 630132027
1748.4 630132027 631472626 635473862 637142448 637938538 642362823 645511932 649351807 653029861
1756.2 653029861 653633423 655152588 657895508 660381241 663685379 664094162 664744263 668265533 670145340
1764.8 670145340 671926041 673756027 675351868 674293823 676147842 680214539 680730209 679347458
1772.5 679347458 678168411 682298355 684943314 684445953 686666946 687693405 689133987 690079269 690042419
$$ packed form
1715.6E66785202L441315K565574l868713L668900L614578K126693J502762R93080
1723.4E80829391O01464J174125J910058J692199K140465K386246K5215K57645L645896
1732E94662704L994637q43582l676148L130722L976937L102531L154221Q35647p64427
1740.7F07573242L727455K700081J282463K431336L942756L052788K184830L237076
1748.4F30132027J340599M001236J668586P96090M424285L149109L839875L678054
1756.2F53029861O03562J519165K742920K485733L304138M08783O50101L521270J879807
1764.8F70145340J780701J829986J595841j058045J854019M066697N15670j382751
1772.5F79347458j179047M129944K644959m97361K220993J026459J440582R45282l6850
$$ plain form
1781.2 690042419 690787582 692107162 693981094 693730316 694073029 695524826 696698761 697617111 699464340
1789.9 699464340 700520096 700787201 699813309 698809814 702009506 703549957 703790436 704894485 706437607
1798.6 706437607 707392426 706450806 708102112 707887573 708715210 710596161 710901184 711716003 712035522
1807.3 712035522 712374420 713362427 715038223 714215012 714363098 715989380 716678391 718051224 718194656
1815.9 718194656 718617249 718420868 718917313 719982452 719975662 720917740 720941086 722648239 724282684 721870728
1825.6 721870728 721452560 723199692 725371780 725845032 723203964 723515778 725433044 725854645 726563950
1834.3 726563950 727437744 728145828 728498306 727616043 728307114 728315277 729000626 729668274 730940018 732736740
1843.9 732736740 728216705 729621887 731504364 731616516 731297531 731686554 732965775 733001633 733467865
$$ packed form
1781.2F90042419P45163J319580J873932k50778L42713J451797J173935R18350J847229
1789.9F99464340J055756K67105r73892j003495L199692J540451K40479J104049J543122
1798.6G06437607R54819r41620J651306k14539Q27637J880951L05023Q14819L19519
1807.3G12035522L38898R88007J675796q23211J48086J626282O89011J372833J43432
1815.9G18194656M22593j96381M96445J065139o790R42078K3346J707153J634445k411956
1825.6G21870728m18168J747132K172088M73252k641068L11814J917266M21601P09305
1834.3G26563950Q73794P08084L52478q82263O91071Q163O85349O67648J271744J796722
1843.9G32736740m520035J405182J882477J12152l18985L89023J279221L5858M66232
$$ plain form
1852.6 733467865 733314056 733792572 734038773 734030685 734750671 734692993 735263443 735034561 735536804 736025925
1862.2 736025925 736324921 736656189 736401520 737217636 737261734 738159943 737284012 735614014 736677094
1870.9 736677094 737740402 738341751 738015900 738544846 738569031 738473206 738581696 738924713 739759445 739990616
1880.6 739990616 740387802 739952698 740201035 740048523 739777298 740293045 740557175 741934280 741742020
1889.2 741742020 740172729 740209274 741116943 741534119 742096710 742422943 741305237 741908646 741882477 742007599
1898.9 742007599 742567291 742484894 742500763 742381897 743254471 743064117 742933426 742856293 742555008 742884064
1908.5 742884064 743191833 743711166 743315277 743756256 743449249 743265915 743636398 743912506 745278244
1917.2 745278244 743735046 742958374 743912964 744765472 745504303 744560242 743720779 743802567 744317169 744331207
$$ packed form
1852.6G33467865j53809M78516K46201q088P19986n7678N70450k28882N02243M89121
1862.2G36025925K98996L31268k54669Q16116M4098Q98209q75931j669998J063080
1870.9G36677094J063308O01349l25851N28946K4185r5825J08490L43017Q34732K31171
1880.6G39990616L97186m35104K48337j52512k71225N15747K64130J377105j92260
1889.2G41742020j569291L6545R07669M17176N62591L26233j117706O03409k6169J25122
1898.9G42007599N59692q2397J5869j18866Q72574j90354j30691p7133l01285L29056
1908.5G42884064L07769N19333l95889M40979l07007j83334L70483K76108J365738
1917.2G45278244j543198p76672R54590Q52508P38831r44061q39463Q1788N14602J4038
$$ plain form
1926.8 744331207 744792557 745034790 745161285 745269394 744940567 745156631 744328079 744183350 744203644 744295044
1936.5 744295044 744415359 744186401 744798279 744513245 745522690 745606613 743687134 744211807 744952698
1945.2 744952698 745015717 744547272 744891586 744917755 744740295 744434052 744025955 744201355 744464569 745184937
1954.8 745184937 744924927 744820099 744583435 744163818 744002609 743553543 743765945 743577118 744106903 744505081
1964.5 744505081 744569168 744736176 744205627 743913498 743449631 743606110 743653412 743876419 744074707 744174500
1974.1 744174500 744297485 743624802 743648529 743318634 743373871 743657990 743848343 744071579 743662491 744072266
1983.7 744072266 743699417 743101349 742915421 743070450 743268814 742814789 743157654 743259506 742739487 742357025
1993.4 742357025 742755890 742788086 742491837 742541656 742334900 742658691 742493286 742543335 742247467 741662445
$$ packed form
1926.8G44331207M61350K42233J26495J08109l28827K16064q28552j44729K0294R1400
1936.5G44295044J20315k28958O11878k85034J009445Q3923j919479N24673P40891
1945.2G44952698O3019m68445L44314K6169j77460l06243m08097J75400K63214P20368
1954.8G45184937k60010j04828k36664m19617j61209m49066K12402j88827N29785L98178
1964.5G44505081O4087J67008n30549k92129m63867J56479M7302K23007J98288R9793
1974.1G44174500J22985o72683K3727l29895N5237K84119J90353K23236m09088M09775
1983.7G44072266l72849n98068j85928J55029J98364m54025L42865J01852n20019l82462
1993.4G42357025L98865L2196k96249M9819k06756L23791j65405N0049k95868n85022
$$ plain form
2003 741662445 741609344 741456757 741677475 741252213 741211548 741213074 741208038 741112137 740691757 741003723 740976410
2013.6 740976410 741254501 741045532 740523605 740032349 740052719 740463104 739891815 739971771 739860992 740125732
2023.3 740125732 740033569 739122238 738805923 738588867 739072266 738984528 738899536 738797760 738772049 738862457
2032.9 738862457 738509750 738506012 737943802 737954178 737884674 737932205 738285217 738497620 738509598 737503891
2042.6 737503891 737508011 737032776 736755371 737060318 737235718 737797089 737275620 736988449 736523437 736488800
2052.2 736488800 736650620 736524887 736776276 736620331 736778107 736427460 736330719 736277847 736255112 736008377
2061.9 736008377 735430298 735815735 735363235 735421829 735790939 735751190 735538940 735102768 735248795 735213242
2071.5 735213242 735679779 735798874 735930328 735836029 735444107 735500412 735107880 735304642 735157318 735069656
$$ packed form
2003G41662445n3101j52587K20718m25262m0665J526n036r5901m20380L11966k7313
2013.6G40976410K78091k08969n21927m91256K0370M10385n71289P9956j10779K64740
2023.3G40125732r2163r11331l16315k17056M83399q7738q4992j01776k5711R0408
2032.9G38862457l52707l738n62210J0376o9504M7531L53012K12403J1978j005707
2042.6G37503891M120m75235k77405L04947J75400N61371n21469k87171m65012l4637
2052.2G36488800J61820j25733K51389j55945J57776l50647r6741n2872k2735k46735
2061.9G36008377n78079L85437m52500N8594L69110l9749k12250m36172J46027l5553
2071.5G35213242M66537J19095J31454r4299l91922N6305l92532J96762j47324q7662
$$ plain form
2081.1 735069656 734943466 734709244 734930649 734867096 734919434 734199982 733875580 734077530 734334335 734275284
2090.8 734275284 733908997 734063721 733985443 734132767 733673706 733522186 733632965 733489380 733462372 732949600
2100.4 732949600 733095856 732892761 732807922 732803650 732805099 732758713 732307358 732573318 732125854 731945343 731778107
2111 731778107 731912231 732422562 732095184 732178497 731759186 731586456 731447906 731090164 730722351 730845032
2120.7 730845032 731571274 731312561 731460876 731436081 731317902 731026764 730816040 731000671 730589371 730880966
2130.3 730880966 730841522 731237030 731416779 731134338 731215286 730570145 730526962 730513840 731130753 731532974
2140 731532974 731402206 731420670 730820312 730682449 730348434 730321655 730327530 730534210 730988388 731094055 731346741
2150.6 731346741 731071548 731046829 730723343 730764236 730966187 730870743 731359024 731509476 731642380 731214371
$$ packed form
2081.1G35069656j26190k34222K21405o3553N2338p19452l24402K01950K56805n9051
2090.8G34275284l66287J54724p8278J47324m59061j51520J10779j43585k7008n12772
2100.4G32949600J46256k03095q4839m272J449m6386m51355K65960m47464j80511j67236
2111G31778107J34124N10331l27378Q3313m19311j72730j38550l57742l67813J22681
2120.7G30845032P26242k58713J48315k4795j18179k91138k10724J84631m11300K91595
2130.3G30880966l9444L95508J79749k82441Q0948o45141m3183j3122O16913M02221
2140G31532974j30768J8464o00358j37863l34015k6779N875K06680M54178J05667K52686
2150.6G31346741k75193k4719l23486M0893K01951r5444M88281J50452J32904m28009
$$ plain form
2160.2 731214371 731084061 731216583 731136780 731193008 731122131 731453247 731332703 731454773 731459427 731132431
2169.9 731132431 731043167 731161346 731597061 731658707 731977997 732121506 732198410 731776657 731293335 731398926
2179.5 731398926 731247253 731542664 731801300 732523956 732678070 732058563 731801834 731870651 732427826 732185822
2189.1 732185822 732056732 731933289 732123108 732638626 732741623 732812042 732097473 732004547 732231598 732698441
2198.8 732698441 732975388 732728424 732989044 732999496 732985382 732374802 732417526 732840576 732848358 733096771
2208.4 733096771 733033371 733426666 733425522 733183594 732896042 732907104 733246536 733264465 733386841 733325500 733746262
2219 733746262 733320999 732824554 733107605 733252945 733482742 733302917 733438873 733233643 733237762 733229218 733113861
2229.7 733113861 733561401 733481140 733618469 733471375 733338394 733169708 733294907 733455963 732805023 732801895
$$ packed form
2160.2G31214371j30310J32522p9803N6228p0877L31116j20544J22070M654l26996
2169.9G31132431q9264J18179M35715O1646L19290J43509P6904m21753m83322J05591
2179.5G31398926j51673K95411K58636P22656J54114o19507k56729O8817N57175k42004
2189.1G32185822j29090j23443J89819N15518J02997P0419p14569r2926K27051M66843
2198.8G32698441K76947k46964K60620J0452j4114o10580M2724M23050P782K48413
2208.4G33096771o3400L93295j144k41928k87552J1062L39432J7929J22376o1341M20762
2219G33746262m25263m96445K83051J45340K29797j79825J35956k05230M119q544j15357
2229.7G33113861M47540q0261J37329j47094j32981j68686J25199J61056o50940l128
$$ plain form
2239.3 732801895 732850113 733285522 733424530 733386536 733435135 732997818 733015900 732859421 733222046 733482208
2248.9 733482208 733431549 733350906 733526230 733891296 733347473 733206711 733060837 733124237 732981873 732890167
2258.6 732890167 733125534 732896652 733284836 732934799 732744827 732899246 733124542 733523026 733577728 733987503
2268.2 733987503 733462067 733242569 733028412 732629013 732583618 732450638 732777863 732699432 732942276 732941360
2277.9 732941360 732917252 732712555 732428513 732581253 732254944 732643585 732428894 732438202 732727966 732616119
2287.5 732616119 732795105 732226791 732249985 732150345 732297516 732580032 732805634 733029938 732370529 732546234
2297.2 732546234 731969833 731655960 732253113 732469254 732713928 732739563 733312912 733431702 733498077 733270187
2306.8 733270187 733125458 733504181 733170700 733489914 733819199 734075470 734265747 734584045 734945679 734743347
$$ packed form
2239.3G32801895M8218M35409J39008l7994M8599m37317J8082j56479L62625K60162
2248.9G33482208n0659q0643J75324L65066n43823j40762j45874O3400j42364r1706
2258.6G32890167K35367k28882L88184l50037j89972J54419K25296L98484N4702M09775
2268.2G33987503n25436k19498k14157l99399m5395j32980L27225p8431K42844r16
2277.9G32941360k4108k04697k84042J52740l26309L88641k14691R308K89764j11847
2287.5G32616119J78986n68314K3194r9640J47171K82516K25602K24304o59409J75705
2297.2G32546234n76401l13873N97153K16141K44674K5635N73349J18790O6375k27890
2306.8G33270187j44729L78723l33481L19214L29285K56271J90277L18298L61634k02332
$$ plain form
2316.4 734743347 734804611 734835052 735670242 736647720 736623764 735962601 735810776 735382767 734545364 735136261
2326.1 735136261 735657425 736124496 736389694 736568146 736120987 735676346 736319580 736334457 736674881 737071609
2335.7 737071609 737308350 736313934 736139984 737273407 736823883 736324463 736193390 736452789 735682144
2344.4 735682144 735031509 734075089 732415619 731565247 731700821 733529663 734381256 734816971 735991058
2353.1 735991058 736857071 737607880 737483521 739220657 739277115 738565140 737024612 737050018 737440414 734521103
2362.7 734521103 735875778 737649765 737547684 735740356 733864822 732589874 731954498 732057037 730448380
2371.4 730448380 730062866 729092712 728404312 727858734 726488342 725783157 724714355 724414673 723576584
2380.1 723576584 722860336 722270889 721275253 720843430 720187759 720063019 719659958 719502411 719563293 719239426
$$ packed form
2316.4G34743347O1264L0441Q35190R77478k3956o61163j51825m28009q37403N90897
2326.1G35136261N21164M67071K65198J78452m47159m44641O43234J4877L40424L96728
2335.7G37071609K36741r94416j73950J133423m49524m99420j31073K59399p70645
2344.4G35682144o50635r56420j659470q50372J35574J828842Q51593M35715J174087
2353.1G35991058Q66013P50809j24359J737136N6458p11975j540528K5406L90396k919311
2362.7G34521103J354675J773987j02081j807328j875534j274948o35376J02539j608657
2371.4G30448380l85514r70154o88400n45578j370392p05185j068802k99682q38089
2380.1G23576584p16248n89447r95636m31823o55671j24740m03061j57547O0882l23867
$$ plain form
2389.7 719239426 719127655 718471146 718142471 717965240 717945404 717778397 717477341 717266998 716748581 716580963
2399.4 716580963 716208115 716247330 716482162 716436157 716081314 715677109 715462646 714957199 715141068 715036087
2409 715036087 714674149 714232864 713708725 713473740 712749786 712456970 712467804 712718964 712557678 712250061
2418.7 712250061 712017670 711308899 711146317 710916748 710876160 710523605 710353088 710476913 709848785 709208679
2428.3 709208679 708413620 708573456 708624496 708295441 708165665 707688828 707746048 707749634 707677536 706991806
2438 706991806 706270065 705970688 705590210 705690765 705824738 705605621 704812851 704615402 704552917 704110794
2447.6 704110794 703782654 703300705 702963104 702585831 702755508 702440720 701733627 701271057 700907288 700980682
2457.2 700980682 700398102 700068207 700007172 699835968 699425735 698838120 698576202 697938461 697502747 696942444
$$ packed form
2389.7G19239426j11771o56509l28675j77231j9836j67007l01056k10343n18417j67618
2399.4G16580963l72848L9215K34832m6005l54843m04205k14463n05447J83869j04981
2409G15036087l61938m41285n24139k34985p23954k92816J0834K51160j61286l07617
2418.7G12250061k32391p08771j62582k29569m0588l52555j70517J23825o28128o40106
2428.3G09208679p95059J59836N1040l29055j29776m76837N7220L586p2098o85730
2438G06991806p21741k99377l80478J00555J33973k19117p92770j97449o2485m42123
2447.6G04110794l28140m81949l37601l77273J69677l14788p07093m62570l63769P3394
2457.2G00980682n82580l29895o1035j71204m10233n87615k61918o37741m35714n60303
$$ plain form
2466.9 696942444 696616898 696405869 696263046 696425400 695942383 695770569 695111465 694213867 693814621 693363800
2476.5 693363800 693284760 693165512 693044586 692824249 692185516 691399002 691243744 691070328 690512238 690139313
2486.2 690139313 689722061 689508286 688958817 688531647 688485718 688399124 687839584 686844254 686373978 686018906
2495.8 686018906 685976868 685606995 685093536 684821625 684283829 684034042 683565979 683218613 682697983 682129898
2505.5 682129898 681678543 681005478 680822220 680697861 680500488 679885254 679343872 678941803 678543396 678537750
2515.1 678537750 678304825 677847595 677022018 676648636 676433258 676117172 676089401 675628281 675095139 674701157
2524.7 674701157 674410553 673935699 673782272 673420105 672826233 672744675 672082367 671549835 671255493 671036835
2534.4 671036835 670669250 670130920 669949951 669653931 669570999 669152908 668579636 667785263 666945267 666808624
$$ packed form
2466.9F96942444l25546k11029j42823J62354m83017j71814o59104q97598l99246m50821
2476.5F93363800p9040j19248j20926k20337o38733p86514j55258j73416n58090l72925
2486.2F90139313m17252k13775n49469m27170m5929q6594n59540r95330m70276l55072
2495.8F86018906m2038l69873n13459k71911n37796k49787m68063l47366n20630n68085
2505.5F82129898m51355o73065j83258j24359j97373o15234n41382m02069l98407n646
2515.1F78537750k32925m57230q25577l73382k15378l16086k7771m61120n33142l93982
2524.7F74701157k90604m74854j53427l62167n93872q1558o62308n32532k94342k18658
2534.4F71036835l67585n38330j80969k96020q2932m18091n73272p94373q39996j36643
$$ plain form
2544 666808624 666960831 667249680 666954498 666433640 665805740 665252151 664527664 663865967 664072952 663934937
2553.7 663934937 663723297 663334579 663001785 662622452 661829910 661323471 660799332 660679245 660342102 659859467
2563.3 659859467 659357147 659236832 659485092 658607025 657713470 657303009 657389984 657206039 656688385 656416702
2573 656416702 655876236 655704498 655489502 655357285 654917297 654143295 653874969 653983688 653823013 652883835
2582.6 652883835 652625885 652347946 651918030 651721573 650870667 650352478 650248337 650063019 649580841 649245071
2592.2 649245071 648880157 648490295 648183670 647627487 647302322 646852798 646592026 646183701 645890198 645683441
2601.9 645683441 645013123 644667816 644095688 643644791 643292236 643066330 642645645 641949005 641880341 641497879
2611.5 641497879 640919037 640192490 639769974 639594574 639306602 639040031 638194771 637802773 637593727 637154961
$$ packed form
2544F66808624J52207K88849k95182n20858o27900n53589p24487o61697K06985j38015
2553.7F63934937k11640l88718l32794l79333p92542n06439n24139j20087l37143m82635
2563.3F59859467n02320j20315K48260q78067q93555m10461Q6975j83945n17654k71683
2573F56416702n40466j71738k14996j32217m39988p74002k68326J08719j60675r39178
2582.6F52883835k57950k77939m29916j96457q50906n18189j04141j85318m82178l35770
2592.2F49245071l64914l89862l06625n56183l25165m49524k60772m08325k93503k06757
2601.9F45683441o70318l45307n72128m50897l52555k25906m20685o96640o8664l82462
2611.5F41497879n78842p26547m22516j75400k87972k66571q45260l91998k09046m38766
$$ plain form
2621.2 637154961 636643028 636045494 635409851 634981384 634967270 634295273 633704033 633332596 633013496 632489166
2630.8 632489166 631727028 631641846 631204910 630565720 629962196 629818192 629837952 629241104 628669205 628248863
2640.5 628248863 628118362 627263908 626293526 625701370 625498161 625732384 625230827 624859047 624388504 623778648
2650.1 623778648 623199272 622545013 622415428 622325058 622172127 621769791 621299744 620701256 620266533 619902191
2659.8 619902191 619380836 618942833 618349228 618230782 617939186 617720757 617579765 617060928 616633301 616134491
2669.4 616134491 616205101 616095161 615662956 615042801 614415741 614240685 614159584 614175301 613378601 612589989
2679 612589989 611966782 611615601 611882782 611552925 611245193 611028328 610674210 610021477 609622231 609632759
2688.7 609632759 609374428 609117012 608426094 607942352 607769318 607588348 607410545 606918564 606319275 605844917
$$ packed form
2621.2F37154961n11933n97534o35643m28467j4114o71997n91240l71437l19100n24330
2630.8F32489166p62138q5182m36936o39190o03524j44004J9760n96848n71899m20342
2640.5F28248863j30501q54454r70382n92156k03209K34223n01557l71780m70543o09856
2650.1F23778648n79376o54259j29585r0370j52931m02336m70047n98488m34723l64342
2659.8F19902191n21355m38003n93605j18446k91596k18429j40992n18837m27627m98810
2669.4F16134491P0610j09940m32205o20155o27060j75056q1101J5717p96700p88612
2679F12589989o23207l51181K67181l29857l07732k16865l54118o52733l99246J0528
2688.7F09632759k58331k57416o90918m83742j73034j80970j77803m91981n99289m74358
$$ plain form
2698.3 605844917 605611420 605157089 604851074 604629250 604461174 604318695 604029961 603804207 603173561 602735100
2708 602735100 602348938 602187843 602085915 601592216 601254425 600872078 600866051 600676346 600344086 600073280
2717.6 600073280 599640045 599058037 598746033 599190941 598734207 598206711 598108177 598057289 597936478 597147064
2727.3 597147064 596967773 596666031 596289787 596005096 595579529 595449219 595228043 595291824 594948883 594686470
2736.9 594686470 594715729 594514046 594048538 593588486 593750839 593533554 593160324 592627983 592163086 592306671
2746.5 592306671 592415314 592135010 591555672 591512985 591388893 591139412 590844002 590505981 590438499 590103798
2756.2 590103798 589793091 589240685 589257011 589512367 588796234 588081627 587729530 587454681 587216301 587092094
2765.8 587092094 586588249 586335907 586428070 586089973 585729218 585601578 585410881 584851913 584808006 584450073
$$ packed form
2698.3F05844917k33497m54331l06015k21824j68076j42479k88734k25754o30646m38461
2708F02735100l86162j61095j01928m93699l37791l82347o027j89705l32260k70806
2717.6F00073280m33235n82008l12004M44908m56734n27496r8534n0888j20811p89414
2727.3E97147064j79291l01742l76244k84691m25567j30310k21176O3781l42941k62413
2736.9E94686470K9259k01683m65508m60052J62353k17285l73230n32341m64897J43585
2746.5E92306671J08643k80304n79338m2687j24092k49481k95410l38021o7482l34701
2756.2E90103798l10707n52406J6326K55356p16133p14607l52097k74849k38380j24207
2765.8E87092094n03845k52342R2163l38097l60755j27640j90697n58968m3907l57933
$$ plain form
2775.5 584450073 583699799 583384666 582823296 582478981 582238731 582235718 581849976 580989609 580272789 579757690
2785.1 579757690 579851913 579509583 579160767 578752136 578039131 577475891 576766129 576237297 575793076 575758667
2794.8 575758667 575285149 574386673 573760262 573206444 572900505 572199707 571361198 570765686 570433464 569597168
2804.4 569597168 568653564 568469048 568153992 567620850 566796303 566230392 565425262 564408073 563961906
2813.1 563961906 563346710 562758102 562135735 561780434 561302338 560346069 559431038 558698845 558127480 557163086
2822.7 557163086 556480637 555799217 554871025 554200058 553527489 552717133 551611824 550718117 550005264
2831.4 550005264 549349670 548629341 547899818 546994934 545852394 544857559 543531532 542227440 540519714
2840.1 540519714 538920135 537834511 536172180 534545746 532992935 531415749 529735222 527937508
$$ packed form
2775.5E84450073p50274l15133n61370l44315k40250l013l85742q60367p16820n15099
2785.1E79757690R4223l42330l48816m08631p13005n63240p09762n28832m44221l4409
2794.8E75758667m73518q98476o26411n53818l05939p00798q38509n95512l32222q36296
2804.4E69597168r43604j84516l15056n33142q24547n65911q05130j017189m46167
2813.1E63961906o15196n88608o22367l55301m78096r56269r15031p32193n71365r64394
2822.7E57163086o82449o81420r28192o70967o72569q10356j105309q93707p12853
2831.4E50005264o55594p20329p29523r04884j142540r94835j326027j304092j707726
2840.1E40519714j599579j085624j662331j626434j552811j577186j680527j797714
$$ plain form
2847.8 527937508 525731850 523310471 521591606 520355873 519427757 518090820 517412491 517528915 517110138
2856.5 517110138 516848106 516731834 516631889 516426010 516244125 515779991 515071678 514673538 514078064 513236008
2866.1 513236008 512143478 511369743 510857849 510230103 509436035 508566933 508031387 507158279 506142464
2874.8 506142464 505444527 504978218 504542046 503980255 503105354 502171555 501670189 501073647 500640030 499924049
2884.4 499924049 498910179 497864037 496600075 496002617 495329704 494368286 493258934 492162971 491340790
2893.1 491340790 490555801 490248566 489440498 487976952 486897469 486497459 485983734 485036354 484076653
2901.8 484076653 483192673 482960129 482378731 481743660 481467705 480286865 479262810 478956947 477941399
2910.5 477941399 476063957 474957314 474017715 472302284 470568314 469184151 468011436 466452751
$$ packed form
2847.8E27937508k205658k421379j718865j235733r28116j336937o78329J16424m18777
2856.5E17110138k62032j16272r9945k05879j81885m64134p08313l98140n95474q42056
2866.1E13236008j092530p73735n11894o27746p94068q69102n35546q73108j015815
2874.8E06142464o97937m66309m36172n61791q74901r33799n01366n96542m33617p15981
2884.4D99924049j013870j046142j263962n97458o72913r61418j109352j095963q22181
2893.1D91340790p84989l07235q08068j463546j079483m00010n13725r47380r59701
2901.8D84076653q83980k32544n81398o35071k75955j180840j024055l05863j015548
2910.5D77941399j877442j106643r39599j715431j733970j384163j172715j558685
$$ plain form
2918.2 466452751 465235825 464073143 462826996 462501678 461949043 460637207 460004120 460514183 460806923
2926.9 460806923 460725441 460489426 460304222 460099869 459737587 460182343 460732460 461326218 462065735 462591743
2936.5 462591743 462846146 463057098 464089279 464880905 465236092 465719757 466894608 468052673 468206406
2945.2 468206406 468807487 469417572 469947319 470497246 470944633 471590996 471784439 472006874 471995621 472434540
2954.8 472434540 473519096 473840523 473822708 474172096 474948196 475533867 476101303 476840210 477057610 477281189
2964.5 477281189 478063812 478606873 479072571 479857559 480474663 481328163 482076492 482284470 482457809 483077240
2974.1 483077240 484004478 484749336 485164642 485199547 485669670 486165199 486305847 486300087 486029892 486435242
2983.8 486435242 487119026 487447929 487411270 487424927 487711182 487772484 487585564 487397537 487390404 487183914
$$ packed form
2918.2D66452751j216926j162682j246147l25318n52635j311836o33087N10063K92740
2926.9D60806923q1482k36015j85204k04353l62282M44756N50117N93758P39517N26008
2936.5D62591743K54403K10952J032181P91626L55187M83665J174851J158065J53733
2945.2D68206406O01081O10085N29747N49927M47387O46363J93443K22435j1253M38919
2954.8D72434540J084556L21427j7815L49388P76100N85671N67436P38907K17400K23579
2964.5D77281189P82623N43061M65698P84988O17104Q53500P48329K07978J73339O19431
2974.1D83077240R27238P44858M15306L4905M70123M95529J40648n760k70195M05350
2983.8D86435242O83784L28903l6659J3657K86255O1302j86920j88027p133k06490
$$ plain form
2993.4 487183914 487406082 487475662 487081947 486831398 486131096 485648460 485128136 484995537 485067177 484585037
3003.1 484585037 484172440 483351784 482639732 482107506 481869583 481490479 480695496 480302086 479872093 479555702
3012.7 479555702 479076118 478546371 477585068 476490211 476061058 475508652 475147972 474606514 473895493
3021.4 473895493 472941704 472082176 471728477 470895805 470113640 469154587 468272324 467889938 467211952 466313972
3031 466313972 465875168 465989914 465489616 464501724 463690758 462732315 461742935 461222420 460579147 459640388
3040.7 459640388 458952332 458143501 457235832 456040192 455140381 454486122 453834000 453436813 452389450
3049.4 452389450 451427345 450484352 449745903 449285088 448523369 447942314 446794739 445824318 445201797
3058 445201797 444593506 443955498 442918663 442057838 441104889 440640297 440299606 439703178 439043541 438016548
$$ packed form
2993.4D87183914K22168O9580l93715k50549p00302m82636n20324j32599P1640m82140
3003.1D84585037m12597q20656p12052n32226k37923l79104p94983l93410m29993l16391
3012.7D79555702m79584n29747r61303j094857m29153n52406l60680n41458p11021
3021.4D73895493r53789q59528l53699q32672p82165r59053q82263l82386o77986q97980
3031D66313972m38804J14746n00298r87892q10966r58443r89380n20515o43273r38759
3040.7D59640388o88056q08831r07669j195640q99811o54259o52122l97187j047363
3049.4D52389450r62105r42993p38449m60815p61719n81055j147575r70421o22521
3058D45201797o08291o38008j036835q60825r52949m64592l40691n96428o59637j026993
$$ plain form
3067.7 438016548 437326622 436655960 436235733 435793037 434737587 433903580 433589287 433109016 432137184
3076.4 432137184 431578178 431286469 430497208 429378014 428670959 428272476 427558327 426726990 426079521
3085 426079521 425612755 424676628 423707542 423290100 422869720 422214050 421798744 421390457 420297890 419520836
3094.7 419520836 418885193 418200874 417770271 417016335 416115379 415062065 414577789 414349251 413771439
3103.4 413771439 412794456 411657372 411174393 410660858 410337791 409812050 408431549 407313957 407048225
3112 407048225 406920547 406171494 405376511 404479256 403998070 403678513 402682343 401706963 400879898 400327415
3121.7 400327415 399418945 398439026 397725754 396795006 396254997 395689621 394779854 394083824 393592834 392771606
3131.3 392771606 392061920 391085892 389805717 389519119 389176483 388576164 387858543 386769981 385718651
$$ packed form
3067.7D38016548o89926o70662m20227m42696j055450q34007l14293m80271r71832
3076.4D32137184n59006k91709p89261j119194p07055l98483p14149q31337o47469
3085D26079521m66766r36127r69086m17442m20380o55670m15306m08287j092567p77054
3094.7D19520836o35643o84319m30603p53936r00956j053314m84276k28538n77812
3103.4D13771439r76983j137084m82979n13535l23067n25741j380501j117592k65732
3112D07048225j27678p49053p94983q97255m81186l19557r96170r75380q27065n52483
3121.7D00327415r08470r79919p13272r30748n40009n65376r09767o96030m90990q21228
3131.3C92771606p09686r76028j280175k86598l42636o00319p17621j088562j051330
$$ plain form
3140 385718651 384573708 383805351 383008308 381890678 381208839 380979309 380455551 379730415 379150505 378521233
3149.6 378521233 378024368 377420006 376778069 376007080 375161057 374217682 373091698 372254295 371174355
3158.3 371174355 370301971 369721909 368996506 368426895 367901726 367177963 366142540 365422974 364348145
3167 364348145 363234291 363112869 362646790 361486626 360474625 359725952 358955688 358578987 358185577
3175.7 358185577 357320824 356337585 355485153 355008926 353935852 352757607 352051697 351508255 351106529
3184.4 351106529 350358620 349862404 349253120 348114853 347137299 346459236 345741272 345114784 344749947
3193 344749947 343975639 343204613 342315636 341320686 340754967 340185242 339781570 339215660 338398819 337662506
3202.7 337662506 337015572 336239090 335609398 335313072 334436646 333726463 333599319 333201599 332498169 331831284
$$ packed form
3140C85718651j144943p68357p97043j117630o81839k29530n23758p25136n79910o29272
3149.6C78521233m96865o04362o41937p70989q46023r43375j125984q37403j079940
3158.3C71174355q72384n80062p25403n69611n25169p23763j035423p19566j074829
3167C64348145j113854j21422m66079j160164j012001p48673p70264l76701l93410
3175.7C58185577q64753r83239q52432m76227j073074j178245p05910n43442m01726
3184.4C51106529p47909m96216o09284j138267r77554o78063p17964o26488l64837
3193C44749947p74308p71026q88977r94950n65719n69725m03672n65910q16841p36313
3202.7C37662506o46934p76482o29692k96326q76426p10183j27144l97720p03430o66885
$$ plain form
3212.3 331831284 331682739 331273804 329679871 328262634 327920647 327726746 327675896 327553635 326716080
3221 326716080 325689659 324633636 323808746 323544388 323541527 323037376 322360077 321781349 320991020 320508652
3230.7 320508652 319834995 319402218 319144878 318112602 317456989 317180538 316593399 315942249 315499973
3239.3 315499973 315138168 314621334 314253216 314138126 313785038 313020992 312185993 311355724 310842896 310259037
3249 310259037 309591370 309579506 309525719 308877010 308072395 307812977 307602654 306905403 306156597 305789375
3258.6 305789375 305671463 305064716 304498749 303932343 303235321 302986946 302705669 302297115 301855335 301552734
3268.3 301552734 301324997 301199818 301017418 300509491 299855938 298844585 298629913 298851795 297882080
3276.9 297882080 297159538 297441025 297283230 296851063 296511593 295644073 294722919 294151039 294225845 294298286
$$ packed form
3212.3C31831284j48545m08935j593933j417237l41987j93901n0850j22261q37555
3221C26716080j026421j056023q24890k64358k861n04151o77299n78728p90329m82368
3230.7C20508652o73657m32777k57340j032276o55613k76451n87139o51150m42276
3239.3C15499973l61805n16834l68118j15090l53088p64046q34999q30269n12828n83859
3249C10259037o67667j1864n3787o48709q04615k59418k10323o97251p48806l67222
3258.6C05789375j17912o06747n65967n66406o97022k48375k81277m08554m41780l02601
3268.3C01552734k27737j25179j82400n07927o53553j011353k14672K21882r69715
3276.9B97882080p22542K81487j57795m32167l39470q67520r21154n71880P4806P2441
$$ plain form
3286.6 294298286 294029007 293907757 293314266 293011608 292786255 292082348 291735077 291743774 291592388 291064682
3296.2 291064682 290963039 290941391 290624771 289765434 288760262 288675537 288652763 288649769 288282967 287510509
3305.9 287510509 286973267 286532936 286216412 285756245 285442009 284793739 284457588 284869938 284698372 284102974
3315.5 284102974 283392887 282377567 281376400 281482697 281450481 280554085 280004711 279418774 279034653
3324.2 279034653 278704700 278361454 277945271 277476578 276874752 275652218 275144482 274734707 274172935
3332.9 274172935 273922424 273135242 272380619 271923790 271602783 270628815 269464684 269310436 269149284
3341.6 269149284 268518009 268119011 267694168 267044296 266759720 266209526 265532017 265075436 264420929 263979492
3351.2 263979492 263471279 263140049 262844830 262248135 261749325 261704636 261956348 261272087 260868073 261041451
$$ packed form
3286.6B94298286k69279j21250n93491l02658k25353p03907l47271Q697j51386n27706
3296.2B91064682j01643k1648l16620q59337j005172q4725k2774k994l66802p72458
3305.9B87510509n37242m40331l16524m60167l14236o48270l36151M12350j71566n95398
3315.5B84102974p10087j015320j001167J06297l2216q96396n49374n85937l84121
3324.2B79034653l29953l43246m16183m68693o01826j222534n07736m09775n61772
3332.9B74172935k50511p87182p54623m56829l21007r73968j164131j54248j61152
3341.6B69149284o31275l98998m24843o49872k84576n50194o77509m56581o54507m41437
3351.2B63979492n08213l31230k95219n96695m98810m4689K51712o84261m04014J73378
$$ plain form
3360.8 261041451 260220356 259522667 259276218 258887005 258845348 258900623 258166676 257304516 257250404 257221031
3370.5 257221031 256839943 256525249 256209087 255810947 255381260 255142708 255368671 255026054 253832550
3379.2 253832550 253563824 254134216 254102287 253798599 253527126 253245354 253638306 253728809 253131161 252855568
3388.8 252855568 252763386 252881680 252758350 252586021 252620544 252066193 251715107 251811428 251854630 251752949
3398.4 251752949 251309166 250933266 251017113 251079884 250970402 250743465 250520954 250946789 251147614 250930367
3408.1 250930367 251080074 251038322 250826244 250928364 251235504 251034069 251028461 251309891 251023350 251157398
3417.7 251157398 251612225 251958427 252089863 252142544 252111416 251817780 252275734 252663727 252688541 252972641
3427.4 252972641 253015137 253346081 253940792 254010105 254039345 254468460 254928741 255399189 255521832 255475750
$$ packed form
3360.8B61041451q21095o97689k46449l89213m1657N5275p33947q62160n4112k9373
3370.5B57221031l81088l14694l16162l98140m29687k38552K25963l42617j193504
3379.2B53832550k68726N70392l1929l03688k71473k81772L92952R0503n97648k75593
3388.8B52855568r2182J18294j23330j72329L4523n54351l51086R6321M3202j01681
3398.4B51752949m43783l75900Q3847O2771j09482k26937k22511M25835K00825k17247
3408.1B50930367J49707m1752k12078J02120L07140k01435n608K81430k86541J34048
3417.7B51157398M54827L46202J31436N2681l1128k93636M57954L87993K4814K84100
3427.4B52972641M2496L30944N94711O9313K9240M29115M60281M70448J22643m6082
$$ plain form
3437 255475750 255644684 256094437 257033062 257742767 257962093 257845764 258269253 258672123 258901386 260134239
3446.7 260134239 260264854 259942074 260512314 261028404 261499386 261956329 262822208 263241272 263723488 264774952
3456.3 264774952 265385799 265902882 266482162 267145233 267830257 268644447 269180279 269753513 270600815 271014614
3466 271014614 271653843 272379074 272844925 273257790 273997631 274932060 275571136 276149406 276894836 277708130
3475.6 277708130 277890167 278677311 280064640 281078873 282220764 283093319 283850536 284031296 284598866
3484.3 284598866 285524349 286266556 287876930 288527031 288621941 289656162 290718117 291412525 292060623
3493 292060623 293093643 294054489 295126209 296106644 296850052 297378712 298137627 299650879 300503902
3501.6 300503902 301027870 301866779 302351589 303148003 304506912 305685139 306661072 307699337 308330517
$$ packed form
3437B55475750J68934M49753R38625P09705K19326j16329M23489M02870K29263J232853
3446.7B60134239J30615l22780N70240N16090M70982M56943Q65879M19064M82216J051464
3456.3B64774952O10847N17083N79280O63071O85024Q14190N35832N73234Q47302M13799
3466B71014614O39229P25231M65851M12865P39841R34429O39076N78270P45430Q13294
3475.6B77708130J82037P87144J387329J014233J141891Q72555P57217J80760N67570
3484.3B84598866R25483P42207J610374O50101R4910J034221J061955O94408O48098
3493B92060623J033020R60846J071720R80435P43408N28660P58915J513252Q53023
3501.6C00503902N23968Q38909M84810P96414J358909J178227R75933J038265O31180
$$ plain form
3510.3 308330517 309079762 310311432 311808014 312996159 313839645 314759026 316101227 317765217 318586712
3519 318586712 319029408 319796829 321000748 322239304 323265610 324541702 325423241 326569138 327729988
3527.7 327729988 328955421 330389786 331756630 333215294 334175682 335514145 336698837 338180466
3535.4 338180466 339620438 340193176 341485863 342504692 343634720 344882164 346514702 348376656
3543.1 348376656 349910812 351613998 352823639 354027328 354131165 355855370 358068962 359824677
3550.8 359824677 362334328 362333527 363454018 365071487 366413956 368499985 370209312 372641907 374024544
3559.5 374024544 375238953 376303291 378555870 380420990 380263443 384032249 386769218 387076149 387741661
3568.2 387741661 388334007 391336861 393119850 395195198 397079582 398719254 400582619 402833443
$$ packed form
3510.3C08330517P49245J231670J496582J188145Q43486R19381J342201J663990Q21495
3519C18586712M42696P67421J203919J238556J026306J276092Q81539J145897J160850
3527.7C27729988J225433J434365J366844J458664R60388J338463J184692J481629
3535.4C38180466J439972N72738J292687J018829J130028J247444J632538J861954
3543.1C48376656J534156J703186J209641J203689J03837J724205K213592J755715
3550.8C59824677K509651q01J120491J617469J342469K086029J709327K432595J382637
3559.5C74024544J214409J064338K252579J865120j57547L768806K736969L06931O65512
3568.2C87741661N92346L002854J782989K075348J884384J639672J863365K250824
$$ plain form
3575.9 402833443 405971222 407340546 409496536 411490669 412526436 414459457 416734161 418803902
3583.6 418803902 419883919 423414307 426221428 426508713 428833923 429739723 432979774 436020050 437995605
3592.3 437995605 438759956 439979477 444002533 444828949 447284355 451110001 452874756 455958176 457363243
3601 457363243 458985901 461568604 463334999 466026001 469798889 473366585 473460579 476547203 477500114
3609.6 477500114 476906281 483358498 486320229 486520576 491010666 491622887 495152435 499522438 501422882
3618.3 501422882 503577957 503802719 506254005 510547295 513862648 515772209 518891602 522317238
3626 522317238 525278015 532640648 535098343 526108170 529816284 534492912 540323296 543361740 542631226
3634.7 542631226 545336800 549099007 552167587 553976097 556362076 559667015 563026733 565626869
$$ packed form
3575.9D02833443L137779J369324K155990J994133J035767J933021K274704K069741
3583.6D18803902J080017L530388K807121K87285K325210R05800L240051L040276J975555
3592.3D37995605P64351J219521M023056Q26416K455406L825646J764755L083420J405067
3601D57363243J622658K582703J766395K691002L772888L567696R3994L086624R52911
3609.6D77500114n93833O452217K961731K00347M490090O12221L529548M370003J900444
3618.3E01422882K155075K24762K451286M293290L315353J909561L119393L425636
3626E22317238K960777P362633K457695q990173L708114M676628N830384L038444p30514
3634.7E42631226K705574L762207L068580J808510K385979L304939L359718K600136
$$ plain form
3642.4 565626869 567379303 570173492 574452667 580248222 579320602 578041153 585382042 585820961 583018761
3651.1 583018761 583560982 589908218 595013962 599007607 604829865 599735565 601666260 606563187
3658.8 606563187 608417740 611360168 612317657 614572105 616542320 618316727 620576897 622109489
3666.5 622109489 627050819 630040207 630323105 631730461 626663399 629151802 636767540 645699844
3674.3 645699844 645633545 629079704 632710228 640570679 645475845 643410263 643726273 646663971 648591385
3682.9 648591385 650438995 651635284 652474823 656223679 662368927 654391098 651571426 659679031
3690.6 659679031 655129929 655586090 660193253 660920868 663497543 664347916 663722534 665129395 665998611
3699.3 665998611 668343735 670826263 666121216 665183563 669788895 670736923 671000214 671984177 674447784
$$ packed form
3642.4E65626869J752434K794189M279175N795555r27620j279449P340889M38919k802200
3651.1E83018761N42221O347236N105744L993645N822258n094300J930695M896927
3658.8F06563187J854553K942428R57489K254448J970215J774407K260170J532592
3666.5F22109489M941330K989388K82898J407356n067062K488403P615738Q932304
3674.3F45699844o6299j6553841L630524P860451M905166k065582L16010K937698J927414
3682.9F48591385J847610J196289Q39539L748856O145248p977829k819672Q107605
3690.6F59679031m549102M56161M607163P27615K576675Q50373o25382J406861Q69216
3699.3F65998611K345124K482528m705047r37653M605332R48028K63291R83963K463607
$$ plain form
3708 674447784 677655182 671035233 674096909 677174911 666133957 671026230 675870209 676819687 677691574
3716.7 677691574 680189819 681359634 678017349 678932190 684540558 682841492 678355408 682221451
3724.4 682221451 682948074 683185883 682079926 681203613 683931427 685617828 691946487 689712143 682070923
3733.1 682070923 691449203 693648300 684072495 683562698 685595932 684811325 686475983 690302353 687330933
3741.8 687330933 689972534 699657516 688363953 675637589 685462265 691008148 696086884 693155594
3749.5 693155594 683155365 692404327 687416229 681864777 688219986 692741241 695412064 690112534
3757.2 690112534 692776260 698312988 689713821 688080139 692105865 693981552 695027084 698260498
3764.9 698260498 696131973 691381912 694025116 698823318 700125656 691667099 692257080 695087509
$$ packed form
3708F74447784L207398o619949L061676L078002j1040954M892273M843979R49478Q71887
3716.7F77691574K498245J169815l342285R14841N608368j699066m486084L866043
3724.4F82221451P26623K37809j105957q76313K727814J686401O328659k234344p641220
3733.1F82070923R378280K199097r575805n09797K033234p84607J664658L826370k971420
3741.8F87330933K641601R684982j1293563j2726364R824676N545883N078736k931290
3749.5F93155594j0000229R248962m988098n551452O355209M521255K670823n299530
3757.2F90112534K663726N536728q599167j633682M025726J875687J045532L233414
3764.9F98260498k128525m750061K643204M798202J302338q458557N89981K830429
$$ plain form
3772.6 695087509 695825043 697509079 697128677 697448730 698097687 700697327 700571060 693181305 695401840
3781.3 695401840 697826080 699415131 701718292 698891296 697654037 698319778 699437332 700439453
3789 700439453 699754181 699607086 699698334 700046692 699762878 701349335 704634552 701134796 697642517
3797.7 697642517 699206314 702886658 708841019 703599014 693735275 696562119 699402618 703901138
3805.4 703901138 709200821 700206299 695067749 699836884 702367859 702473755 702456589 702371368 703974533
3814.1 703974533 709612579 708536606 695630417 700650101 706184158 709617081 710103073 693652802
3821.8 693652802 696475830 701396103 702940598 706187897 705880051 700909729 701229248 703344116 707235107
3830.5 707235107 709037323 700124283 702980499 710124817 703393250 703162155 712710266 706035690
$$ packed form
3772.6F95087509P37534J684036l80402L20053O48957K599640j26267p389755K220535
3781.3F95401840K424240J589051K303161k826996j237259O65741J117554J002121
3789G00439453o85272j47095R1248L48358k83814J586457L285217l499756l492279
3797.7F97642517J563797L680344N954361n242005r863739K826844K840499M498520
3805.4G03901138N299683q994522n138550M769135K530975J05896j7166q5221J603165
3814.1G03974533N638046j075973j2906189N019684N534057L432923M85992j6450271
3821.8F93652802K823028M920273J544495L247299l07846m970322L19519K114868L890991
3830.5G07235107J802216q913040K856216P144318o731567k31095R548111o674576
$$ plain form
3838.2 706035690 700721512 706051865 698691559 699352036 707090683 705014038 701359100 704016495
3845.9 704016495 705059509 704795990 706847534 706849365 708886032 714761658 710081329 711624832 696338272
3854.6 696338272 694532700 703865967 703663712 702350082 705093613 707748489 709476852 704142151
3862.3 704142151 704223785 710001068 703861008 698418350 702306366 707168427 713244705 706511993 696793671
3871 696793671 701021271 707309341 710411530 701061783 701662521 705353165 705299149 707642365 711367340
3879.7 711367340 705897217 699710312 705500946 707409897 707927628 711282654 700534821 701070862
3887.4 701070862 704495773 705940247 710471268 709566803 700830917 701733856 705077057 703974380 705159149
3896.1 705159149 706822891 709082642 709815979 700852356 705008163 706170120 703225937 708436127
$$ packed form
3838.2G06035690n314178N330353p360306O60477P738647k076645l654938K657395
3845.9G04016495J043014k63519K051544J831K036667N875626m680329J543503j5286560
3854.6F96338272j805572R333267k02255j313630K743531K654876J728363n334701
3862.3G04142151Q1634N777283o140060n442658L888016M862061O076278o732712r718322
3871F96793671M227600O288070L102189r349747O00738L690644n4016K343216L724975
3879.7G11367340n470123o186905N790634J908951N17731L355026j0747833N36041
3887.4G01070862L424911J444474M531021r04465q735886R02939L343201j102677J184769
3896.1G05159149J663742K259751P33337q963623M155807J161957k944183N210190
$$ plain form
3903.8 708436127 705071716 704071198 704324493 704130325 705533371 705343018 705787659 706148911 706484985
3912.5 706484985 706099930 705308304 706315994 708371811 704857025 701718216 706544876 706176147 702311554
3921.1 702311554 704580917 706602631 707972336 705919495 702848740 703549423 704762726 706218185
3928.8 706218185 705495605 704845047 706358643 703806381 702518234 704626541 704520493 704754410 705636063
3937.5 705636063 705048752 704626617 704442520 706779633 708806534 704024048 702756882 704342041 704868851
3946.2 704868851 705698624 703796158 704515228 704869843 701987000 703741684 704957581 704313660 704335785
3954.9 704335785 704594116 705284042 704364243 703951416 704358673 705184174 705607758 704037018 703937378 704592819
3964.5 704592819 704643097 705109787 705336685 705536041 704883423 703324890 703744278 704596863 704391479 704700394
$$ packed form
3903.8G08436127l364411j000518K53295j94168J403046j90353M44641L61252L36074
3912.5G06484985l85055p91626J007690K055817l514786l138809M826660l68729l864593
3921.1G02311554K269363K021714J369705k052841l070755P00683J213303J455459
3928.8G06218185p22580o50558J513596k552262j288147K108307j06048K33917Q81653
3937.5G05636063n87311m22135j84097K337113K026901m782486j267166J585159N26810
3946.2G04868851Q29773j902466P19070L54615k882843J754684J215897o43921K2125
3954.9G04335785K58331O89926r19799m12827M07257Q25501M23584j570740r9640O55441
3964.5G04592819N0278M66690K26898J99356o52618j558533M19388Q52585k05384L08915
$$ plain form
3974.2 704700394 705142670 705199432 704064560 703930740 704947586 704869995 704862137 704859772 704970016 704878769
3983.8 704878769 704738541 704963150 704686813 704101868 704139175 705377655 704889755 703921661 704707260 704706192
3993.5 704706192 704536819 704751511 704561539 704237976 704366684 704211960 704065704
4000.2 704065704
$$ packed form
3974.2G04700394M42276N6762j134872j33820J016846p7591p858k365J10244r1247
3983.8G04878769j40228K24609k76337n84945L7307J238480m87900r68094P85599j068
3993.5G04706192j69373K14692j89972l23563J28708j54724j46256
4000.2G04065704
##END=$$ End of the data block
