##TITLE=$$ Begin of the data block
##JCAMP-DX=5.00 $$ ACD/SpecManager v 10.08
##SPECTROMETER/DATA SYSTEM=Varian
##DATE=08 Jan 2013 15:11:26
##DATA TYPE=INFRARED SPECTRUM
##DATA CLASS=XYDATA
##ORIGIN=
##OWNER=
##NPOINTS=3735
##FIRSTX=399.26403809
##LASTX=4000.35498047
##MAXX=4000.35498047
##MINX=399.26403809
##MAXY=75.38571167
##MINY=39.31052780
##XFACTOR=1.0000000000
##YFACTOR=0.000000100000000
##FIRSTY=58.64975357
##DELTAX=0.96440572
##XUNITS=1/CM
##YUNITS=TRANSMITTANCE
##XYDATA=(X++(Y..Y))
399.3E86497536J2629509q572769k099457J937599k968292J541290J490135N43556
407E90999107K37084l947144r44595J025505K497597K583046n241852q305512m513321
415.7E74389915N027276Q515892L737793R681091r479599r435463j395302J126862
423.4E82168465L402366J487084J947593J636658k802620J526871K259331j974030
431.1E89651718l034782j325074J120301m534149o380463K161064O297875M937324
438.8E88893814J299973Q32824P74956N32074l13454o669769k349358K166977j189651
447.5E83978386K85034K414513J563873p77702k193909n42030m67759m281311j769599
456.2E78209496L231811k423897J152382J989975j347236m99001j014671l27912k74696
$$ y = [586497536, 599127045, 590554276, 588454819, 590392418, 587424126, 588965416, 590455551, 590999107, 591236191, 587289047, 586344452, 587369957, 589867554, 592450600, 587208748, 578903236, 574389915, 579417191, 587933083, 591670876, 601351967, 591872368, 582436905, 581041603, 582168465, 585570831, 587057915, 589005508, 590642166, 587839546, 589366417, 591625748, 589651718, 586616936, 585291862, 586412163, 581878014, 575497551, 577658615, 583956490, 588893814, 590193787, 591026611, 591801567, 592333641, 592020187, 585350418, 583001060, 585168037, 583978386, 584263420, 586677933, 588241806, 587464104, 585270195, 584728165, 584260406, 579979095, 578209496, 581441307, 579017410, 580169792, 582159767, 580812531, 580313530, 579298859, 578970947, 578696251]
464.8E78696251M84810K142715L104630m22478p664490k838745L367996P08390l369522
473.5E74209557j374016L917351L284301p3852J188507m212761n702744j113739J12801
482.2E70235405K838745L03879J085701O492157L095169l202171n856896l81317L014412
490.9E77625084p94182k035561j119194L051415J967468l433761l347969j592370J039048
499.6E71359978K770385J088906j142960J526451K722245n48020k471313j019707p21970
508.2E73563995j706009O28243k54326j853867M7150q17604j639557o89087J422615
516.9E68701553j50718j786576K047348K276955k87704j24932l16162j183128j331864
525.6E67844772j066284K14119r08813j084366O27670N82466K910919O26107k608414
$$ y = [578696251, 579181061, 581323776, 584428406, 584005928, 576341438, 573502693, 576870689, 577579079, 574209557, 572835541, 576752892, 580037193, 579963341, 581151848, 576939087, 571236343, 570122604, 570235405, 573074150, 573378029, 574463730, 580955887, 584051056, 580848885, 574991989, 574610672, 577625084, 576830902, 574795341, 573676147, 576727562, 578695030, 575261269, 571913300, 570320930, 571359978, 574130363, 575219269, 574076309, 575602760, 578325005, 577776985, 575305672, 574285965, 573563995, 571857986, 572486229, 572231903, 570378036, 570425186, 569607582, 567968025, 567278938, 568701553, 568550835, 566764259, 568811607, 571088562, 570800858, 570675926, 570359764, 569176636, 567844772, 566778488, 566992607, 566083794, 564999428, 565627098, 566209564, 569120483, 569746590, 567138176]
534.3E67138176N9090J71966j80397j112861q51136N1842j132240k8687P89299J461792
543.9E66366844J5030k643394j495476O48J164475J591415Q22335j316224j272163
552.6E63233490J039352q69865k073135k12822Q43773R96093l37906r10492j360511
561.3E60347977m90647Q34046k93846J052551R18350n34935R27277K93350j021919
570E62032204p51038M85306N56221q29277j342011j460151Q85009J787835l41034j598664
579.6E59424400r56573L02620N74760N44396l35884J83792J332855J192589R07402
588.3E63170357P55043L83186n79452L94859O32019l20435L16277P50008J44729j230163
597.9E64416428J19056R11408q67653o28204m85917k95868Q8540J56822k67258L41759
$$ y = [567138176, 567197266, 567369232, 567188835, 566075974, 565224838, 565276680, 564144440, 564115753, 564905052, 566366844, 566381874, 563738480, 562243004, 562243652, 563408127, 564999542, 565821877, 564505653, 563233490, 564272842, 563402977, 561329842, 561117020, 561960793, 562956886, 562618980, 561708488, 560347977, 559857330, 560691376, 560397530, 561450081, 562368431, 561833496, 562760773, 563054123, 562032204, 561281166, 561766472, 562322693, 561493416, 560151405, 558691254, 559576263, 561364098, 561023064, 559424400, 558467827, 558770447, 559345207, 559889603, 559553719, 559737511, 561070366, 562262955, 563170357, 563925400, 564308586, 563729134, 564123993, 564756012, 564435577, 564751854, 565501862, 565646591, 564416428, 564535484, 565446892, 564579239, 563951035, 563465118, 563169250, 563257790, 563414612, 563147354, 563489113]
607.6E63489113J243133n38139p46345l08800q76694j135826m95071O64749o15654
616.3E60680466r41391L81660M31061j99471N43404J747971J161689J230736P70836
624.9E65806961l84369j0567J152192K079658L80592l58963J032486J997948J612740
633.6E73308678o03180n02434P24831J580505J578484M5738R74388J112938J078911
642.3E79298859J602554r2697P03697J292686k65464j11695Q79326K222519J536064
651E87065849m3525P11250N47028J35612k27203r61190K25640M52308J16158m43001
660.6E87578926q76007k59590O82335Q76922m45442R72481J719971m111634J585579
669.3E87723541Q27751m10614N24254P46689O47011Q75664J250648Q39157J070786
$$ y = [563489113, 564732246, 564194107, 563447762, 563138962, 562262268, 561126442, 560631371, 561296120, 560680466, 559739075, 560120735, 560551796, 560352325, 560895729, 562643700, 563805389, 565036125, 565806961, 565422592, 565412025, 566564217, 568643875, 569024467, 568665504, 569697990, 571695938, 573308678, 572705498, 572203064, 572927895, 574508400, 576086884, 576132622, 577107010, 578219948, 579298859, 580901413, 580808716, 581512413, 582805099, 582539635, 582427940, 583307266, 585529785, 587065849, 587022324, 587733574, 588280602, 588416214, 588189011, 587227821, 587453461, 587905769, 588021927, 587578926, 586702919, 586443329, 587125664, 588002586, 587557144, 588529625, 590249596, 586137962, 587723541, 588551292, 588140678, 588664932, 589411621, 590058632, 590934296, 592184944, 593024101, 594094887]
678E94094887J632995L54576k32658J104012N08537K45171J149559P37381J387329
686.7F00981789j68305j689834K78167J481362K151565J785584j72997j513214k57568
695.3F02876549Q54759P37305P11326L23105N88265M50325R36889J232033j717o94351
705F08014488k09999Q90885O53457R14269J191024J36643k25639P98187J508560N80406
714.6F14252281N70679p7019l73878M59518L87726J130905R50279M15230K70386k213
724.3F17983894K03476J039925J286316L99628M04396K15110O74668J064377J136398
733F24408188Q30383m17862M45366N75791N25894K07519r97123K51007J400756J164017
742.6F28393936K27051l69911K64015J127853K43874r9144M79889j40381J092606J359977
$$ y = [594094887, 595727882, 596082458, 595849800, 596953812, 597462349, 597707520, 598857079, 599594460, 600981789, 600813484, 599123650, 599401817, 600883179, 603034744, 604820328, 604647331, 603134117, 602876549, 603731308, 604468613, 605179939, 605503044, 606091309, 606541634, 607478523, 608710556, 608708839, 608014488, 607804489, 608695374, 609348831, 610263100, 611454124, 611590767, 611365128, 612163315, 613671875, 614252281, 614822960, 614745941, 614372063, 614831581, 615219307, 616350212, 617300491, 617715721, 617986107, 617983894, 618187370, 619227295, 620513611, 620913239, 621317635, 621532745, 622207413, 623271790, 624408188, 625238571, 624820709, 625266075, 625841866, 626367760, 626575279, 625578156, 625829163, 627229919, 628393936, 628620987, 628251076, 628515091, 629642944, 629886818, 629787674, 630267563, 630127182, 631219788, 632579765]
752.2F32579765O49186K48870p40509k46505N74607J695023J225052M32625J89857
760.9F36607971Q2245J354408N64118L6278Q80012P41081J53580p59048r45244L19633
770.6F39035034J171723P82394M23203m53568j5717R05228J88828j64948m16183o61621
780.2F40794373J96151R68094j94397k04239P54929J275024J420670m00162l91312
788.9F44219131o3476m6158R66187L95507l15246l67890K29645J59073m23050j185608
798.5F43568115j488724r22470J63346J028595l44925j24970m81262k327232j152382
807.2F37918091J640m89540j345596j479569j213073n68009J14937N02472j68724j034279
816.9F32238350j204605j804543k20375O06461N56412Q22982M81224J280289O47202
$$ y = [632579765, 633228951, 633477821, 632737312, 632490807, 633065414, 634760437, 635985489, 636418114, 636607971, 636690216, 638044624, 638608742, 638645020, 639525032, 640266113, 640419693, 639660645, 638715401, 639035034, 640206757, 640989151, 641412354, 640958786, 640943069, 641848297, 642037125, 641872177, 641455994, 640794373, 640990524, 641958618, 641764221, 641559982, 642314911, 643589935, 645010605, 644610443, 644219131, 644155655, 644109497, 645075684, 645471191, 645155945, 644788055, 645017700, 645176773, 644753723, 643568115, 642079391, 641156921, 641320267, 642348862, 642003937, 641878967, 641397705, 639070473, 637918091, 637919731, 637430191, 636084595, 634605026, 633391953, 632823944, 632938881, 633441353, 633272629, 632238350, 631033745, 629229202, 629008827, 629615288, 630171700, 630994682, 631475906, 632756195, 633403397]
825.5F33403397J358070J481819O72226J661339J409302K083702J667785J452866K000198
834.2F47190704K122956K010116Q6594K53601Q96683J322250J250916P84988J126175
842.9F57044983J121063J064682N05982J255035R54208K37809K75650O16073J611939
851.6F64687424R32083R09958J354522J672593J265716J550903J859513J91955m91790
860.3F73932877n86091J317292K231827J700592P71637l60184l22037j031341k84348
868.9F77370224k04163k38418j195984j400299P4768n96466J57471k51694n29175q83026
878.6F72303238k75803J256790l68652j21841l87650K42386M34418p13883j118622
887.3F71250381k324447l16849J96991j36032j04370q64868k13623R7046K41165n21622
$$ y = [633403397, 634761467, 636243286, 636915512, 638576851, 639986153, 642069855, 643737640, 645190506, 647190704, 649313660, 651323776, 651410370, 651663971, 652560654, 653882904, 655133820, 655918808, 657044983, 658166046, 659230728, 659736710, 660991745, 661945953, 662183762, 662459412, 663075485, 664687424, 665619507, 666529465, 667883987, 669556580, 670822296, 672373199, 674232712, 674424667, 673932877, 673346786, 674664078, 676895905, 678596497, 679368134, 679007950, 678685913, 677654572, 677370224, 677166061, 676927643, 675731659, 674331360, 674406128, 673809662, 673967133, 673715439, 673186264, 672303238, 672027435, 673284225, 672915573, 672793732, 672406082, 672648468, 673082886, 672369003, 671250381, 668925934, 668609085, 668806076, 668670044, 668565674, 667700806, 667487183, 667584229, 667825394, 667303772]
896.9F67303772j84555r8648m08020o28967j128464J82724K52609J6022N70678J406250
906.5F67283401J297150P59354Q18786J60752M52957R5215m50745r95636o97403L34244
916.2F69058075j69678r22012j854935j158066r60311j825181k010803k412185k016221
924.9F55728683j102752r07517j093673p07627j413650j655655j662369k173386r16595
933.6F44095459j38092j50223o89545r13620q86230n68237l18146j180229n87883n29022
943.2F38134232p09153o67190l75481K97585n14641l57285l32260j77955m98810r85985
952.8F33813057m03938j292305j393700j363411r98306p37038j216392j054078k049446
961.5F23304443k151947j620178j253052n08804r90143j558189q49762l18184j294899
$$ y = [667303772, 667119217, 667020569, 666612549, 665983582, 664855118, 665037842, 665290451, 665306473, 665877151, 667283401, 668580551, 669339905, 670158691, 670319443, 670772400, 670867615, 670416870, 669421234, 668723831, 669058075, 668888397, 667966385, 666111450, 664953384, 663993073, 662167892, 660157089, 657744904, 655728683, 654625931, 653718414, 652624741, 651917114, 650503464, 648847809, 647185440, 645012054, 644095459, 643957367, 643807144, 643117599, 642203979, 641317749, 640749512, 640431366, 639251137, 638663254, 638134232, 637425079, 636757889, 636382408, 636679993, 636165352, 635808067, 635475807, 635297852, 634799042, 633813057, 633409119, 632116814, 630723114, 629359703, 628361397, 627624359, 626407967, 625353889, 623304443, 621152496, 619532318, 618279266, 617770462, 616780319, 615222130, 614372368, 614054184, 612759285]
970.2F12759285k253380j988563j473809k060165j901856r66110j555786k171478j931191
978.9E96456947j958465l087349l607559l201142l326645l234253k968101k632790
986.6E72440643k493744l328094l468704k979737l288002l023948k660981k511978
994.3E48685455k352485k071686k277718k432556j702499k832260k562218j516762
1002E30937271j632995j114769j524544p45011p26623j766739j587791j286355j369171
1010.7E19183273j815681j549912j903877j896438j508408j639328j791229j460953
1018.4E05617447p79343j636276k418327k788277j976585j362839j610146j302528
1026.1D91743126j489143o95076j088219j973915j293144n98946j281433o80123J285592
$$ y = [612759285, 610505905, 608517342, 607043533, 604983368, 603081512, 602115402, 600559616, 598388138, 596456947, 594498482, 591411133, 587803574, 584602432, 581275787, 578041534, 575073433, 572440643, 569946899, 566618805, 563150101, 560170364, 556882362, 553858414, 551197433, 548685455, 546332970, 544261284, 541983566, 539551010, 537848511, 535016251, 532454033, 530937271, 529304276, 528189507, 526664963, 525919952, 525193329, 523426590, 521838799, 520552444, 519183273, 517367592, 515817680, 513913803, 512017365, 510508957, 508869629, 507078400, 505617447, 504838104, 503201828, 500783501, 497995224, 496018639, 494655800, 493045654, 491743126, 490253983, 489558907, 488470688, 486496773, 485203629, 484604683, 483323250, 482643127, 483928719]
1034.8D83928719n0774o27365N62324J643448J224671O37550J219101O16264P73735
1043.5D89927673M55056K49519J20468o26182r96933j344681j062012r86862l94173
1052.2D85341873r87053r58709l59726l00370r5863j054993M63715J239777P27729
1060.9D84016380J74790J426315L103752R80911J104126K114678K147903R31549L00637
1069.5D96301041J017685J196785J611671M44031N56564J01357K97889J134949K54173
1078.2E02916145N37720P706O32477P53059Q72040J097870P68776J422996q469L28179
1087.9E09328499J563415J626435J208725P46650P65114J179352J595840K88811Q96759
1096.5E19199600N88494j34392P22847N80177J354675J175385J541786J311569K90222
$$ y = [483928719, 483877945, 483250580, 483812904, 485456352, 486681023, 487318573, 488537674, 489153938, 489927673, 490382729, 490632248, 490752716, 490126534, 489129601, 487784920, 486722908, 485736046, 485341873, 484354820, 483396111, 483036385, 482736015, 482640152, 481585159, 482048874, 483288651, 484016380, 484191170, 485617485, 488721237, 489702148, 490806274, 492920952, 495068855, 496000404, 496301041, 497318726, 498515511, 500127182, 500571213, 501127777, 501229134, 501527023, 502661972, 502916145, 503453865, 503461571, 504094048, 504847107, 505719147, 506817017, 507585793, 509008789, 509000320, 509328499, 510891914, 512518349, 513727074, 514473724, 515238838, 516418190, 518014030, 518302841, 519199600, 519788094, 519653702, 520376549, 520956726, 522311401, 523486786, 525028572, 526340141, 526630363]
1105.2E26630363O25573M38156J28212L08800J429481R40208K21749P25517J010132
1113.9E32458191O44264J75553M53186n59426m84924J55601N76134O84395l32146N58548
1123.5E34329376M75655r5329L26004P40966R23539J054229J771393J261978J159630
1132.2E41947441J408005J986122J799850N73082Q62580Q74138J190681J656838J630477
1140.9E53929214J309243N22537P24831N62439k80304j86882M44374P78770Q38966
1149.6E58643188N84145K46086Q1177j12038m40597p79610l80554l02277k86293l10135
1159.2E56943092j005935l62015k25411k34222M58717N52445R95674J163292J715164
1167.9E60000801J730270J170006J791954K283745J893578J632461J972389K160035
$$ y = [526630363, 527255936, 527694092, 527822304, 528131104, 529560585, 530500793, 530722542, 531448059, 532458191, 533102455, 533278008, 533731194, 533171768, 532686844, 532842445, 533418579, 534102974, 533770828, 534329376, 534805031, 534709702, 535035706, 535776672, 536700211, 537754440, 539525833, 540787811, 541947441, 543355446, 545341568, 547141418, 547714500, 548577080, 549451218, 550641899, 552298737, 553929214, 555238457, 555760994, 556485825, 557048264, 556767960, 556581078, 557025452, 557804222, 558643188, 559227333, 559473419, 559554596, 559442558, 559001961, 558222351, 557841797, 557539520, 557253227, 556943092, 555937157, 555575142, 555349731, 555115509, 555574226, 556126671, 557122345, 558285637, 560000801, 561731071, 562901077, 564693031, 566976776, 568870354, 570502815, 572475204, 574635239]
1175.6E74635239J680908J280670J593018K181434K002678J618309J659279R24377
1183.3E87575912J085282J446190P84187R65309J106453P67594L53202L57094j01585
1192E94339638l94402k81982m47312L6621k01339p6256J0948o35452j020661j345634
1201.6E89984169q55217q88710q35419n77125o13404o7901j56021m98543p57828m29649
1211.3E84304352L1547m24537k89078M6310K70958J36566n85594n24864m00925p81669
1220.9E81783066o60858k53296j64414l17077l16048o9313k62566q16612p99522p20291
1230.6E77403069q46863o07605m45862l46031J22452K51121l63426n18532j77116j47210
1240.2E74323997n99517p56188J19286L52630P3472r6627j68762k2888o90003p88612
$$ y = [574635239, 576316147, 577596817, 579189835, 581371269, 583373947, 584992256, 586651535, 587575912, 588661194, 590107384, 590891571, 591856880, 592963333, 593730927, 594084129, 594441223, 594339638, 593945236, 593663254, 593215942, 593252563, 593051224, 592974968, 592985916, 592350464, 591329803, 589984169, 589128952, 588240242, 587404823, 586827698, 586214294, 586146393, 585990372, 585491829, 584734001, 584304352, 584335899, 583911362, 583622284, 583668594, 583939552, 584076118, 583490524, 582965660, 582564735, 581783066, 581122208, 580868912, 580704498, 580387421, 580071373, 580002060, 579739494, 578922882, 578123360, 577403069, 576556206, 575948601, 575502739, 575156708, 575279160, 575530281, 575166855, 574648323, 574471207, 574323997, 573724480, 572968292, 573087578, 573440208, 573513680, 573417053, 573248291, 573225403, 572535400, 571746788]
1249.9E71746788m09546j76391P2975O7901L01781J9569K20719j6556n03120K34947
1259.5E71559067m3183r6778N40237N32532M96635L71399L49922N16968K35710O2866
1269.2E74525375O62918R71451O64559O59942J304245J370583P65648O78215P17506
1277.8E82320442N32227P51495J221542J092911R51996J102409J399956J241341N26390
1286.5E91140709O67915J083374R90715J006890J088142P09572O40755Q07342N83077
1295.2E98718491L22303K08321L04909K41089M84809K97051J46980M93469L61290K23122
1304.8F01801834j24893k36397m17328k16369p0801j90659L22075m57420j061897j88027
1314.5E99160118K9907n67779l43857K49634J11618P20329Q79135M91638N69535P49321
$$ y = [571746788, 571337242, 571160851, 571233826, 571301727, 571603508, 571623077, 571843796, 571827240, 571324120, 571559067, 571515884, 571419106, 571959343, 572491875, 572988510, 573359909, 573709831, 574226799, 574462509, 574525375, 575188293, 576159744, 576824303, 577484245, 578788490, 580159073, 580924721, 581602936, 582320442, 582852669, 583604164, 584825706, 585918617, 586870613, 587973022, 589372978, 590614319, 591140709, 591808624, 592891998, 593882713, 594889603, 595977745, 596687317, 597328072, 598135414, 598718491, 599040794, 599249115, 599554024, 599795113, 600279922, 600576973, 600723953, 601217422, 601578712, 601801834, 601676941, 601440544, 601023216, 600806847, 600736046, 600545387, 600867462, 600410042, 599348145, 599160118, 599190025, 598622246, 598278389, 598528023, 598639641, 599359970, 600239105, 600730743, 601300278, 602049599]
1324.1F02049599P03888K03552j09558k8916K36397p6065k97813j73493J73531Q3999
1333.8F02765121n01976m10537n58930O0616L7308l76435M30145O35338J001969L44886
1343.4F03427505J3123J39313j28479J68304K33193L41072j9188K12555n5771k61307
1353.1F04070320J32675m40750l25737k69241j02501k12631j12839j37100l82233j61514
1362.7F02058449j095429J82381j5221q65135p78313o95152J88065l9559j8463k7923
1372.3E98893700k25182j048164n54772O70891q9836k30866n3291O66390p0229p56645
1382E97201996o19049j426811p08924m63485q61397j875458J3008O28090r20715n15290
1391.6E90451965o94694p44400k194634l164367o90995q07457r43184k423934o02112
$$ y = [602049599, 602753487, 602957039, 602847481, 602818565, 603054962, 602978897, 602681084, 602507591, 602681122, 602765121, 602263145, 601852608, 601293678, 601354294, 601391602, 601015167, 601445312, 602080650, 603082619, 603427505, 603440628, 603579941, 603451462, 603619766, 603852959, 604194031, 604174843, 604387398, 604331627, 604070320, 604202995, 603762245, 603436508, 603167267, 603064766, 602852135, 602739296, 602602196, 602219963, 602058449, 600963020, 601145401, 601130180, 600265045, 599486732, 598791580, 598979645, 598940086, 598921623, 598893700, 598668518, 597620354, 597065582, 597736473, 597646637, 597415771, 597362480, 598028870, 597958641, 597201996, 596582947, 595156136, 594447212, 593983727, 593122330, 591246872, 591259880, 591887970, 590967255, 590451965, 589757271, 589012871, 586818237, 583653870, 582962875, 582155418, 581212234, 578788300, 578186188]
1400.3E78186188M2877j426354j346778j621018k757454j698341n11360j017113r94148
1409E66856499q75969j146851r06753j267014p42035p73353j189728j084671n59693
1417.7E58310432L94669k613487K89764J771126J43356n09224p26928J055297Q04406
1426.3E58919411k05384O05507N31578L49579K50931J142082J178665M27971J500130
1435E64700470J442642j162147R04464K516098J518135P25785O60438P04193P74155
1443.7E72784233L7766P22885J010933N67741K29645J102333J585083O89468L18222
1452.4E79048309J27220R10340R10950K96287j760826n25627L747749K090073K426452
1461.1E87270927J071282M75387J617547l35579J715316K165146J978684J405945J018257
$$ y = [578186188, 578229065, 576802711, 575455933, 573834915, 571077461, 569379120, 568867760, 567850647, 566856499, 565980530, 564833679, 563926926, 562659912, 561917877, 561144524, 559954796, 558870125, 558310432, 558705101, 556091614, 556381378, 558152504, 558295860, 557786636, 557059708, 558115005, 558919411, 558714027, 559319534, 559851112, 560200691, 560451622, 561593704, 562772369, 563200340, 564700470, 566143112, 564980965, 565885429, 568401527, 569919662, 570645447, 571305885, 572010078, 572784233, 572821999, 573544884, 574555817, 575123558, 575353203, 576455536, 578040619, 578730087, 579048309, 579175529, 580085869, 580996819, 581293106, 579532280, 579006653, 582754402, 584844475, 587270927, 588342209, 588817596, 590435143, 590099564, 591814880, 593980026, 595958710, 597364655, 598382912]
1469.7E98382912J806793N44815j29280J308365L945465L321113R80683J842689K017594
1478.4F14021149R87892P24602O44950J025238J170159J224441J560860J334114l54385
1487.1F22339020q20618M42124j446000m55665J030960R01642J35841j06697n05981
1495.8F21514626n057679P13654j063576l022346N13763q70247n51262j57852N33028
1504.5F12552109n86167o901931l498993K055816K824631n01976O42166n31616j521034
1513.1F04533005O99196o97632j519470k495728q88710J532059J170311j814232l433685
1521.8E97085114P99369K016602K281952j048813J52664J367302o3820L73955N80673
1530.5F03544998Q42667R24072L11737k735252J159172J462517N36575J864700j657600
$$ y = [598382912, 600189705, 600734520, 600605240, 601913605, 605859070, 609180183, 610160866, 612003555, 614021149, 615009041, 615733643, 616378593, 617403831, 618573990, 619798431, 621359291, 622693405, 622339020, 621518402, 621960526, 620514526, 620058861, 621089821, 621991463, 622127304, 622020607, 621514626, 616456947, 617170601, 616107025, 613084679, 613598442, 612728195, 612176933, 612019081, 612552109, 611965942, 605064011, 601565018, 603620834, 606445465, 605943489, 606585655, 606054039, 604533005, 605232201, 604534569, 603015099, 600519371, 599630661, 601162720, 602333031, 600518799, 597085114, 597884483, 599901085, 602183037, 601134224, 601286888, 602654190, 602590370, 602964325, 603544998, 604387665, 605311737, 605623474, 602888222, 604047394, 605509911, 606046486, 607911186, 606253586]
1539.2F06253586n321541J924133j22528L34931K996559J623916j381607J333428P65419
1547.9F08406296Q30040k88430j125869J357422Q19358Q46100k715034K39296K720756
1556.5F11089935K060891m948426j1485939O193428K996216K147102N6267p87430k685775
1565.2F04636269j444550N06935r03396q16384o402817k36244l45535j961021j008721
1573.9E92024536j501465n92498r349747j002846j501579k413750j816444l175392
1581.6E70670815k474213m368363k351684l323746l311691l048744l623124k136993
1589.3E46032257m641113k610207l687553k447701k995834m242249k257766l959999
1597E19189835j464768l255806k433128l073235k944183j997681l964996r63822k607994
$$ y = [606253586, 600932045, 602856178, 602733650, 603068581, 606065140, 607689056, 606307449, 607640877, 608406296, 609236336, 608947906, 607822037, 609179459, 609998817, 610844917, 608129883, 608369179, 611089935, 613150826, 608202400, 596716461, 602909889, 605906105, 608053207, 608109474, 607322044, 604636269, 603191719, 603698654, 602795258, 601978874, 595576057, 595339813, 594994278, 593033257, 592024536, 590523071, 589930573, 580580826, 579577980, 578076401, 575662651, 573846207, 570670815, 568196602, 563828239, 561476555, 558152809, 554841118, 551792374, 548169250, 546032257, 541391144, 538780937, 535093384, 532645683, 529649849, 525407600, 523149834, 519189835, 517725067, 514469261, 512036133, 508962898, 506018715, 504021034, 500056038, 499092216, 496484222]
1605.7D96484222j427726k492714j570931j727485k801094J93481k447929q25844k094307
1614.4D81289673J12877R2506p342872J899261l64685O71349j412659N07965R4452
1623.1D75547867k427864P46574n24559J905213j238709K70615Q94088O37856P82013
1631.7D76593094m0093K136727L78761K42043j668358K275276J947555R25599J797752
1640.4D84588356K49558K336921Q09746J603622J021538j983108J742439K91100L901176
1649.1D94561348J950531K861900K476769J54648m111023J924743M251137J544724
1656.8E05614777K200431J241608J738167J665764J392898K330780M52538L108101
1664.5E19745064J903457K279625K462616K441750J491699M00849L986244J704101
$$ y = [496484222, 495056496, 492563782, 490992851, 489265366, 486464272, 486657753, 484209824, 483383980, 481289673, 481402550, 481495056, 474152184, 476051445, 475686760, 476358109, 474945450, 475453415, 475547867, 473120003, 473866577, 473342018, 475247231, 474008522, 474279137, 475173225, 475811081, 476593094, 476553001, 478689728, 479068489, 479310532, 477642174, 479917450, 481865005, 482790604, 484588356, 484837914, 487174835, 487984581, 489588203, 490609741, 488626633, 490369072, 490660172, 494561348, 496511879, 499373779, 501850548, 502005196, 497894173, 499818916, 504070053, 505614777, 507815208, 509056816, 510794983, 512460747, 513853645, 516184425, 516636963, 519745064, 521648521, 523928146, 526390762, 528832512, 530324211, 530725060, 534711304, 536415405]
1672.3E36415405L580017L545494J717453J501618K862587L712654K384872K788697
1680E58508797J656303M090233N287018K875938J089783N22003M846153L518753K847786
1688.6E85242767L385392K271080L211097L257065L614807M265747L591576k047958
1696.4F06791573L611793N012589N012893K602234k228851N789985M220582K704124
1704.1F33516922J485672K205315J267318K043343L388824J783753J256866K255707
1711.8F49203720K097778J539154j91726k90909K997971K120056n107193L704986L791352
1720.5F59865189J746826J104736L75824M53339J294174J040726N09567J069183J840973
1729.1F69300537l12347j55564L015442K708588k168656m084548M189758L566665J400071
$$ y = [536415405, 539995422, 543540916, 545258369, 546759987, 549622574, 553335228, 555720100, 558508797, 560165100, 564255333, 569542351, 572418289, 573508072, 574030075, 578876228, 582394981, 585242767, 588628159, 590899239, 594110336, 597367401, 600982208, 605247955, 608839531, 606791573, 610403366, 615415955, 620428848, 623031082, 620802231, 626592216, 630812798, 633516922, 635002594, 637207909, 638475227, 640518570, 643907394, 645691147, 646948013, 649203720, 651301498, 652840652, 652648926, 652358017, 655355988, 657476044, 652368851, 656073837, 659865189, 661612015, 662716751, 663092575, 663545914, 664840088, 665880814, 666390381, 667459564, 669300537, 668988190, 668832626, 671848068, 674556656, 672388000, 668303452, 672493210, 676059875, 677459946]
1737.8F77459946K274856M5243j398011L532028K192841o94733N02167K797012K366868
1746.5F89078217J583633R29794L13187L616714L60947l87268L963928K481079J970444
1755.2G03910675K082062l49121J030502K445068K120362K175598k239151n05905L079910
1763.9G13750000J367874R87854J551743J546020j682205J150665K919617o66580j956711
1772.5G18968277o98471L546829K111282n97305J410370N33066J002731J51901j085739
1781.2G25342941P63321J303635J433716j19934r5749J119766O06460K16828Q45566
1789.9G31416550k76337K33383j061172p04804L223953J176301m91181R57108J632690
1798.6G36106491m00162k106933J437759J7243O44760J623077O22025Q66241k4109
$$ y = [677459946, 679734802, 679780045, 678382034, 681914062, 684106903, 683412170, 683914337, 686711349, 689078217, 690661850, 691591644, 691904831, 695521545, 695882492, 695495224, 699459152, 701940231, 703910675, 705992737, 705643616, 706674118, 709119186, 711239548, 713415146, 711175995, 710670090, 713750000, 715117874, 716105728, 717657471, 719203491, 717521286, 718671951, 721591568, 720924988, 718968277, 718269806, 721816635, 723927917, 723330612, 724740982, 725274048, 726276779, 726428680, 725342941, 726106262, 727409897, 728843613, 728723679, 728627930, 729747696, 730354156, 730570984, 731416550, 731140213, 731373596, 730312424, 729607620, 732831573, 734007874, 733516693, 734473801, 736106491, 735706329, 733599396, 735037155, 735054398, 735699158, 737322235, 737944260, 738810501, 738786392]
1807.3G38786392j36947M92019L23334j525497K47955J306076N85174J203690M82407
1815.9G41764603L90167n50842K48870M39225m88816Q77762r3841Q26873P63932k356110
1825.6G41821823O97250K076798J060257j277161l773346J103440K685928P61185N26428
1834.3G45682602N05752L30887n3711r63287L49350j70670L71399L76435J114959J071473
1843.9G48615189m183960K064666K108765o57730j041565q0719P21359M6158Q02002
1852.6G48394165O40640O74897J66015l55377J38473n22689K3727j9913N6763j3123
1862.2G49183578O51474Q10853j14136O6910p13807O7826q97293p66602J293869J057510
1871.9G50640182Q05588j49078j5183l9291j01547n19715l96347k8839p324J195297
$$ y = [738786392, 738649445, 739141464, 739464798, 737939301, 738187256, 739493332, 740078506, 741282196, 741764603, 742154770, 741603928, 741852798, 742292023, 741803207, 742680969, 742587128, 743414001, 744177933, 741821823, 742519073, 744595871, 745656128, 744378967, 740605621, 741709061, 744394989, 745156174, 745682602, 746188354, 746519241, 746465530, 745502243, 745851593, 745680923, 746052322, 746428757, 747543716, 748615189, 744431229, 746495895, 748604660, 747946930, 746905365, 746824646, 747546005, 747592163, 748394165, 749034805, 749709702, 749875717, 749520340, 749658813, 749136124, 749159851, 749139938, 749196701, 749183578, 749835052, 750645905, 750531769, 750598679, 749884872, 749952698, 749055405, 748288803, 749582672, 750640182, 751445770, 751296692, 751281509, 751242218, 751140671, 750620956, 750224609, 750195770, 750188446, 751383743]
1881.5G51383743K24839L52325L43246k20718J48163q32901M04663L27606j313934
1890.2G50817032L03345J127929K94724j48239l24097o41022N62210J23825Q4839L49884
1899.8G52550430k05459k5940R6969L24097m46396N7755L77655l87955k42310l0517
1909.5G52068329o7139J91956J075821j60065l71017n3864J12000J061096j866455
1918.2G51990662m60892J533432L96500J45263j065140n01174M94613J54038K28271
1926.8G52915573L29132j10397K35062n9205l16696M54102n32456n05371l05099l433
1936.5G52101212N43670J04981L20434k09732J87226m47541j269302N22003K78397
1945.2G52131348j53199j46102L72848L28064l9825k5864j87454j30539k79846l89328
$$ y = [751383743, 751608582, 751960907, 752304153, 752083435, 752231598, 751398697, 751803360, 752130966, 750817032, 751120377, 752248306, 752543030, 752394791, 752070694, 751429672, 751991882, 752115707, 752200546, 752550430, 752344971, 752319031, 752416000, 752740097, 752293701, 752351456, 752729111, 752341156, 752098846, 752068329, 752001190, 752193146, 753268967, 753108902, 752737885, 752684021, 752796021, 753857117, 751990662, 751529770, 753063202, 753459702, 753604965, 752539825, 752038651, 752533264, 752687302, 752915573, 753244705, 753134308, 753369370, 753310165, 752993469, 753447571, 752915115, 752409744, 752104645, 752101212, 752644882, 752749863, 753070297, 752860565, 753047791, 752600250, 751330948, 751852951, 752131348, 751978149, 751832047, 752204895, 752532959, 752493134, 752467270, 752279816, 752149277, 751869431, 751480103]
1954.8G51480103m17481L77045K57568r8190O02035J16959k25143k39335m29077k83737
1964.5G51140747J73187K29645l06320p6M98199L07236j93711k77938k90299j68075
1974.1G51112595j57624M5548J73721k3270M22287J52131j39924m45709m88281l05939
1983.7G50345535l52707L91465K30255K18277j68152k57950L13568o39801p99866N3711
1993.4G49334335N02014j13067j71356L94668K30179L10669l01590k27356k98691k99835
2003G49359970j36185l89785Q7814J36490L14407j41220k48337j98288m08020J8692
2012.7G48395538k44064J30768L89480M1123m59519p9422K18049m11149k34680j90124
2022.3G47556000J25046q9646r4375R4680K0676K61154m63714p3700J24435K6016r9640
$$ y = [751480103, 751062622, 751439667, 751697235, 751599045, 752201080, 752318039, 752092896, 751853561, 751424484, 751140747, 751313934, 751543579, 751237259, 751237183, 751735382, 752042618, 751848907, 751570969, 751280670, 751112595, 750954971, 751000519, 751174240, 751150970, 751573257, 751725388, 751585464, 751139755, 750651474, 750345535, 749992828, 750384293, 750614548, 750832825, 750664673, 750406723, 750720291, 750080490, 749280624, 749334335, 749836349, 749723282, 749551926, 749946594, 750176773, 750487442, 750185852, 749958496, 749659805, 749359970, 749223785, 748834000, 748921814, 749058304, 749372711, 749231491, 748983154, 748784866, 748376846, 748395538, 748151474, 748282242, 748671722, 748712845, 748253326, 748173904, 748391953, 747980804, 747746124, 747556000, 747681046, 747591400, 747497025, 747591705, 747612381, 747873535, 747409821, 747336121, 747460556, 747486572, 747386932]
2032.9G47386932l94745P6752j61056o5384l28598j06278j3656j71204r003n89370
2042.6G45624390J41220L22189M14047J57547l62854M8371l75901m05883m13971J1444
2052.2G45160599J90124J76697K65656l5172J28479m21829k63062k20794k06299K33383
2061.9G45007782J38016K81067j17493k14233k94877k18048j55868p2403R6969O4774
2071.5G44515686L93600j91192l5019o7673k78320o8207l20892N20935L24783j15356
2081.1G44678345p4005l81699j29013K34604q4458n78537k58560j35345J95541L1815
2090.8G43498688J90811L62625k61307M3717l77274k48184j26801j63345n7068m16031
2100.4G42445831L68576L27072L54996J08567n36118n84564l95661J17264l36685P553
$$ y = [747386932, 746992187, 747068939, 746907883, 746842499, 746513901, 746407623, 746393967, 746222763, 746213760, 745624390, 745765610, 746087799, 746501846, 746659393, 746296539, 746344910, 745969009, 745563126, 745149155, 745160599, 745350723, 745527420, 745793076, 745757904, 745886383, 745464554, 745201492, 744980698, 744774399, 745007782, 745145798, 745426865, 745309372, 745095139, 744800262, 744582214, 744426346, 744353943, 744450912, 744515686, 744909286, 744718094, 744683075, 744615402, 744337082, 744268875, 743947983, 744468918, 744793701, 744678345, 744604340, 744222641, 744093628, 744328232, 744243774, 743665237, 743406677, 743271332, 743466873, 743498688, 743689499, 744052124, 743790817, 743834534, 743457260, 743209076, 743082275, 742918930, 742861862, 742445831, 742814407, 743141479, 743496475, 743605042, 743068924, 742484360, 742088699, 742205963, 741869278, 741876831]
2110.1G41876831K66266J48849J39237p935K50092k17362o86340p61871L27072M66766
2119.7G41801605q011L53852R4986J373l11356M578l35617m13208O5231j50528M07486
2130.3G41510391q6822J47934L64990j45035k29l57132k28424R308R3308k20490J91422
2140.9G41279221N17883R7885j88293n23301J34888j54495k57111J42441l6697K20947
2150.6G41233368K44141J54953j77308j57241l33710j34506Q2855m1885L45687K91977
2160.2G41508331L82920k40021k08664k5406l66974k23999l32489N33142N56946J70059
2169.9G41753845p0343p1564J09025m88968j84403K5559M80423K66952R1858K75497
2179.5G42187881l86962k23542m12826L6850J05514l87039N2796O53457O66580j85928
$$ y = [741876831, 742143097, 742291946, 742431183, 742423248, 742673340, 742455978, 741769638, 741007767, 741334839, 741801605, 741793594, 742147446, 742242432, 742243805, 741932449, 741937027, 741601410, 741188202, 741253433, 741102905, 741510391, 741423569, 741571503, 741936493, 741791458, 741791229, 741434097, 741205673, 741214981, 741308289, 741087799, 741279221, 741797104, 741894989, 741706696, 741183395, 741318283, 741163788, 740906677, 741049118, 741012421, 741233368, 741477509, 741632462, 741455154, 741297913, 740964203, 740829697, 740912552, 740870667, 741216354, 741508331, 741891251, 741651230, 741442566, 741417160, 741050186, 740826187, 740493698, 741026840, 741583786, 741753845, 741683502, 741611938, 741720963, 741231995, 741047592, 741073151, 741553574, 741820526, 741912384, 742187881, 741800919, 741577377, 741164551, 741201401, 741306915, 740919876, 740972672, 741626129, 742292709, 742106781]
2189.1G42106781L3722q8043j76239j53885r1782J63117k31400K17514k46963n951
2198.8G41526871K80761j34277j62506m90799L81470Q1024J86310M93927K7313J48773
2208.4G42338867k96478J29700M8675l33099n05600j36414K81601k73971K43988N52902
2218.1G42050171K38266k61002j00097o1493l48282J24664K52075M46701p6217j38932
2227.7G42125854r8571j54648J59912l30582Q6518K71759J04370J64032K03628j17340
2237.4G42414932l14941R689m17862k04849l0746K71759N722l74756J91574Q0337N32074
2248G42162933j51443n58167j01318k88925q7509k8382L60184K10495L02353Q0185
2257.6G41900406l15094j92719j51443L40271N6610K0905l40043o7062K34299j03836
$$ y = [742106781, 742140503, 742052460, 741876221, 741722336, 741630554, 741793671, 741562271, 741779785, 741532822, 741526871, 741807632, 741673355, 741510849, 741020050, 741401520, 741482544, 741668854, 742162781, 742190094, 742338867, 742042389, 742172089, 742220764, 741887665, 741382065, 741245651, 741527252, 741253281, 741497269, 742050171, 742288437, 742027435, 741927338, 741865845, 741517563, 741642227, 741894302, 742341003, 742264786, 742125854, 742027283, 741872635, 742032547, 741701965, 741788483, 742060242, 742164612, 742328644, 742532272, 742414932, 742099991, 742109680, 741691818, 741486969, 741456223, 741727982, 741733704, 741358948, 741550522, 741630859, 742162933, 742011490, 741453323, 741352005, 741063080, 740975571, 740947189, 741307373, 741517868, 741820221, 741900406, 741585312, 741392593, 741241150, 741581421, 741638031, 741658936, 741318893, 741251831, 741486130, 741382294]
2267.3G41382294M11529j79596l08227k57874K52457J11389n84640J93710R7961K04850
2276.9G41323853j12305j05667M6844P4845Q6593n88150L20664P0572j64567k42156
2286.5G40710526l14866L73459j81656J95389K4033N1422j35269k31781L68118k50168
2296.2G40609207J46485k57111j13525l6698k85873M12826n0735j38626l94974L62701
2305.8G40253677L04566l662M76761l82996j17493m02832Q3084N1117l40118P23877
2315.5G40645981K50244K74963K49024j57471k70157L88565k86712q97904N59235m72641
2325.1G40283127L61709O26831m53643N95474r0561m05884o86J96533j24359n93109
2334.8G40395432o3553J47323m9743K72216k37884o21338O72226K77023M8294m0283
$$ y = [741382294, 741793823, 741614227, 741306000, 741048126, 741300583, 741411972, 740827332, 741021042, 741119003, 741323853, 741211548, 741105881, 741152725, 741227570, 741314163, 740726013, 741046677, 741117249, 740952682, 740710526, 740395660, 740769119, 740587463, 740782852, 740806885, 740858307, 740723038, 740491257, 740859375, 740609207, 740755692, 740498581, 740385056, 740348358, 740062485, 740475311, 740424576, 740285950, 739890976, 740253677, 740558243, 740554581, 741031342, 740648346, 740530853, 740128021, 740211105, 740262222, 739922104, 740645981, 740896225, 741171188, 741420212, 741262741, 740992584, 741381149, 741094437, 740196533, 740755768, 740283127, 740644836, 741271667, 740818024, 741413498, 741322937, 740917053, 740916367, 741112900, 740988541, 740395432, 740331879, 740479202, 740429459, 740701675, 740463791, 739842453, 740514679, 740791702, 740839996, 740799713]
2344.4G40799713o60400p64008j152267l38745J002960J934280N98374n12925P096
2353.1G40914078k00730J091462Q20083r1553j205749j532288R65195J098709j596908
2361.8G40262299q34656J861419j10321n36499n47180r67483j89362j134643p91550
2370.4G37012024k08817K61231j57013j190415n61218M20532M31366j40152r5672m00925
2380.1G35370941o18286k60620Q2321L4485l04337k5177m8446k52838j91574L9062
2389.7G33825531j0529l13339K6551j89362m98657l16162o2790L20434K15531j94016
2399.4G32803192l35846k76489k53067O2790l9673l50418j31149Q4076j4725p0343
2409G31478348K69699j05133m01764j98212j80053m27933o49719K1591J69906J35422
$$ y = [740799713, 740139313, 739375305, 738223038, 737884293, 738887253, 740821533, 741419907, 740906982, 740914078, 740713348, 741804810, 742624893, 742533340, 741327591, 739795303, 740760498, 741859207, 740262299, 739427643, 741289062, 741178741, 740642242, 740095062, 739127579, 738938217, 737803574, 737012024, 736803207, 737064438, 736907425, 735717010, 735155792, 735576324, 736007690, 735867538, 735771866, 735370941, 734752655, 734492035, 734574356, 734608841, 734304504, 734279327, 734230881, 733978043, 733786469, 733825531, 733815002, 733501663, 733528214, 733338852, 732840195, 732524033, 732461243, 732781677, 732997208, 732803192, 732467346, 732190857, 731937790, 732000580, 731960907, 731610489, 731479340, 731563416, 731548691, 731478348, 731748047, 731642914, 731241150, 731042938, 730862885, 730434952, 729785233, 729806824, 729976730, 730112152]
2418.7G30112152L00751J04294m07868q29468k92739j9532J08719r6893j05515J54419
2428.3G29028320n6686k5940l63998k38877l88107n00946j36871m807J95313q4000
2438G27423401K87704j0070m80652l57972k76107o4850n42145j35956K5406J53809
2447.6G26022568Q8119n86624l19977n80978l33099j29014n9280J79367k90527k17285
2457.2G23773270J62277K62298k58255k00195l47595q24509l97262O7901L42484Q6670
2466.9G22667084j01624l33481l509q7204n71823j34506l38746k39105j38473L8757
2476.5G20757370j83716l91235Q1253l82309q4152k92893m89044m73938p56988J26037
2486.2G17910385K32773J39923l26080m44947j88217l43780J91269o790l52936k64282
$$ y = [730112152, 730412903, 730517197, 730109329, 729279861, 728987122, 728967590, 729076309, 728979416, 728873901, 729028320, 728971634, 728945694, 728581696, 728342819, 727954712, 727453766, 727316895, 727312088, 727507401, 727423401, 727711105, 727701035, 727220383, 726862411, 726586304, 726521454, 725979309, 725843353, 725868759, 726022568, 726110687, 725524063, 725204086, 724623108, 724290009, 724160995, 724101715, 724281082, 723990555, 723773270, 723935547, 724197845, 723939590, 723739395, 723391800, 722567291, 722170029, 722237930, 722580414, 722667084, 722565460, 722231979, 722228470, 722141266, 721569443, 721434937, 721096191, 720857086, 720718613, 720757370, 720573654, 720182419, 720263672, 719881363, 719797211, 719504318, 719015274, 718541336, 717784348, 717910385, 718143158, 718283081, 717957001, 717512054, 717323837, 716980057, 717171326, 717164536, 716811600, 716547318]
2495.8G16547318j80512n12238k02941K60620l09067l97492o92443l54386J44348q316
2505.5G14294891r8953j00479J18637m44031m24881j42746k13394k49557l57819k22473
2515.1G12159195l36914J08490J44653l62243o44989n85480L5095K96249Q4381m18395
2524.7G10480042k06452p4463k01340k59323o31866k21710m3793j02539P2861Q392
2534.4G08819809m71420n03617Q0262k13852k86332q8195j69754k52686l10211q4457
2544G06519547N2413q0108n34744o24848k41775R3231p2022J27716K16294m24271k08664
2554.6G04822769l51410n84717n48172l40652L82462M21142j89819q76999k34528p9803
2564.3G02420273l39890K137k72828o790k04696j43967O6376J7547N1956o04782n56183
$$ y = [716547318, 716366806, 715854568, 715651627, 715912247, 715603180, 715205688, 714513245, 714158859, 714303207, 714294891, 714195938, 714095459, 714214096, 713770065, 713345184, 713202438, 712989044, 712739487, 712381668, 712159195, 711822281, 711930771, 712075424, 711713181, 711068192, 710482712, 710517807, 710814056, 710898437, 710480042, 710273590, 710199127, 709997787, 709738464, 709106598, 708884888, 708841095, 708738556, 708811417, 708819809, 708348389, 707844772, 707925034, 707711182, 707424850, 707336655, 707166901, 706914215, 706604004, 706519547, 706571960, 706491852, 705957108, 705332260, 705090485, 705183716, 705111694, 705239410, 705455704, 705031433, 704822769, 704471359, 703886642, 703338470, 702997818, 703380280, 703801422, 703611603, 702734604, 702500076, 702420273, 702080383, 702082520, 701809692, 701802902, 701598206, 701454239, 701520615, 701538162, 701590118, 700985336, 700429153]
2574.9G00429153o54602l37371n0736j84708J27717p9346o3782l64304k98538j95999
2584.5F98327484l66287j7243l09295n01404k43607L33329L52783k00958k98081k19192
2594.2F96857529l06702m48990k72293n82962o67496o1111M44336L10974j92185k67181
2603.8F94813919m16794l72696m72488k52304j4801k34375L8299q2244o1417k60468
2613.5F92684631p51571o38733m29230l18222j82190J2207j97372J62506K10876l82461
2623.1F90170441m90799l72544j8005l98865m53796k3804J20392j31989o83364m95224
2632.8F87222443k81067j8463k06528j93939q3847o91452k33078J07193j93482l74603
2642.4F85053177j55411r9869m46396k23541l38211l02429j54266k96784l14789m67376
$$ y = [700429153, 699774551, 699437180, 699386444, 699201736, 699329453, 699250107, 699186325, 698822021, 698523483, 698327484, 697961197, 697943954, 697634659, 697133255, 696889648, 697222977, 697575760, 697374802, 697076721, 696857529, 696550827, 696101837, 695829544, 695246582, 694579086, 694517975, 694962311, 695273285, 695081100, 694813919, 694397125, 694024429, 693551941, 693299637, 693284836, 693050461, 693088760, 693006516, 692945099, 692684631, 691933060, 691294327, 690865097, 690546875, 690364685, 690376892, 690179520, 690342026, 690552902, 690170441, 689679642, 689307098, 689289093, 688890228, 688436432, 688412628, 688533020, 688401031, 687717667, 687222443, 686941376, 686922913, 686716385, 686522446, 686438599, 685747147, 685514069, 685621262, 685427780, 685053177, 684897766, 684797897, 684351501, 684127960, 683789749, 683487320, 683333054, 683036270, 682721481, 682254105]
2652F82254105j68000K88697k823o55976n51910k32849N34M45404L14255n29480p24411
2662.6F80437546j38092k68784k15988j35651l10363l30429m83704r6054k37961p0877
2672.3F78149643K77634m61655n12924k9373r0256k02713J40228j15890m18625j93329
2681.9F76542740k13013l50647n70755k60544k22778l23257j66779j28403M9591k22015
2691.6F74134140k09503j6327m4785k12478n03311l96195J04523J04065n75333k67181
2701.2F72117615j81580m79431j61362m0741o1340k79770Q2169N8975k91977l58887
2710.9F70403671n39703k61536j88293J94244M8828k72598m2648n92804o47812N34
2720.5F68101883L44162j52283n07660q3236J09253j15357k55966j10245m30374m58832
$$ y = [682254105, 682086105, 682374802, 682371979, 681716003, 681164093, 680931244, 680931778, 681377182, 681691437, 681161957, 680437546, 680299454, 680030670, 679814682, 679679031, 679368668, 679038239, 678554535, 678458481, 678220520, 678149643, 678427277, 677965622, 677452698, 677423325, 677333069, 677130356, 677270584, 677154694, 676736069, 676542740, 676329727, 675979080, 675408325, 675147781, 674925003, 674601746, 674434967, 674306564, 674356155, 674134140, 673924637, 673908310, 673863525, 673651047, 673147736, 672751541, 672856064, 672960129, 672384796, 672117615, 671936035, 671456604, 671295242, 671254501, 671193161, 670913391, 670995560, 671054535, 670762558, 670403671, 669863968, 669602432, 669414139, 669608383, 669657211, 669384613, 669341965, 668749161, 668101349, 668101883, 668446045, 668293762, 667786102, 667702866, 667812119, 667696762, 667440796, 667330551, 666900177, 666441345]
2730.2F66441345j0757J17035k76718m54483J5335N7830K37885P5989l17993k16065
2739.8F65669403j91803k70386m77218j91498J450J73568J26572r6665n1574n27115
2749.4F64164734o77109p69195k86484L60489L01971J95389j96762J35040Q0567l89176
2759.1F62919464m62952n99288j82801k58407n23301m2190K70767k7923k2507N9662
2768.7F61130524l15323m58756l19214Q3161j16348k80533j04904m49830l60412k12860
2778.4F58595505l44925l35159r9335j10092l31574p7743q7738l94364l51410j08337
2788F56354828j71127l64075k21558q8806m47693n51910p2632k8076q0414l17459p83157
2798.6F53227921q50831m25338P5836o4087j98364m39530m23126l56522p24639l19519
$$ y = [666441345, 666430588, 666547623, 666270905, 665816422, 665831757, 665889587, 666127472, 666203461, 665885468, 665669403, 665477600, 665207214, 664729996, 664538498, 664539948, 664713516, 664840088, 664743423, 664691849, 664164734, 663487625, 662718430, 662431946, 662792435, 663094406, 663289795, 663093033, 663228073, 663308640, 662919464, 662456512, 661857224, 661674423, 661416016, 660892715, 660850525, 661121292, 661093369, 661070862, 661130524, 660815201, 660356445, 660037231, 660120392, 660004044, 659723511, 659618607, 659168777, 658808365, 658595505, 658250580, 657915421, 657816086, 657705994, 657374420, 657296677, 657208939, 656814575, 656463165, 656354828, 656183701, 655819626, 655598068, 655509262, 655061569, 654509659, 654437027, 654408951, 654328537, 654011078, 653227921, 652377090, 651951752, 652027588, 651963501, 651765137, 651325607, 650902481, 650545959, 649821320, 649501801]
2808.3F49501801O9656j41220o10886q15811q56476m75998K13852j72348m95529m09164
2817.9F45807877l40424p31277r07288j70898k56501m18930m05655n25589l97949k28195
2827.6F41425171l63693j062432p66906j22910k31743m43306o32019q49304p27272
2836.2F36225586k98538p66182j094551r86481j326485j093673q30689j188393j301574
2844.9F27339020j222420j049194r45092j620101j642151j022301j076088j070824
2852.6F17690849q06007l4561L04489j94512j90925K08740o1951n13725n5275L38936
2862.3F16686058L17955k37465n19066n67894j015587o72988n52369j52587K0179n14030
2871.9F12792206m98772p57179o85425m18129O8321N4741l48510l57819o91872k95372
$$ y = [649501801, 649571457, 649430237, 648819351, 648003540, 647147064, 646671066, 646884918, 646712570, 646217041, 645807877, 645467453, 644736176, 643828888, 643657990, 643401489, 642982559, 642576904, 642051315, 641653366, 641425171, 641061478, 639999046, 639232140, 639109230, 638877487, 638434181, 637802162, 636952858, 636225586, 635927048, 635160866, 634066315, 633079834, 631753349, 630659676, 629828987, 628640594, 627339020, 626116600, 625067406, 624122314, 622502213, 620860062, 619837761, 618761673, 617690849, 616884842, 616850281, 617154770, 616960258, 616769333, 616978073, 616916122, 616402397, 616347122, 616686058, 617004013, 616766548, 616247482, 615679588, 614664001, 613991013, 613438644, 613286057, 613306236, 612792206, 612293434, 611536255, 610850830, 610432701, 610501022, 610555763, 610207253, 609849434, 609157562, 608862190]
2881.6F08862190l95050p27043l26118l87993j054268j131020k71034l31001k32048
2890.2F04006615l96958p39517n58891j007004n91431q05511q89664j26762l83797
2898.9E98507080m24385n10406p22924p08275m43000n58815p43714m63600p40547q55141
2908.6E92336273n79490k51198p69997j273003r92240j163292r97010r28802j068192
2917.2E84313049j212997j341667r90258r04083n64384j64109k91786m08783j80435
2925.9E78254547q3961L2043M33579K82516J76315L01857J52169M1351M85496O24581
2935.6E80700493O0005J94283J88446J62811Q64029R06715O66657O01120M06036M47617
2945.2E85198212M47807N02930L76205J10932L17535j22147N4016O50177j95388l65601
$$ y = [608862190, 608467140, 607740097, 607413979, 607025986, 605971718, 604840698, 604569664, 604238663, 604006615, 603609657, 602870140, 602311249, 601304245, 600712814, 599907303, 599017639, 598890877, 598507080, 598082695, 597572289, 596849365, 596141090, 595698090, 595139275, 594395561, 593931961, 593191414, 592336273, 591756783, 591505585, 590735588, 589462585, 588470345, 587307053, 586310043, 585381241, 584313049, 583100052, 581758385, 580768127, 579864044, 579299660, 579135551, 578843765, 578434982, 578254547, 578170586, 578202629, 578636208, 578918724, 579095039, 579396896, 579549065, 579590416, 580075912, 580700493, 580760498, 580954781, 581143227, 581306038, 582170067, 583076782, 583743439, 584344559, 584750595, 585198212, 585646019, 586148949, 586525154, 586636086, 586953621, 586831474, 586885490, 587535667, 587340279, 586974678]
2954.8E86974678J2856K61726M91028M87175L95698n951K61155L81889q4419j40839
2964.5E89034996L93066P01333P23419Q91571P9765p2060O56472N82428J70669o1455
2974.1E93100204L68691O97784P04041M06303J03302m5089n4779M30221K04964P9269
2983.8E95994911K92740J84937J97639M8103k5558J221K04658J37596Q431j05744l08075
2994.4E96630859K58828J89781m52805m77714l41988l11508k50282N4283k83242p12699
3004E94303513k61116j19133j08185J22757j41487p43523o66428K94762J8539p54928
3013.7E91944771m77638m11835j71509m22134m88587l14636j080818o53954k81944
3022.4E87641716n41382k05383J11656j36375p70836n13611o02112p03697l40729l05138
$$ y = [586974678, 586987534, 587249260, 587740288, 588227463, 588623161, 588617210, 588878365, 589260254, 589175835, 589034996, 589428062, 590129395, 590852814, 591744385, 591824150, 591752090, 592408562, 592990990, 593161659, 593100204, 593468895, 594166679, 594870720, 595277023, 595380325, 595335236, 595280457, 595710678, 595915642, 595994911, 596287651, 596472588, 596670227, 596718330, 596692772, 596693993, 596898651, 597036247, 597044678, 596938934, 596630859, 596889687, 597079468, 596626663, 596148949, 595806961, 595495453, 595245171, 595299454, 595016212, 594303513, 594042397, 593923264, 593815079, 593937836, 593796349, 593052826, 592386398, 592681160, 592699699, 591944771, 591467133, 591055298, 590883789, 590461655, 589973068, 589658432, 588577614, 587923660, 587641716, 587100334, 586894951, 587006607, 586870232, 586099396, 585585785, 584983673, 584279976, 583939247, 583634109]
3032E83634109k44522q68835p31125j90964l39126m05922o33049o01044o03561n34211
3041.6E78481750m75120p79343l44391J37940o40755j132774o72493l97835l60260
3050.3E73816719p07779p72705l88451p6561j68342o65131m85916m59900n66826l84178
3060E69140930n50422p40815p02095o17981o68945O5460K03896p78733j078949r74426
3069.6E63297920n80520k10953o7864k12288l13415l87039n54657l25241o14968n43823
3079.2E59487152j56364m80881p16744n53131j79786m03214n44319k00615m50439q59948
3088.9E54941711m44679l85666o67190k76947m67682m00582l95355q27598m26827k01263
3098.5E50447922k26250o46210p62252p81403p77168K2506N303l10478n36156p47032
$$ y = [583634109, 583389587, 582520752, 581789627, 581598663, 581259537, 580853615, 580220566, 579619522, 579015961, 578481750, 578006630, 577227287, 576882896, 577020836, 576380081, 575247307, 574574814, 574176979, 573816719, 573108940, 572336235, 571947784, 571871223, 571702881, 571037750, 570551834, 570091934, 569525108, 569140930, 568590508, 567849693, 567147598, 566529617, 565860672, 565926132, 566130028, 565351295, 564272346, 563297920, 562717400, 562506447, 562438583, 562226295, 561912880, 561525841, 560971184, 560645943, 560030975, 559487152, 559330788, 558849907, 558133163, 557580032, 557400246, 556997032, 556452713, 556252098, 555801659, 554941711, 554497032, 554111366, 553444176, 553167229, 552699547, 552298965, 551903610, 551076012, 550649185, 550447922, 550221672, 549575462, 548813210, 548031807, 547254639, 547277145, 547282448, 546971970, 546435814, 545688782]
3108.2E45688782n70793k66648j14212o00509q22030p91931n38253j52169q5945k51922
3117.8E41494370j051941j223336o74591l30009j07537o61621r77439m49791l21732
3126.5E35696373m55322n44396o35566o93016o49262j19476n53093j134033n42908
3135.2E30369301k05002o1188n30929q44078p22847q01697m93508m78286p30438q46215
3144.8E24655113m56390o27365q62732k10419n33562o43615n30663p39555o66428r79080
3154.5E18405304o86340n7297k39868o91719n96352n21584o07833p31888q97904o05774
3164.1E12768745q27446o76918j35078n66978p60422o79016p33300n66406n00831p43561
3173.8E06578789p02324m57344k33155k31056q88061r98497o17981o61965p76214n36614
$$ y = [545688782, 545117989, 544851341, 544737129, 544136620, 543314590, 542522659, 541984406, 541832237, 541746292, 541494370, 540442429, 539219093, 538544502, 538214493, 538106956, 537445335, 536467896, 536018105, 535696373, 535241051, 534696655, 534061089, 533368073, 532718811, 532599335, 532046242, 530912209, 530369301, 530164299, 530103111, 529572182, 528728104, 528005257, 527203560, 526710052, 526231766, 525501328, 524655113, 524198723, 523571358, 522708626, 522498207, 521964645, 521321030, 520790367, 520050812, 519384384, 518405304, 517718964, 517661667, 517421799, 516730080, 516133728, 515612144, 515004311, 514272423, 513374519, 512768745, 511941299, 511264381, 511129303, 510562325, 509801903, 509122887, 508389587, 507823181, 507322350, 506578789, 505876465, 505419121, 505185966, 504954910, 504066849, 503068352, 502450371, 501788406, 501012192, 500475578]
3183.4E00475578m47273q05130p48291m50325l20396m80309p72133r34753q24700n24711
3193D94167557m78096n03006o20957m44679n09300p34368l57093n20020p71751n55153
3202.7D88673134l31879o46782r96818l91541l2196n78079j013336q75511n62211o5345
3212.3D83179436l19367r28077o00777m65088n42221n05219l28941o10618p55196n15175
3222D77608757o92978p4959j23443o79550m11225l91960p45277q51784j41144J89438
3231.6D73685875l32718j227341r90715m70504n20630l26462j245995p37381J70822
3240.3D68004951k78358n64232p75032M6425k09923n31425m08097l37677R0943r60427
3249.9D64077148p09419j71242k39563l16886j174508p17506l69072n17158n88036
$$ y = [500475578, 500028305, 499223175, 498474884, 498024559, 497704163, 497223854, 496451721, 495516968, 494692268, 494167557, 493689461, 493186455, 492565498, 492120819, 491611519, 490877151, 490520058, 490000038, 489228287, 488673134, 488341255, 487694473, 486697655, 486306114, 486273918, 485695839, 484682503, 483806992, 483244781, 483179436, 482860069, 481931992, 481331215, 480866127, 480323906, 479818687, 479489746, 478879128, 478123932, 477608757, 476915779, 476840820, 476717377, 476037827, 475626602, 475234642, 474489365, 473637581, 473496437, 473685875, 473353157, 472125816, 471135101, 470664597, 470143967, 469817505, 468571510, 467834129, 468004951, 467726593, 467162361, 466387329, 466433754, 466223831, 465692406, 465284309, 464946632, 465037575, 464077148, 463367729, 463196487, 462956924, 462640038, 461465530, 460748024, 460378952, 459861794, 459273758]
3258.6D59273758n49164l61671l8796P3624q60481o91109m2801k02065n38635m79698
3268.3D55582962k83165o90117j91383L61481J38359m37775p16286l18603q05588r60846
3277.9D51679039j45035k2735m57917l80096k25105j45493p1068p15942j185341o85043
3287.5D47645264J54762K4872l60031j86348m10195m95033m71001n67283n07965l45154
3297.2D44481888k32544k48375l47443k60544J9341j71432k22550n33028p01675k26250
3306.8D41557388l13606m93965o68106m89693m34074o95229n59006l07769k99836p35740
3316.5D36560364n99785n68543o48536o11305m27323J73531k82364o13175q73565o01845
3326.1D31507454k02408j210709j274223p39632m0321J1826n04341m64592q64449j018791
$$ y = [459273758, 458724594, 458362923, 458324127, 458397751, 457537270, 456846161, 456803360, 456601295, 456062660, 455582962, 455299797, 454609680, 454418297, 454779778, 454918137, 454480362, 453764076, 453445473, 452639885, 451679039, 451534004, 451511269, 451053352, 450673256, 450448151, 450302658, 450231590, 449515648, 448330307, 447645264, 447800026, 447824898, 447464867, 447278519, 446868324, 446373291, 445902290, 445335007, 444827042, 444481888, 444249344, 444000969, 443653526, 443392982, 443412323, 443240891, 443018341, 442485313, 441783638, 441557388, 441243782, 440749817, 440081711, 439592018, 439157944, 438462715, 437903709, 437595940, 437296104, 436560364, 435960579, 435392036, 434743500, 434132195, 433704872, 433878403, 433596039, 432982864, 432109299, 431507454, 431305046, 430094337, 428820114, 428080482, 428040161, 428051987, 427547646, 427083054, 426218605, 425199814]
3335.8D25199814o54526j93176p24526j085472p44858o77986l8948q4457p00264j280899
3345.4D19014702j165390n7869K03476p17354j227531k60697N1575m17519q30497r99794
3355.1D13593102n09644k28272l27491j121483o93398Q7662n40199o39153k64740J29013
3364.7D09485397m12826o39649n06134j201782p27806k21977l65830m40941l95202
3373.4D04573250M2648l1662o41594p35969l06130k38914o58875p05108n1499m8218
3383D01197929n78155p06139o58989l96805j49574L42293P6485o49605n63164m20723
3392.7C97493553N3330K00653j18485k84843l12691N0926J34087n18379r59282l26996
3402.3C95411873l7727m58718l06816J51405J62735k45552m71611k85301K19536J77994
$$ y = [425199814, 424545288, 424352112, 423627586, 422542114, 421797256, 421119270, 421080322, 420995865, 420295601, 419014702, 417849312, 417791443, 417994919, 417277565, 416050034, 415789337, 415840912, 415423393, 414592896, 413593102, 413083458, 412855186, 412527695, 411406212, 410712814, 410800476, 410260277, 409621124, 409356384, 409485397, 409072571, 408432922, 407926788, 406725006, 405997200, 405775223, 405409393, 404968452, 404573250, 404615898, 404584236, 403942642, 403206673, 402900543, 402661629, 402002754, 401297646, 401246147, 401197929, 400619774, 399913635, 399254646, 398857841, 398708267, 399050560, 399127045, 398477440, 397914276, 397493553, 397546883, 397747536, 397629051, 397344208, 397031517, 397082443, 397216530, 396698151, 395738869, 395411873, 395374146, 394915428, 394608612, 394760017, 394922752, 394677200, 394205589, 393920288, 394139824, 394317818]
3412C94317818m82903m99420J10130J93520j68228N9204O54068M22287q27255o73943
3421.6C93105278J79634J90048M45862J77498M10576L27148p83233k65007N30510M76112
3431.2C94794426K23656J14631J73912L5324J19248M3030l40195p629J98402J90277
3440.9C95545082O83518r4796o49872L47863J532211J088219r33533L66936R85641
3449.6C98871269J81732O98052L56903O41937N86243j13564L60070J005821P53898
3458.2D03342361n4626N49698Q96759K85873J37215P93648J087227M93850N15023K74620
3467.9D08321648N37414Q26264j27221j56784O66237P45201M08364P99637J189041
3476.6D13209801J225891O00242L88909J079559Q57926l5477l07160J046982P82090
$$ y = [394317818, 393834915, 393335495, 393445625, 393639145, 393470917, 393530121, 394184189, 394606476, 393779221, 393105278, 393284912, 393474960, 393920822, 394098320, 394508896, 394836044, 394052811, 393787804, 394318314, 394794426, 395018082, 395132713, 395306625, 395341949, 395461197, 395504227, 395164032, 395156403, 395354805, 395545082, 396228600, 396133804, 395483932, 395831795, 397364006, 398452225, 397518692, 397885628, 398871269, 399053001, 399751053, 400107956, 400749893, 401336136, 401222572, 401582642, 402588463, 403342361, 403287735, 403837433, 404734192, 405020065, 405157280, 405950928, 407038155, 407532005, 408047028, 408321648, 408859062, 409685326, 409558105, 409401321, 410067558, 410812759, 411221123, 412020760, 413209801, 414435692, 415035934, 415424843, 416504402, 417362328, 417326851, 417019691, 418066673, 418848763]
3485.2D18848763J55639J245194M47807L36761J154862R81483P52831N81398O66504
3493.9D25171242N46150R65805O44569K10076J203155J215782M24614N88952J049919
3502.6D32020264M05807q6403R98154J467094Q48809J233787N26085l14941J316490
3511.3D38415146J341362P28607N16243N43556O89469P76100R48715L82919R04732
3520D45246849J180420J160278J074791J11847L61595R96285J516304P90558P49244
3528.6D53188171Q39310N48668Q22906Q29201J430779Q85086J552429J446075J37253
3537.3D61679878J151543R04388R84612Q42476J066551J133957J361961J376229n3254
3546D70448341Q97293R4643J701508J444816Q30422K769050k93770L48969Q26683J520500
$$ y = [418848763, 419004402, 420249596, 420697403, 421034164, 422189026, 423170509, 423923340, 424504738, 425171242, 425717392, 426683197, 427327766, 427537842, 428740997, 429956779, 430381393, 430970345, 432020264, 432426071, 432339668, 433337822, 434804916, 435653725, 436887512, 437413597, 437098656, 438415146, 439756508, 440485115, 441001358, 441544914, 442234383, 443010483, 443959198, 444342117, 445246849, 446427269, 447587547, 448662338, 448774185, 449135780, 450132065, 451648369, 452438927, 453188171, 454027481, 454576149, 455399055, 456228256, 457659035, 458544121, 460096550, 461542625, 461679878, 462831421, 463735809, 464720421, 465562897, 466629448, 467763405, 469125366, 470501595, 470448341, 471345634, 471440277, 473141785, 474586601, 475417023, 478186073, 477892303, 478241272, 479067955, 480588455]
3555.6D80588455K517433M92173J629257J443062J034927K17247J263237J647110Q46176
3564.3D91679077M400978O97861j038170R58557o7901K658004J568261J539306J207581
3573E03603554J525421P75032R13200K501984J90582J997872J777496O59447K035522
3581.7E15980110K054787J322288j44348L756180K310753j214256K258949j236153
3589.4E25088310K006493K822304K808113J565513J80817L096008p59887J433830L320656
3598.1E41562157J030082K105370M7646R40628K223510J883316K341462K416610J659279
3606.8E56210060j055946L138428l4447n84946P133179J309318k111969M621544M3106
3615.4E68668327L000298L635063j065674P19223j00136J801224L169861K199898K091827
$$ y = [480588455, 483105888, 483598061, 485227318, 486670380, 487705307, 487922554, 489185791, 490832901, 491679077, 496080055, 496777916, 495739746, 496698303, 496630402, 499288406, 500856667, 502395973, 503603554, 505128975, 505904007, 506817207, 509319191, 509509773, 511507645, 513285141, 513944588, 515980110, 518034897, 519357185, 519212837, 522969017, 525279770, 524065514, 526324463, 525088310, 527094803, 529917107, 532725220, 534290733, 534471550, 537567558, 536807671, 538241501, 541562157, 542592239, 544697609, 544745255, 545685883, 547909393, 549792709, 552134171, 554550781, 556210060, 555154114, 558292542, 558258095, 557673149, 564806328, 566115646, 564003677, 568625221, 568668327, 571668625, 575303688, 574238014, 574957237, 574857101, 576658325, 579828186, 582028084, 584119911]
3624.1E84119911K541123J897468K075691O836091M52384j0646476M067192M639473
3631.8E95982857N318832J690140j391296J917877K227440K272682R94949J171303
3639.5F10184784J927986K381134J532173O05126K122154L486786O775818m9973n089874
3648.2F23876114N027199j080017l096924o00014M682922M284821M557342O458588
3655.9F44110031q544998j48010N468750J242065J088257Q47015K007294M71726J222152
3664.6F47764282K160721P55386M241944K225265j425400P2251o037827J491242P080841
3673.3F58328705R143219K356567j9214020n11093P054673N163955j883163J91955
3681F60630798K425919J238251J120300O54831O69098L673477P430649q905869o236801
$$ y = [584119911, 586661034, 588558502, 590634193, 597470284, 597922668, 587276192, 591343384, 595982857, 601301689, 602991829, 601600533, 603518410, 605745850, 608018532, 609013481, 610184784, 612112770, 614493904, 616026077, 616631203, 618753357, 622240143, 629015961, 628965988, 623876114, 628903313, 627823296, 624726372, 624126358, 628809280, 633094101, 637651443, 644110031, 635565033, 635417023, 640885773, 642127838, 643216095, 644063110, 646070404, 646542130, 647764282, 649925003, 650680389, 654922333, 657147598, 655722198, 655794449, 649756622, 651247864, 658328705, 667471924, 669828491, 650614471, 650103378, 657158051, 662322006, 660438843, 660630798, 663056717, 664294968, 665415268, 666070099, 666739197, 670412674, 677843323, 668937454, 662700653]
3689.7F62700653Q758698n402832m59137N853195M75158O57273L33175K4491R61761
3698.4F73902435N0431K242355L301086n326233l367767M542389K024155L95965L11203
3707F78076019K113877L580398p062149L136673N836945j2749558J819535M235153
3714.8F78986893N17425K57950K351379J958237l120956k57035N627442k354279n520858
3723.4F78446198M971618J281433j157074k699585m0512L478623L58505N666962k010193
3732.1F88295975q869629R106750J660538j0994644k76413J667328K40249L804779
3739.8F84634933M599610m410477J082993J2018356l557281k0696640P319488N924988
3747.5F86915970O193848l233490j1502762J1657333l318481r474945N270233M993744
$$ y = [662700653, 671459351, 666056519, 665597382, 671450577, 671925735, 672583008, 672916183, 672940674, 673902435, 673952866, 676195221, 679496307, 674170074, 670802307, 675344696, 677368851, 677764816, 678076019, 680189896, 683770294, 676708145, 679844818, 685681763, 672932205, 674751740, 678986893, 679504318, 679762268, 682113647, 684071884, 680950928, 680693893, 686321335, 683967056, 678446198, 683417816, 684699249, 683542175, 680842590, 680802078, 684280701, 684639206, 690306168, 688295975, 679426346, 688533096, 690193634, 679198990, 678922577, 680589905, 680830154, 684634933, 689234543, 684824066, 685907059, 697925415, 694368134, 673671494, 680990982, 686915970, 693109818, 689876328, 678373566, 690030899, 686712418, 677237473, 682507706, 687501450]
3755.3F87501450L677520n718460J162949O424179o751251l026810L271179J634979
3763F88175735M73252K979278j355056m609070K407532N091018P91626r489593P70263
3771.7F85234985L543396M64173P18536l26538P00989O67953K706299L18985q849640
3780.3F85179138J087723K470703J393433K918625k730790j763076R42535Q98361J473618
3789F91870270J8463m47998o37131N48782M90571J368484L447495m143982m505387
3797.7F88009567K202072L737488P361069l328705j4124603J610489K292480M658890
3805.4F92418747P761917q495789p064437M454803J969986J60523R05532K2507P76978
3814.1F92910767O003036J095657j5263137K831878N557328M913177L705826j7562409
$$ y = [687501450, 691178970, 685460510, 686623459, 693047638, 686296387, 683269577, 686540756, 688175735, 688648987, 691628265, 690273209, 685664139, 688071671, 693162689, 693954315, 684464722, 685234985, 688778381, 689242554, 689961090, 689634552, 690335541, 691003494, 693709793, 694028778, 685179138, 686266861, 688737564, 690130997, 693049622, 690318832, 688555756, 689498291, 690396652, 691870270, 691888733, 691440735, 690803604, 691352386, 691842957, 693211441, 696658936, 692514954, 688009567, 690211639, 693949127, 701310196, 697981491, 683856888, 685467377, 687759857, 692418747, 700180664, 691684875, 684620438, 689075241, 691045227, 691205750, 692111282, 692133789, 692910767, 698913803, 700009460, 684746323, 687578201, 693135529, 698048706, 701754532, 684192123]
3821.8F84192123n81741N301056K408524K775421M17022m572525j141128J430206M116364
3830.5F94345322L077087r453506J074371P949448n005722q11921J0345612p006455
3838.2F94514236q255844O738358m761810m77829P319793k001037m950333K365570
3845.9F90491104J314087n44205K036743j44958R41620M127807n273666M352722j4175338
3854.6F83125916j829987J0450516n75028k422867J997757K006302L601532l782120
3862.3F92572021o93054O944046p015533p748490M509659O036072O975098o505280
3870F95074539j0780868K799835O404266M457550j0151520k26211L717575m95148J994629
3878.7F92794647M535141m435425p406463M841919Q94241J598206O604766j2019271
$$ y = [684192123, 683610382, 688911438, 691319962, 694095383, 694512405, 689939880, 688798752, 690228958, 694345322, 697422409, 687968903, 689043274, 696992722, 691987000, 691175079, 701520691, 694514236, 686258392, 692996750, 688234940, 687757111, 695076904, 693075867, 688125534, 690491104, 691805191, 691260986, 693297729, 693152771, 694094391, 698222198, 692948532, 697301254, 683125916, 681295929, 691746445, 691171417, 688748550, 690746307, 692752609, 696354141, 692572021, 691878967, 698823013, 691807480, 684058990, 688568649, 694604721, 701579819, 695074539, 684293671, 687093506, 693497772, 697955322, 687803802, 687577591, 691295166, 690800018, 692794647, 697329788, 692894363, 685487900, 690329819, 691224060, 692822266, 699427032, 687407761]
3886.4F87407761p27616L956223Q15658M125138p61719q970261O83518L359298n91049
3895.1F89296951J584854J297303K894516K560119j1385727M297333L245392n964203
3902.8F87826538N233612j653519j944122k95715k8000J858368n18494J94473k33154
3911.5F90439987M14963M23279p65915J833954K823639l120041l649750M569015j49688
3920.2F92819443n165787K087708J775360Q07571j609116l027572J148376J579438
3927.9F90415421J462097n84870k94265K150039k310028k419739J671296Q32138m33045
3936.6F90489044K19269K12708l54081m93545J488418J624680l999176j618347J553344
3945.2F89122314J247788J501541j244049K09427J3275k103577J154175L4180n15824
$$ y = [687407761, 686680145, 690636368, 691452026, 695577164, 694815445, 685845184, 686528702, 689888000, 689296951, 690881805, 692179108, 695073624, 697633743, 686248016, 690545349, 693790741, 687826538, 693060150, 691406631, 689462509, 689166794, 689138794, 690997162, 690478668, 690673141, 690439987, 690854950, 691278229, 690512314, 692346268, 695169907, 692049866, 688400116, 692969131, 692819443, 687653656, 689741364, 691516724, 692324295, 690715179, 687687607, 688835983, 690415421, 691877518, 691292648, 690998383, 693148422, 690838394, 688418655, 690089951, 690922089, 690489044, 690708313, 690921021, 690566940, 690073395, 691561813, 693186493, 689187317, 687568970, 689122314, 690370102, 691871643, 690627594, 690837021, 690850296, 688746719, 689900894, 689935074, 689419250]
3953.9F89419250M86603J6938q6518p94449N07355M46167L43704J59149j738815j43127
3963.6F88616257O43387K58636K76566M5318J261673L01819j472397k27432o180j93863
3973.2F89503784M88434J39465l37219n65491j94168R3460J41144k5101k26821J84936
3982.8F89202423o9809P3395K0447K98538N27038n57098j37482k62527K07138Q52585
3992.5F90154648l04794j75553m18091J00479R70002L05557m33807j141434
4000.2F89057007
$$ y = [689419250, 689905853, 689922791, 689836273, 689041824, 689549179, 689995346, 690339050, 690498199, 688759384, 688616257, 689259644, 689518280, 689794846, 689840164, 691101837, 691403656, 689931259, 689703827, 689697647, 689503784, 689992218, 690131683, 689794464, 689228973, 689034805, 689128265, 689269409, 689244308, 689017487, 689202423, 689132614, 689206009, 689226456, 689524994, 690052032, 689494934, 689357452, 689094925, 689302063, 690154648, 689849854, 689674301, 689256210, 689356689, 690326691, 690632248, 690198441, 689057007]
##END=$$ End of the data block
