##TITLE=$$ Begin of the data block
##JCAMP-DX=5.00 $$ ACD/SpecManager v 10.08
##SPECTROMETER/DATA SYSTEM=Varian
##DATE=08 Jan 2013 15:11:18
##DATA TYPE=INFRARED SPECTRUM
##DATA CLASS=XYDATA
##ORIGIN=
##OWNER=
##NPOINTS=3735
##FIRSTX=399.26403809
##LASTX=4000.35498047
##MAXX=4000.35498047
##MINX=399.26403809
##MAXY=75.76239014
##MINY=39.23354340
##XFACTOR=1.0000000000
##YFACTOR=0.000000100000000
##FIRSTY=60.94572830
##DELTAX=0.96440572
##XUNITS=1/CM
##YUNITS=TRANSMITTANCE
##XYDATA=(X++(Y..Y))
399.3 609457283 592749138 595637856 593809280 585825348 582078438 584997177 596611328 604516144
407 604516144 599683418 593552780 593970642 599049301 600225372 594684563 588984680 588642006 589316826
415.7 589316826 590146790 588208466 578644676 601953506 607044907 594100113 586153717 587001877
423.4 587001877 591692963 587474670 583469315 584050560 584855728 589651146 591243324 591186333 593951530
432.1 593951530 599298134 598337135 586330261 580887108 581910782 586486931 591209412 588612671
439.8 588612671 585521507 582912216 580916328 582348557 585879631 587878647 589871025 591600761
447.5 591600761 588188019 588812065 592614098 590504303 585581703 583990707 585621376 585354195 583744850
456.2 583744850 579765739 574760780 579174461 583821487 584048729 581634636 582414856 583697090 585120125
464.8 585120125 586140900 587020798 588655777 588255386 587029991 583043365 577905388 574551010 573296089
473.5 573296089 573837090 573592682 572890739 575387535 579907494 579468231 575573502 573150902 575960770
482.2 575960770 581151924 582047653 582196846 578798561 576242447 576684914 573893433 575008545 577976723
490.9 577976723 579415779 577472420 575087967 576522827 577334442 576626892 573473129 572625351 576329269
499.6 576329269 579563866 579096107 574967728 573998184 574160995 573606567 572879028 576942787 579573746
508.2 579573746 575707550 576842499 578110161 574041023 572091446 573444748 575569572 573980026
516 573980026 570050583 567799377 566980438 566875954 568870049 572137222 572893105 570908127 570059357
524.6 570059357 570781326 569631310 568183479 567930641 568270302 568592491 567854347 567357445 567294922 567487106
534.3 567487106 567715149 567697334 567254906 567369614 567569809 565453148 564379463 564567719 564090652 564560852
543.9 564560852 564292946 562438049 562324486 563909302 563044853 561696091 562054482 563389473 564307098
552.6 564307098 563197708 563042984 563297691 562705383 561401749 560013809 560771179 561848412 562678337
561.3 562678337 563251534 562658730 560743904 559493942 559205093 558825340 560705528 561672325 561682396
570 561682396 561771927 559808350 560207863 561650658 560651207 559761581 559911423 560933418 562309456 562764511
579.6 562764511 561253128 559349785 559430733 558982315 558790359 560365906 560471954 561007996 562011375
588.3 562011375 562668266 563769417 563467331 564094963 564555359 564238052 565435104 565598526 564913559
597 564913559 564421082 564065323 564846878 565785332 565348625 564443169 564020691 563792229 563634758 562485771
606.6 562485771 561709442 562534943 562596741 562405243 562547760 562289734 562824402 562433395 560581665 560340881
616.3 560340881 560456543 560981979 561530266 559857330 559996643 561909523 563103333 564616928 566206131
624.9 566206131 567720871 568298035 567726440 567261543 567246284 568464394 570926399 572667427 573918648
633.6 573918648 574177933 573330765 574116325 575247459 576225281 577905235 578564606 578025780 578802757
642.3 578802757 580774536 581678619 582776031 583551521 583828888 584517288 584521065 585860329 587635994
651 587635994 587568016 587053719 587054596 587929268 588562660 588124390 587840385 587801361 587390442 587297821 587508507
661.6 587508507 587631683 588264503 588273659 588012924 588750000 588676643 586351967 587900047 588470306 589205780
671.2 589205780 591380844 592301178 591825829 593157921 594612350 594488258 594587479 595923805 597464676
679.9 597464676 597492523 596852036 597262840 598888130 600067940 600217361 601411057 602418709 601892242
688.6 601892242 602094002 603052063 604168243 605055237 604793205 605012703 605565910 605531502 606403084 607373352
698.2 607373352 608231621 608668327 607965584 608274765 609595985 610157166 609463005 609443359 610493927 611196365
707.9 611196365 611832123 612023506 612356148 612622833 613222847 614779968 615965385 616679573 616455002
716.6 616455002 616727409 617496223 617382660 617133598 617920341 619537544 619425240 618728371 618777504 619734344
726.2 619734344 621194839 621744690 622952271 624330559 625639114 626241951 625818367 625641251 625505714
734.9 625505714 626616859 627576218 627853432 627811127 627198906 628200455 629526825 629101486 628908424
743.6 628908424 630248451 631811142 632774467 632011795 631348381 632599068 633007965 632432976 632349358
752.2 632349358 633198051 633176918 632752151 634397926 636013412 636079712 636168556 637493210 638330307 639327850
761.9 639327850 640795364 640713959 640814896 641566620 642182388 642182465 642004929 641920929 641832275 641371002 640715866
772.5 640715866 641743927 642449951 643142624 643897018 643485184 643800049 643758774 643288879 642963562 643394089
782.1 643394089 643876190 643698654 644199600 644756851 645083389 644532852 644361725 645159302 645537949 646169510
791.8 646169510 647317429 647559357 646423950 645899200 645980148 645917740 644797058 644034271 644240875 643437653
801.4 643437653 643443069 643575363 643393402 642962570 642157593 641468887 639828873 639122925 637966194 635566444
811.1 635566444 634177971 633811722 633972740 633689499 632998047 632685699 632469406 631026382 630493317
819.7 630493317 631444054 631240158 630983810 631795235 633168907 634327202 636342010 638398895 639363327
828.4 639363327 640547714 641265106 643095703 645601959 647741623 649586487 649829407 650245361 651202087
837.1 651202087 652098083 653872757 656381912 658001251 658702240 658944016 659773407 661216888 661975784
845.8 661975784 663647308 663928833 663071213 663678818 664745407 666570740 667822571 668533325 669580231
854.5 669580231 670699997 671583710 672942963 674709854 675335770 675270920 675355301 677064514 678972855
863.1 678972855 679655609 679129486 678569946 678834991 678674622 679318924 679051056 677965317 676457367
871.8 676457367 674728699 674555054 674385300 674639893 674436340 674475937 674682617 674429321 674449692 673517532
881.5 673517532 674085159 674443054 673247986 672522888 672468338 672548752 671303482 670180359 669698029 669724121
891.1 669724121 669755783 669415207 669639969 669687653 668977966 668140106 668408585 668880310 668003311 666812744
900.8 666812744 666871948 666534500 665773544 666170044 666962280 668284683 669354324 670804520 671806793
909.4 671806793 672061234 672923737 672423325 671738205 670861893 670034943 669543610 668894501 668265839 666656799
919.1 666656799 665797577 664080582 661673889 660488586 659414062 657720718 655514832 654405441 653089828
927.8 653089828 651443100 650166473 649320679 648879623 647250214 645306320 644081573 643461456 643087082
936.4 643087082 643349075 643137894 642027969 641561584 640823288 639736824 638856468 638674202 638208466
945.1 638208466 637096329 636548309 636321640 635934677 634965897 634803619 634605446 633847847 633247871 632091713
954.8 632091713 631423111 630563698 629191780 627926445 626898956 625308990 623103714 621574211 620261841
963.4 620261841 619143181 617643585 616366234 615272331 614228325 614105873 612805443 610976486 609430923
972.1 609430923 607104111 604870262 603458519 602437325 601062164 599206276 597079163 594414635
979.8 594414635 590901489 587618103 584525375 581295128 578296318 575217476 571931152 568623009
987.6 568623009 566087799 563709717 560538216 557153587 554723854 552805901 550073433 546673546
995.3 546673546 543991241 542425690 540296249 538212814 536060295 532840157 530413208 529336281
1003 529336281 528027191 526001358 524891205 524296875 522875900 521549530 520679398 518984756 517273903
1011.7 517273903 516298180 514562416 512835274 511288071 509633255 508435898 507142677 504811745
1019.4 504811745 502350006 501062126 499035301 496698608 494745331 493331413 492456398 491133080
1027.1 491133080 490353432 489020958 487472229 486167679 485021515 484049454 483342094 483762550 483985367
1035.8 483985367 484525414 485174294 486273766 486976776 487262955 488458633 488910370 489945526 490914421
1044.5 490914421 491208611 491107597 490170479 489308586 488933983 488616028 487017326 486056061 485472641
1053.1 485472641 485087814 484878807 483941078 483642197 482905121 483209572 483924332 484820595 486181145
1061.8 486181145 487185326 489773521 491679764 492234917 493460693 495658722 496865616 496971092 497674751
1070.5 497674751 499371643 501215515 501691895 502198296 502181435 502163773 502846680 503386765 503765755 503731956
1080.1 503731956 504542198 505074310 506670341 508017883 508085823 509398003 509826431 510427780 511711082
1088.8 511711082 513187065 514259415 514782295 516010857 517109985 518147774 518477440 518911743 519503632
1097.5 519503632 520179749 521269150 521973038 523277969 524946556 526172371 526497116 527602997 528898582
1106.2 528898582 529121323 529369087 529154243 529454994 530010262 530570335 531576157 532640343 533497009
1114.9 533497009 534155464 534717178 534190941 533801231 533701019 533717079 534103394 534542427 535517921 535879669
1124.5 535879669 536235313 536519928 536442070 536925507 537847214 538924789 540509377 542913857 544371872
1133.2 544371872 545691757 547305489 548418808 549480362 550740814 552400131 553615685 554849892
1140.9 554849892 555856934 556547165 557299652 557615051 557995796 558379326 558413048 558464661 559455376 559982986
1150.5 559982986 559653130 559980583 560200424 559875336 558950691 558500671 558615341 558122444 557154045 556300926
1160.2 556300926 556399460 556438789 556186256 555952530 556361389 557820015 559471436 561310844 562364273
1168.9 562364273 563693619 565877304 567565498 568871880 570608673 572809677 574713211 576830215
1176.6 576830215 578837128 580552368 582475891 584000435 585301208 586703224 588117981 589738350
1184.3 589738350 590620384 590960960 592254372 593806496 594275322 594081573 594680748 595033684 594532700
1193 594532700 594146614 594223709 594956284 594818115 594094849 593643608 593260040 592449722 590696793 589762497
1202.6 589762497 589473801 589310799 589339333 588592987 587749252 586749077 585812416 585482674 585254097 585025253
1212.3 585025253 584672737 584653358 584668274 584508934 584676170 584610329 583914299 583153610 582769775 582116623
1221.9 582116623 581472511 581440773 581250572 580910988 580731621 580560417 579968567 579120636 578630180 578059998
1231.5 578059998 577338867 576714973 576216774 575877991 575774841 575979538 575773048 575159378 574920006 574684601
1241.2 574684601 574414024 574508400 574476051 574588776 574831581 574600601 574163475 573715897 573136711 572536545
1250.8 572536545 572459831 572601891 572862282 573251495 573354187 573530769 573063087 572429504 572480850 572450447
1260.5 572450447 572225761 572352066 573238564 573744507 574016991 574935226 575778351 576101570 576086159 576205826
1270.1 576205826 576655197 577622986 578839531 580123482 581359062 582244377 582628899 582865677 583685303
1278.8 583685303 584583092 585574112 586921272 588157310 589335937 591066513 592499580 592675667 593162689
1287.5 593162689 594016724 594658585 595613708 596625710 597590485 598478851 599402733 600427704 600931931
1296.2 600931931 600867767 600801315 600829926 601163254 601483002 602059250 602875595 603254433 603250198 602922211
1305.8 602922211 602923965 602500610 601937370 601851616 601484146 601635284 601513443 600610199 600303802 600578918
1315.4 600578918 600596924 600375824 600389595 600263062 600591164 601645126 602625389 603238220 603851280 604230003
1325.1 604230003 604137802 604165382 604134216 604215851 604370842 604502945 604379730 604076500 603921661 603572388
1334.7 603572388 603477211 603072662 602692032 602467155 601844330 602036438 602954292 603966484 604246140 604593964
1344.4 604593964 605115852 604978561 605197372 605666275 606007805 605925598 606262512 606325340 605884819 605943184
1354 605943184 605590973 605200310 604788170 604616013 604221840 603792114 603920326 603863220 603684502 602341576
1363.7 602341576 602217216 602545815 602088966 601687241 601089096 600691185 600377731 600404129 600483894 600100136
1373.3 600100136 599340439 598984833 599222603 599005280 598755760 598610229 598940964 599106827 598716965 597992744
1382.9 597992744 596683083 595960617 595735855 595393257 593546257 592909088 593216743 592558289 591835213
1391.6 591835213 590935822 590241585 588351974 586022186 585275421 584182510 583361473 581138458 579740334
1400.3 579740334 579184799 577847786 576886787 575957565 573740959 571529884 570332069 569301414 568599548
1409 568599548 567420692 566023064 565265961 564186134 563399277 562578545 561578903 561033669 560959892 561166954
1418.6 561166954 558227386 558097496 559569664 559922676 559991837 559276428 559492912 560038910 560319481
1427.3 560319481 561304054 561811066 562161598 562674789 563375854 563979988 564884148 566559143 567270050
1436 567270050 566153679 568010750 570580101 571587791 571879921 572550774 573140526 573806458 574060516
1444.7 574060516 575241241 576691322 577230759 577028122 577983780 579453773 579956169 580292740 580784798
1453.3 580784798 581877098 582684822 583407021 582414932 581092262 584440575 586406975 588823166 590163956
1462 590163956 590827065 592440529 591868973 593172646 595344009 597398224 598971710 600237579 602000580
1470.7 602000580 602486038 603315201 605244980 608090858 610628548 611782341 613891602 616088028 617258377
1479.4 617258377 617892036 618300972 619234657 620799637 622306519 623365669 624060097 623805809 623410988
1488.1 623410988 624090843 623291054 622692299 623135147 623752213 623816414 623582382 623284683 618741302 619082031
1497.7 619082031 618194618 615070763 615430756 615136757 614729385 614331741 614892998 614300270 607454491
1506.4 607454491 604605141 605634079 607936325 607365875 608156471 607920303 606236954 606894341 606531601
1515.1 606531601 605644646 603442421 601815376 603800812 605366592 604077721 601387291 600448608 601877289
1523.7 601877289 604324379 603780746 604001541 604941635 604459190 605078087 606090355 606776161 607114563
1532.4 607114563 607213821 605133591 606191101 607430763 608200455 610325050 609271164 603949280 606022110
1541.1 606022110 606591568 606304512 608318825 609188805 608534050 610178261 610675850 611496086 611138191
1549.8 611138191 610078545 611897011 612890625 613287010 610069122 610819397 613592453 615514259 612286911
1558.5 612286911 600838776 605786324 608526077 610493927 610626678 609956551 607561874 606052132
1566.2 606052132 606013260 604762878 604204750 598563576 598141479 597718239 595656929 594106445 592082787
1574.9 592082787 591406479 582851944 582176781 580876961 578499489 576200371 572442856 570420990 566580505
1583.5 566580505 563595772 559919205 556857224 553836937 549931259 547564201 543283157 541011581
1591.2 541011581 537105446 534320602 531367645 527120476 524686279 520643806 518625107 515072021
1599 515072021 513132248 510366287 507117844 505063095 501436501 500258217 497666702 496240578 493146362
1607.6 493146362 491575165 489994431 486965599 486858215 484269905 483613319 481583595 481622849 481725655
1616.3 481725655 474555664 476147423 475603600 476240921 474857063 475585747 475660629 472433815 473290482
1625 473290482 473541679 475695572 474204559 474571724 475343742 475777702 476394081 476350670 478495178 478764915
1634.6 478764915 478492317 477098846 479550323 481017952 482068329 484078674 484688530 487462654 488094177
1643.3 488094177 490072289 491750450 490482979 493348618 493315010 495796890 497229309 500556183 503156090
1652 503156090 502080612 500046234 501147308 505406570 507117310 509300537 510336876 511904869 513964195
1660.7 513964195 515982208 518343239 518208084 521552124 523949127 526320267 528484879 530159111
1668.4 530159111 531397705 532942162 537288971 539183769 542860794 546400223 547655296 548735542
1676.1 548735542 552107201 556017647 558254585 561196327 563309441 567247963 571920547 572326202
1683.8 572326202 571917229 576114807 581774406 585110893 587574768 590783958 593646889 597271996
1691.5 597271996 600584145 604059067 607770805 610768280 609178886 612726326 617490883 622914505
1699.3 622914505 627199860 623725777 628847504 632781754 635632591 637647133 640086288 641496887
1707 641496887 643703918 646881180 648377304 649756012 651915817 654169693 656032791 655760803 655845871
1715.6 655845871 658645554 660182419 655679398 658964081 662603607 664486847 665669861 666434784
1723.4 666434784 666932373 667727509 668554535 669314651 670376816 671661148 671466904 672090759 675288315
1732 675288315 677898331 675508347 671765747 675261612 678359451 679814835 682420120 683189163 681805954
1740.7 681805954 684967651 686991501 686764603 687499619 689892883 692169952 693744431 694555969 694717865
1749.4 694717865 697973251 698640366 698822479 702793274 705325317 707174377 709204102 709054108 710065994
1758.1 710065994 712300110 713811722 715786819 714266815 713718338 716493149 717827377 719233398
1765.8 719233398 721073608 722295456 720231171 721550064 724998169 724491959 722069168 721167831 724174805
1774.5 724174805 726009827 726180573 728281097 728838120 729511948 729343033 728125381 728903427 730299530
1783.2 730299530 731721802 731418228 731741486 733215561 733722534 733684082 734503632 734644470 734674759 733110886
1792.8 733110886 732920456 736404648 737310104 736634445 737690506 739006805 738591156 737023468 738625488
1801.5 738625488 738724747 739064331 740342178 741053543 742130432 742162857 741976471 742277985 742493668 741001358
1811.1 741001358 741241150 742435074 742999115 744407578 744830399 745417938 745076904 744775391 745145111
1819.8 745145111 744927216 745782547 745557709 746354141 747629242 745970383 746385117 747967453 748878708
1828.5 748878708 748009644 744873199 745702438 747943726 748372116 748663635 749403000 749872360 749850082
1837.2 749850082 748938217 749121475 749173584 749466095 749640732 750843658 752075882 748414078 749937744
1845.8 749937744 751840439 751547394 750568390 750472488 751106491 751172180 751738510 752033539 752679672 752789154
1855.5 752789154 752673492 753047180 752617722 752651672 752502213 752758102 752700500 752865372 753438492 753610229
1865.1 753610229 754054184 753225327 753183823 752282410 751269302 752505875 753732071 754779205 754723511
1873.8 754723511 754811172 754797974 754633636 754267120 754163284 754356079 754070435 754799118 754864502 754934845
1883.4 754934845 754915466 754769287 755321732 754902344 755362396 755257950 753672791 754226685 755568924
1892.1 755568924 755871582 755791245 755607071 754693680 755062714 755419769 755550385 755709381 755693436 756094513
1901.8 756094513 756324539 756617584 756076279 755712662 755769348 755812225 756048508 755893631 755677643 755630722
1911.4 755630722 756528320 756524200 756083374 755714874 755753479 757094345 755558548 754682083 755865784 756710434
1921.1 756710434 757623901 756917419 755959015 756223373 756550980 756317825 756365814 756423569 756569901 756880493
1930.7 756880493 756616364 756627197 756296310 756121674 755822906 755731049 756181946 756182404 756489029 756474457 756975937
1941.3 756975937 756332169 754313583 755081558 755914078 755689926 755323944 755776367 756256027 756082993
1950 756082993 755918121 755869598 755678329 755289841 755137100 754816284 755102692 755601044 755588608 755648117
1959.6 755648117 755562439 755461960 755104523 755064240 754969406 754617157 754664001 754349976 754330750 754974976
1969.3 754974976 755284195 755072632 754934006 754680710 754687424 754783020 754556198 754688339 755039520 755311279
1978.9 755311279 754905472 754889984 755053635 754250641 753617096 753530045 753823929 753904800 754082184 753796997
1988.6 753796997 753415756 754121170 754377594 753597031 752972336 753368835 753383713 753006744 753202820 753697739
1998.2 753697739 754387512 753900528 753424149 753342056 753094482 753080902 752960663 753094864 752998199 752614365
2007.8 752614365 752285004 752562943 752619858 752164917 752128296 751906128 751867828 751903992 751795959 751407776
2017.5 751407776 751552124 751950836 751561050 751553040 751601334 751514664 751145630 751057129 751065140 751008072 751633606
2028.1 751633606 751472168 751433487 751201553 750693130 750847092 750590286 750231094 750036621 750250626 750205002
2037.7 750205002 750107346 750066452 749910507 749658661 749167786 749732132 750142288 750296326 750247650 749745560
2047.4 749745560 749853210 749904175 749602661 749042892 749088516 749005508 748961105 749400787 749447556 749610901
2057 749610901 749182510 748916855 748657837 748171463 748279037 748505325 749014435 749186783 749145508 749070816
2066.7 749070816 748827362 748396988 748211060 748122177 747794418 748095627 748227310 748376160 748422546 748226089
2076.3 748226089 747989578 747730179 748141861 748092499 748232727 748483505 748337021 748312759 748163528 748227768
2086 748227768 747921906 747519455 747385483 747497559 747353439 747185287 747522583 747870712 748173904 747759247
2095.6 747759247 747332764 746825104 746734085 746928329 746321869 746511383 746778717 746811447 746852951 746837387
2105.2 746837387 746609116 746263123 746399536 746033783 746262283 746495361 746386871 746577454 746407242 746450577
2114.9 746450577 746135559 745750046 745300064 745242310 745748978 745826721 745920563 746114502 746163483 745809402
2124.5 745809402 745631332 745220108 745146027 745456238 745310211 745707169 745491562 745207901 745584641 745808945
2134.2 745808945 745570297 745086823 744982681 744716034 744935150 745281601 745541992 745687256 745695801 745865936
2143.8 745865936 745507050 745482788 745342331 745362167 745489349 745228424 745422974 745624313 745823059 745665588
2153.5 745665588 745624619 745319672 744904556 744984055 744880295 745294571 745708084 745820084 745342255 745042572
2163.1 745042572 745294113 745201569 745167999 745077667 745620575 745854111 745739517 745936890 745816116 745791092
2172.8 745791092 745426407 745053711 744839096 745042877 745523758 746084061 746548386 746299820 746185150 745763550
2182.4 745763550 745496521 745829315 746160126 746178970 745966721 745944748 745743332 745977859 745981445 745827866
2192 745827866 745763092 745473938 745527649 745440826 745775833 745943909 746044083 746387329 746421661 746295319 745773468
2202.6 745773468 745813141 745994644 746122131 746165085 746091614 746235657 746259155 746626968 746458969 746016235
2212.3 746016235 745714035 745582657 745813828 745937805 746538467 746987915 746730576 746149139 746045151 746229324
2221.9 746229324 746053925 745876923 746242523 747128906 747111740 746714783 746471100 746329727 746180801 745757370
2231.6 745757370 745773239 745871887 746234970 746286850 746256180 746376877 746267776 746345673 745939331 745825500
2241.2 745825500 745613861 745385284 745463409 745637054 746246033 746143341 746002350 745945587 746084518 746029205
2250.9 746029205 745638046 745819702 745634155 745845718 746422653 746759415 746545410 746075058 745930862 745839844
2260.5 745839844 746132355 745971146 745808487 745666962 745764847 746052475 745853500 746194458 746092377 745675354
2270.2 745675354 745333786 745315018 745569382 745553894 745749588 745791397 746093597 745825043 745355911 745368347
2279.8 745368347 745578079 745702362 745193863 745466385 745409317 745203857 745422897 745196457 745281525 745161438
2289.4 745161438 744929810 744639893 744928360 745204163 745222168 745676193 745255051 744917908 745126495 745363693
2299.1 745363693 745107193 744830856 745042419 745109177 745390549 745220566 745275345 745496826 745472717 745331650
2308.7 745331650 744812088 744825668 744694748 744948120 745308990 745279465 745389862 745301361 745455933 745455093 745069427
2319.3 745069427 745031357 746398849 746723480 745731049 745605927 745095215 745410004 745898361 745556030 745590439
2329 745590439 745996552 745573425 744749832 745520401 746048584 745879364 745348434 744648590 744892807 745365753
2338.6 745365753 745140533 744686203 744881439 744588165 744742966 744833145 743778610 743250351 742894440 742557907
2348.3 742557907 743399734 744870224 744529419 744154892 745054398 745595703 745653000 744533157 745485916
2356.9 745485916 747579727 747466583 745043869 743485641 743760834 744749832 746352692 744913330 743655777
2365.6 743655777 743444595 743534851 743731308 742605057 742812424 741769562 740278320 740766296 741095352
2374.3 741095352 740994263 740547409 739967957 739604950 739306030 739155579 739662781 740069504 739818573 739208908
2383.9 739208908 738625793 738711090 738713303 738431168 738298111 738329849 738446655 738450317 738344421 737968216 737603073
2394.6 737603073 737375793 737422791 737416992 737356033 737350464 736916885 736855850 737019119 736946640 736787109 736473923
2405.2 736473923 736173096 736075287 736106873 736092987 736296005 736020889 735480194 735233917 735069809 734906998
2414.8 734906998 734632339 734879150 735063477 735056458 735065308 735016785 734779053 733944626 733505554 733314285
2424.5 733314285 733305588 733335953 733405228 733822403 733773651 733397064 732837143 732550659 732068863 731741257
2434.1 731741257 731977997 731938858 732305298 732502060 732289505 731753235 731382751 731415024 731225662 731201706
2443.7 731201706 730669403 730231934 730274811 730519180 730806351 730491409 730079041 729759216 729500427 729099121
2453.4 729099121 729107285 728971786 728509674 728735199 728863907 728744659 728442078 728441238 728113632 727479935
2463 727479935 727413254 726968765 726962433 727246704 727045822 726822586 726868896 726649704 725935822 725559464 725179214
2473.6 725179214 724991913 724912949 725066299 725365372 725318298 725363770 724769287 724077454 724007034 724066010
2483.3 724066010 723537521 723112259 723295975 722817078 722335663 722013168 722035751 722231598 721874619 721779785
2492.9 721779785 721740952 721523132 721150284 721077881 721066971 720824280 720671082 720261078 719833908 719317627
2502.6 719317627 719056015 719047928 719121246 719060440 718621597 718499374 718205261 717807922 717595139 717283478
2512.2 717283478 716958160 716927643 717107697 716787033 716452179 716417007 716297836 715881424 715507965 715270538
2521.9 715270538 715243225 715470200 715172348 714944611 714665451 714168701 714023437 713969650 713952179 713714600
2531.5 713714600 713570786 713358688 713209534 713192902 712895355 712715073 712334595 712020111 711940155 711871033
2541.1 711871033 711777802 711507721 711324310 711369553 711425552 710932770 710294189 710096664 710002289 709472656
2550.8 709472656 709292755 709820175 709767838 709398041 709016342 708675308 708484497 708076172 707796097 707991180
2560.4 707991180 708232269 707909470 707600098 707347641 707126923 706914978 706388474 706165466 706239243 706392517
2570.1 706392517 706137924 705820084 705584869 705163879 705126572 705136108 704975891 704325714 703935776 703994293
2579.7 703994293 703918610 704032974 703790131 703440018 703018417 702766342 702639236 702237778 701951675 701727448
2589.4 701727448 701990128 701914902 701517029 701626434 701722031 701460114 700878525 700536194 700100250 699512634
2599 699512634 699259415 699478149 699731979 699618607 699429398 699078522 698746719 698129654 697661133 697699661
2608.6 697699661 697766342 697873535 697634506 697295761 696869965 696729202 696880951 696418533 695734024 695544510
2618.3 695544510 695508270 694950790 694795609 695067444 694844284 694207535 693980103 694426804 694241409 693543854
2627.9 693543854 692851334 692516174 692637863 692542648 692146378 691764832 691734848 691399994 691124496 690940704
2637.6 690940704 690561142 690431137 690020142 689710922 689583130 689603882 689438858 689036789 688981400 688782349
2647.2 688782349 688461990 687893219 687767029 687966003 687725143 687668304 687435760 686984024 686686172 686419983
2656.9 686419983 686085358 685988770 685989609 685810547 685505905 685034332 684698944 684193039 684050903 684324417
2666.5 684324417 684375610 684236984 683817673 683779221 683714676 683464890 683413773 683091354 682585831 682334900
2676.1 682334900 682309723 682188187 682062988 681653061 681268921 681013107 680740128 680595627 680332489 680298538
2685.8 680298538 680115891 680116730 680147705 679584122 679122391 678969727 679100189 678885269 678641205 678302994
2695.4 678302994 677828827 677871933 678087769 678307877 677730103 677117691 676927719 676542740 676323471 676148682
2705.1 676148682 675871353 675553589 675880585 676036758 675839691 675672379 675004120 674844055 674816360 674577332
2714.7 674577332 674375305 674213715 674254303 674063721 673700180 673471069 673550415 673237457 672848587 672653503
2724.4 672653503 672263412 672114792 672206573 672443314 672136841 671775894 671522980 670967484 670793915 670651321
2734 670651321 670669785 670943985 671211700 671198502 670899734 670595551 670220108 670265121 670213852 669780121 669589005
2744.6 669589005 669494705 669371872 669753113 669933395 669073639 668397293 668060150 667924500 668088684 668211365
2754.3 668211365 668275223 668278732 668454742 668124695 667558441 667130127 666847763 667005768 666617813 666226425
2763.9 666226425 666343765 666176376 665970078 665938110 665868988 665865555 665621948 665133057 664973526 664640579
2773.5 664640579 664551392 664820633 664532928 664129257 663870010 663699799 663185272 662725754 662860718 662676697
2783.2 662676697 662483139 662545929 662201843 661748962 661480331 661175690 660972366 660835190 660214081 659273300
2792.8 659273300 659126816 659393387 659097824 658897171 658617859 657900467 657296143 657065659 656966095 656577988
2802.5 656577988 656325760 656325150 655978165 655210953 654865494 654784775 654413910 653854752 653033066 652742691
2812.1 652742691 652436905 652055283 652034683 651518326 650944061 650450516 650187378 649603195 648826752 648588257
2821.8 648588257 647986603 647389145 647053757 646829147 646308594 645760651 645827789 645728607 645128555 644132309
2831.4 644132309 643474121 643112869 642793579 642140121 641301880 641148529 640322495 638955345 637907677
2840.1 637907677 637146835 636367226 634985123 633710632 632534370 631415405 630475769 629202156 627286530
2848.8 627286530 625586205 624657097 623862381 623096886 622131615 621646194 621489143 621461601 621965523 622130890
2858.4 622130890 622076111 621637383 621198769 621279640 621658325 621842308 621354332 620734177 619701958 618995934
2868.1 618995934 618810654 618245621 617609787 617409325 617690659 617349892 616694756 616125603 615363541 614908028
2877.7 614908028 614715385 614342766 613798752 613899536 613689041 612476921 611552162 611250534 611055450
2886.4 611055450 610631866 610305481 609778175 609062996 608500824 607645493 606833725 606262817 605473557 604841232
2896 604841232 604753914 604445038 603730621 603115387 602673073 602046394 601495857 601129303 600108528 599142036
2905.7 599142036 598686905 598587837 598082008 596720009 595978127 595455856 594725189 593441353 591790237
2914.3 591790237 590969963 590051384 588873749 587743874 586639786 585620766 584919434 584320755 583315430
2923 583315430 583143578 583452339 583391685 583302956 583331757 583301811 583152962 583718529 584301338 584079781 584017296
2933.6 584017296 584970207 585965004 586019211 586155281 586587486 586820717 587352829 588098526 588607941 589452438
2943.3 589452438 589911880 589811630 590407829 590998039 591259575 591337814 591578979 591974831 592151299 592534027
2952.9 592534027 592412834 592164040 592269325 592445908 592837334 593156815 593389168 593474159 593606033 593842621
2962.6 593842621 594276276 594680939 594973755 595525093 596159935 596818924 597024574 597192383 597688560 598302345
2972.2 598302345 598921738 599091415 599221230 599574203 600188599 600372391 600352592 600993919 601259270 601164246
2981.8 601164246 601160088 601034622 601009636 601235657 601471863 601885223 602408333 602283173 602096481 602419167
2991.5 602419167 602672768 602233772 601964073 602411957 602454948 602416954 602426453 602163277 601826859 601255569
3001.1 601255569 600605659 599928436 599627228 599671707 599469032 599438858 599628677 599319687 598497505 597656517
3010.8 597656517 597236328 597016258 596888733 597036591 596632538 595951195 595687714 595473557 595097809 594395943
3020.4 594395943 593751488 593209038 592768898 592677078 592698135 592466965 591963730 591437492 590920258 590540314
3030.1 590540314 589709167 588874245 588685150 588392525 587860298 587205963 586960945 586592102 585987206 585523949
3039.7 585523949 584631424 583928986 583695297 583551407 583031235 582559776 582137604 581181183 580382652 579653435
3049.4 579653435 579153099 578744202 577978897 577231216 577160873 577289314 576275482 575434570 575334206 574992561
3059 574992561 574357109 573688545 573034096 572326546 572089081 571850357 571761284 571638947 570965195 570354538
3068.6 570354538 569464645 568766861 568457031 568228645 567738571 566951942 566619301 566393471 566243362 566084061
3078.3 566084061 565518990 564721642 564285088 563828278 563089256 563149223 562952003 562040634 561551628 561131668
3087.9 561131668 560591621 560464211 560443802 559949570 559175491 558144379 557332344 556993179 556644363 556094704
3097.6 556094704 555662308 555541611 555267372 554984703 554229736 553397369 553193512 552804451 552391815 551773987
3107.2 551773987 550906334 550209694 549841652 549793816 549558792 548902054 548013191 547627602 547437515 547167473
3116.9 547167473 546770020 545756874 544710808 544255981 544226265 543778343 542973480 542192650 541690712
3125.5 541690712 541494522 540846519 540000420 539117889 538306160 537883148 537869110 537268677 536390724 536515503
3135.2 536515503 536019783 535213699 534944305 534388542 533741722 532937393 532002792 531235275 531029625 530235062
3144.8 530235062 529012337 528787003 528518906 528059158 527633095 527169647 526607056 525692635 524902077
3153.5 524902077 524264297 523632088 522771606 521995163 521799240 521471977 520713844 520246201 519925232 519190102
3163.1 519190102 518063354 517243805 517185555 516690369 515805626 515115433 514387817 513759193 512808113 512142448
3172.8 512142448 511903954 511224747 510606346 510466347 510015297 508944054 507884560 507116203 506607780
3181.5 506607780 506035690 505827370 505295982 504097633 503652344 503243065 502840958 502520828 501867943
3190.1 501867943 500993195 499799156 499175987 498596458 497817459 497394485 496997986 496390610 495723038
3198.8 495723038 495375404 494837952 494164772 493632393 493032303 492446136 492025452 491395035 490566216 490337181
3208.5 490337181 489936180 488873596 487875633 487511597 487463684 487139053 486551514 485741882 485521088 485203209
3218.1 485203209 484226036 483236771 482571564 482230682 481506729 481035957 480598335 480121307 479763947 478868790
3227.8 478868790 478154831 477753792 477592316 477163773 476867294 476781998 476347923 475762253 474529076 473684883
3237.4 473684883 472989693 472514267 472682571 472056541 471128845 470824814 471158295 470773277 469874268 469251442
3247 469251442 468472519 467881927 467076683 466460457 466144524 466060371 466023827 465748444 465665512 465019417
3256.7 465019417 463830414 462791977 462454834 462314262 462217903 462567711 462268028 461489525 460715065
3265.4 460715065 460209770 459996414 459708939 459420395 458983765 458539162 458414078 458334007 457549896 457019081
3275 457019081 456921883 456464615 455945778 455420723 454852753 453999557 454136696 454862709 454582481 453701668
3284.7 453701668 452617722 452194328 451793137 451036758 450404892 450079765 450203667 450102005 450172958 449903183
3294.3 449903183 449327812 448837280 448067970 447610588 447175598 446985245 446863747 446337357 446209145 446327324
3303.9 446327324 445937347 445414734 445058708 444479218 444086914 443718109 442986717 442231026 441660500 441123886
3313.6 441123886 440345879 439707146 439222832 438713837 438144913 437838516 437720146 437213898 436383247 435589218
3323.2 435589218 435478287 435204086 434289207 433381844 432596817 431909599 431099167 430731201 430136681 429060669
3332.9 429060669 428234634 427525558 427002106 426234856 425950851 425844345 424784546 423533783 422999840
3341.6 422999840 423168297 422516441 421012878 419973640 419609146 419585991 419291649 418573265 417751312
3350.2 417751312 417045097 416432686 416039009 415688515 415144577 414293823 413386765 412841225 412261543 411923027
3359.9 411923027 411762810 411221924 410685959 410366020 409884109 408989830 408240814 407934723 407578926 406961555
3369.5 406961555 406390190 405641365 405176086 405194321 404391251 403604393 403535614 403154335 402576256 402212830
3379.2 402212830 401821404 401589775 401368561 400544319 400071220 399611740 398978500 399002228 398902092 398782921
3388.8 398782921 398414536 398259583 398478394 397949982 397228928 396476288 395824585 395542374 395542870 395820007
3398.4 395820007 395808716 395280609 394860191 395058937 395042725 394265404 393762093 393887787 393592377 393234940
3408.1 393234940 392906075 392696419 393339348 393532791 393422050 393058243 392536926 392683640 392568512 392378807
3417.7 392378807 392441063 392882500 392830582 392335434 392561874 392533760 392485847 392680511 392849464 392814674
3427.4 392814674 392890358 393334885 393642082 394028664 394190788 394202728 394202919 394012337 393834763 394023247
3437 394023247 394375153 394995728 395572166 395228271 395411034 395731735 395883980 396101189 396325760 397235260
3446.7 397235260 396998291 397228813 397899590 398382568 399338264 399682388 400312462 400402641 401016121 401939964
3456.3 401939964 401751823 402059822 402439651 403077126 403302498 403647346 404320869 404941521 406301193
3465 406301193 407073898 407488174 407631531 408239098 409235458 409672585 409983902 410264091 411307602 412133408
3474.6 412133408 412685165 413431358 414134865 414785995 415059776 415895119 416682281 416684036 417071762 418725395
3484.3 418725395 419894714 420069695 420639000 420716972 421435814 423047981 423948593 424132881 424792938
3493 424792938 426084061 427018394 427844315 428305855 428651581 429222069 429924774 430294914 430951843 432551689
3502.6 432551689 433234177 434341202 435780449 436218872 436699715 437932434 438748550 438199844 439147377
3511.3 439147377 441024399 442190857 442626419 442984924 443720055 444216194 444967384 445701408 446874847
3520 446874847 448255653 449885063 451255379 451164589 452021828 453003578 453970604 454711990 454777222 455267906
3529.6 455267906 456118736 457612152 458856468 459880905 460898247 462934952 464188919 463756065 465108223
3538.3 465108223 466300468 467149315 468273582 469660912 471011963 471979218 472614594 472764320 474151535
3547 474151535 474326324 475715561 477469406 478885612 481521301 481227341 482227287 483365936 484671135
3555.6 484671135 487192574 487419624 488949165 490262871 490597725 491515388 494024391 496224365 496233673
3564.3 496233673 499395218 500466614 499892731 501172028 501122131 503194122 504420242 506245575 508241043
3573 508241043 509817619 510810394 511907272 513984299 514399948 516542702 518653259 519729538 521644592
3581.7 521644592 523341637 524987679 525481262 528978767 531733513 530444069 531890564 530697327
3589.4 530697327 533063889 536851158 539576530 540484695 540602989 543513184 542494087 543921356 547486191
3598.1 547486191 548022232 550370140 551613655 552901993 555661240 557668114 559530945 562055054
3605.8 562055054 564070282 562207184 564707565 565163231 565005226 572098389 572954063 570708427 574976120
3614.5 574976120 574970665 578538170 582518120 582416153 584363327 583919220 584733620 588487358 591336555
3623.1 591336555 593096886 595058212 596331367 598135414 604445496 605706978 597663383 600377312
3630.9 600377312 603839455 609551506 611889343 609424133 611594124 615080757 617595634 618482857
3638.6 618482857 619798813 621592445 623409004 625004883 625730667 627758636 631246147 637480736
3646.3 637480736 637930412 632530212 637136269 638180695 634037666 632879066 638092804 642472000
3654 642472000 646677933 652740631 645037766 645015793 649921341 651225739 652903824 653650284 654974136
3662.7 654974136 655021973 656508102 659361496 660435181 664491959 666065598 664440460 665913925 659779968
3671.4 659779968 660127258 666481094 675057755 677555237 660757065 661241913 667724533 672374954
3679.1 672374954 670071869 669692917 672369537 673672485 675037308 675652618 675277557 678658371 685273819
3687.8 685273819 676050873 671499710 681100082 676220093 674538803 680309143 681131363 682082748 683174286
3696.4 683174286 682826538 683048172 682837296 685378113 689234619 684182510 680753632 684957275 686099930
3705.1 686099930 685785980 686896820 689383163 692385406 686142960 690049515 695648193 681987534
3712.8 681987534 684094772 688253937 689089737 690540085 692659378 693253098 689653931 690072708 696502533
3721.5 696502533 694874420 688564987 692338791 693717346 693205490 690578079 690375595 693963776 694801254
3730.2 694801254 700041199 697266769 689293671 698401489 699754868 689312515 687961960 689930725
3737.9 689930725 691105881 693898697 697498550 693865738 696070633 708619995 704451447 684206314
3745.6 684206314 691595459 696767502 703258591 701263580 687814484 699286652 697812271 688206558
3753.3 688206558 692593765 696467438 700384216 695546722 695903854 702095490 696605453 693907852
3761 693907852 696880646 698205719 698934021 702378082 700437698 695131454 697661057 702814407 703599396
3769.7 703599396 694376450 694898682 697988205 698670883 699859772 699997635 700772781 700805283 702825394
3778.4 702825394 702687454 694968719 696435165 698387756 699883652 702816315 700069809 698592529
3786.1 698592529 699564362 699856796 700633087 700515976 700419617 700678177 701114426 700686188 701675491 705601807
3795.8 705601807 703171921 698746490 700246201 703105621 708524323 704161377 693282318 696085205
3803.5 696085205 698228302 702874908 710135498 701361542 694478683 698524628 700904846 701295319
3811.2 701295319 701728745 701460648 701765213 706753616 707285690 693319931 696232147 701715698 706268692
3819.9 706268692 709875565 694396515 694065933 699075241 700918427 703732681 704159012 699074860
3827.6 699074860 698525848 700395279 704220963 706733322 697708893 699357147 707640762 702909698
3835.3 702909698 700094833 708257599 702113876 695017242 701990433 698428955 697665710 704054031
3843 704054031 701949387 697265396 699597778 701512909 701686783 703770142 703263016 704482193 710414352
3851.7 710414352 704612961 703858719 690942154 690959244 701086655 700844955 698464355 700080185 702471848
3860.4 702471848 705522766 700222778 700252686 707675858 700702286 694102783 698662872 703829498 710188828
3869.1 710188828 703127747 692640686 696991043 703209152 706158752 696483078 696833572 701245575
3876.8 701245575 701483231 703863068 709119492 703635406 694677887 699740295 701480026 702974472
3884.5 702974472 708401566 696845474 696209030 700172043 701597061 705507889 704116058 695622330
3892.2 695622330 696838913 700411911 699907150 701042786 701624146 703873672 705915146 695977783 701307220
3900.9 701307220 705281677 699844971 703882904 700635910 698431931 698223495 698403702 700521774 700044327
3909.6 700044327 700645676 700800323 700424957 700534515 700121613 701861191 704467773 701117020 697701797
3918.2 697701797 702394638 702693253 697902145 699581070 701221161 702104874 700672150 697726898 698568954
3926.9 698568954 699606018 700539246 700148773 700957031 703570175 700569153 698781357 700889206 701097488
3935.6 701097488 700968170 701597519 701462250 700499115 699807968 701704559 703352890 698995132 697714920
3944.3 697714920 699565353 700569611 701549835 699369736 699841309 701046448 698861542 699619980 699624939
3953 699624939 698705750 698415604 698824844 700008011 699597397 700046616 700221405 700445328 700718002 699090652
3962.6 699090652 698941956 699155731 699123459 699390259 699981537 701031189 700350342 699287567 699794159
3971.3 699794159 700652771 700779800 700025253 699406204 699414902 699136200 698953934 699394608 699731293 699275131
3980.9 699275131 698717575 699081421 699546890 699683990 699787979 700239334 699969482 699407196 699997635 699413986
3990.6 699413986 699075928 699503784 699109192 699334946 699241791 699276733 699815063 699832382 699469757 699297867
4000.2 699297867
##END=$$ End of the data block
