##TITLE=$$ Begin of the data block
##JCAMP-DX=5.00 $$ ACD/SpecManager v 10.08
##SPECTROMETER/DATA SYSTEM=Varian
##DATE=08 Jan 2013 15:11:14
##DATA TYPE=INFRARED SPECTRUM
##DATA CLASS=XYDATA
##ORIGIN=
##OWNER=
##NPOINTS=3735
##FIRSTX=399.26403809
##LASTX=4000.35498047
##MAXX=4000.35498047
##MINX=399.26403809
##MAXY=75.97303009
##MINY=39.26301575
##XFACTOR=1.0000000000
##YFACTOR=0.000000100000000
##FIRSTY=60.10912704
##DELTAX=0.96440572
##XUNITS=1/CM
##YUNITS=TRANSMITTANCE
##XYDATA=(X++(Y..Y))
399.3 601091270 594353256 589778633 586934395 585510864 590575562 593740044 596897163 602777100
407 602777100 594064789 584843025 592163620 593929672 588753777 588953247 583908348 583189049 586490631
415.7 586490631 585122719 580828552 572312889 591604424 596849022 591098633 583188019 578495369
423.4 578495369 586148376 587614021 589359398 591143227 588481255 587551193 589048615 593180885 589174271
432.1 589174271 586752167 590523338 589266396 588323174 586558914 582126274 581612968 586586609 590320930
440.7 590320930 588680954 585674324 584653587 584860229 586011086 588911209 589768677 588704987 587032471
449.4 587032471 586329193 588329277 587036133 583644295 580461273 578619766 581316490 585404816 588486366
458.1 588486366 587278786 587224655 586287346 584604988 583728828 580068932 583763771 590733414 589722366
466.8 589722366 587546043 583590012 579651222 578990326 576514549 574161949 575034676 575467110 578463478
475.5 578463478 581282806 580762100 582205315 579774170 574503441 572902260 572379532 576685829 581594734
484.1 581594734 583651390 585180664 579793892 573869057 572796173 573132629 575109062 577634430 575251808
492.8 575251808 575788422 580506706 580346031 578976059 576355515 574085808 574838295 574669533 577409477
501.5 577409477 580409622 579448624 577159576 573421288 571981621 573316193 574646873 574201736 574861832
510.2 574861832 574905777 572672615 573170929 574489594 574725609 574213943 571792336 570294685 569620476
518.9 569620476 568429985 569161377 570351257 570540886 570592384 570803490 570314484 567943306 567312584
527.5 567312584 568672752 569587936 569053688 568173866 567611275 566006203 565489731 564922485 564358635
536.2 564358635 565449562 564898987 565708885 566576920 565246620 565114479 565304260 566471062 566261330
544.9 566261330 563014526 562303696 563418045 563410492 563442802 563114700 562571564 562581024 563411713 564111366
554.5 564111366 562171021 560651207 561219063 561959839 563026581 562193565 559739265 559461021 561106834
563.2 561106834 561615372 562119637 563310051 562857704 561786232 561450310 561728249 561473579 561483078 562546730
572.9 562546730 561665268 560372810 560305214 560235710 560881882 561723862 561969528 561244469 560482407 560722733
582.5 560722733 560052032 559588051 560581665 561180801 561929588 561322975 560586853 562333336 563774757
591.2 563774757 564762344 564898109 563685493 563006096 563879547 564679756 564202995 564689331 565334663 564769478
600.8 564769478 564511833 564365883 563661308 563615761 564376717 563273277 562549934 563217354 563043518 563628845
610.5 563628845 563419685 562136650 561664963 560741882 560882072 562077408 561287880 560998268 561513519
619.2 561513519 560828514 561740952 563060875 563716087 565892067 568429146 569065170 568164368 567616310
627.8 567616310 568068008 569419975 570482712 571539154 573038177 573724785 574067917 574563255 575684853
636.5 575684853 576365433 576438179 576994019 577826271 579422646 580322571 580888634 582465096 584167480
645.2 584167480 585208168 585661240 586420097 585816917 586022987 588288803 588355141 587891731 588078690 588700790
654.8 588700790 589353104 588177414 587462616 587964478 588359413 587888870 587695045 588123779 588492241 588858948
664.5 588858948 588648300 589919968 592500381 592008400 591344414 590335960 590013885 591723328 592987595
673.2 592987595 593539505 594020576 594150772 594574432 595951271 597339058 597743568 597929230 599131546
681.8 599131546 600711937 601819839 602642174 602871437 602482796 602089462 601868439 602008324 603215637
690.5 603215637 604431305 605288239 606109352 606666718 607071686 606473503 606116524 606457481 607561646
699.2 607561646 609064827 609518852 610457878 611292763 611815796 611500893 610720558 611658936 611890411 611928902
708.8 611928902 612594757 613117867 613818626 614720917 616159477 617090721 617264252 616763992 616927376 617504921
718.5 617504921 618212509 619688721 620103798 620595169 620918465 620541267 620364952 620824699 621545563 621689682
728.1 621689682 622631340 624187012 626136551 626745377 626532898 627474899 628004112 628850594 628637390
736.8 628637390 628814468 630277824 629523354 629228096 630166168 629963646 630289421 631805916 632968216
745.5 632968216 633466988 632880516 632826385 633897324 634263611 634426880 634620667 635505028 636167755 636907578
755.1 636907578 637645531 638417206 641022797 640066452 637519264 638137512 639004555 639959259 640218506
763.8 640218506 640283737 641456146 642693253 642569504 641585770 641698608 642654495 643369522 643507690 643666611
773.5 643666611 643468475 643734970 644918137 645671082 645364914 643907089 643141708 643862152 644555588
782.1 644555588 644067764 644465561 645436859 645684204 646655960 646778717 646757660 646454620 645757294 646413422
791.8 646413422 646621857 646770096 647162781 647015228 647196045 647371750 645865860 644332657 643805771
800.5 643805771 643584442 644538040 644712524 644836502 644737320 642584839 640502625 639370003 639273567 638945198
810.1 638945198 637764511 636058159 634845009 634897766 634568253 634247589 634517899 633943291 632955666
818.8 632955666 633132439 632635651 631347733 631560555 632393799 633052559 634631691 637346268 638656464
827.5 638656464 639435043 641070938 642170181 644101028 646190109 647798004 649795990 652072372 653287582
836.1 653287582 653481598 653681717 653774033 655534592 656694641 657515717 659421158 660603409 661622467
844.8 661622467 662171249 663888702 665150070 665199966 665456161 665652542 667114029 668154297 669082642
853.5 669082642 670181961 671239090 672875824 674173203 675210190 675333328 675309219 676548080 678313522
862.2 678313522 679320908 680438156 681137009 680960999 680219955 679158859 679729996 679944153 678937531
870.9 678937531 676800537 675474319 675979691 675743179 675604858 675486069 675924683 675749741 675375595
879.5 675375595 675229797 674043274 674570465 674668274 673722000 673268356 673546753 673603516 672119827 671374054
889.2 671374054 671213913 670748978 669643860 669266968 669170151 668710098 668912430 668599701 669227829 669497070
898.8 669497070 668305359 667897034 668162613 667286530 666046677 666449509 667605362 669105530 669692078
907.5 669692078 670956497 672806549 673180771 673148956 672103958 671801376 670939865 669707260 669592667
916.2 669592667 668928757 668257065 666907959 666014786 665210876 663449860 661576843 660078354 658210678
924.9 658210678 655835114 654729538 653395081 651987610 650854797 649817276 648806152 647105255
932.6 647105255 646180191 645419846 644646912 643983917 643656998 643280945 642592392 642435455 641442184 640225677
942.2 640225677 639189377 638599739 638130264 637206116 636988678 637231483 637232475 636422310 636065407 635415382
951.9 635415382 634470596 633956680 632280312 630825348 630025749 630082970 630000610 628188934 625690804
960.6 625690804 623728447 622408333 620776405 619362030 617680321 616235847 615602608 615470886 615410767
969.2 615410767 613301659 610718613 609107018 607941895 606258888 604120140 603095665 601477394
976.9 601477394 598739395 596384430 594028473 591146202 588536263 585718460 581829567 577747841
984.7 577747841 574230614 571671638 569462242 566588707 563148346 559637947 556322708 554119263
992.4 554119263 552117996 548956184 546519928 545162506 543000069 540603485 538640671 536038589
1000.1 536038589 533641014 531832504 530243797 528735580 526656342 525028992 524245949 523314438 521601181
1008.8 521601181 520147247 518608208 517018623 516370697 514762840 512791138 511391563 510204048
1016.5 510204048 508632927 506846809 505567474 503370857 500816650 498722000 497420082 495952072
1024.2 495952072 494113808 492531090 490821686 490381432 489545555 487631836 485944672 484961128 484188614
1032.9 484188614 483671227 484280853 484575310 484824677 485590782 487146378 487429810 487388191 488582191
1041.6 488582191 488747063 489661140 490699959 491568069 491505356 490118370 489727135 489305534 488800087
1050.2 488800087 487778511 486868172 486140137 485323334 484278450 483379631 483454895 482588463 483032150
1058.9 483032150 484015884 484735947 485761948 487074471 490047264 491506500 492643242 494485245 495970955
1067.6 495970955 497355194 498232956 499594154 500933876 501578903 501869659 502620239 503145523 503359833
1076.3 503359833 503918190 504338150 503843918 503507729 505201912 506466370 507510643 508244820 508572197
1085 508572197 510081711 511019440 512150383 512579956 512164154 513326569 515255394 516086349 516690445
1093.6 516690445 518338814 519662132 520428123 520564728 521304512 522271843 522804604 523877869 524724579
1102.3 524724579 526218834 527330437 527764854 528673897 529467850 529274940 529320869 530724258 530978584
1111 530978584 531172638 532306557 533899727 534936180 534594917 534806175 534642448 534313698 533880615
1119.7 533880615 533906097 534873161 535316162 536284447 536576271 536696930 537081833 536794968 537357864 538805542
1129.3 538805542 540594139 542112198 543348083 544575462 546195259 547776566 548880043 550060844
1137 550060844 551010590 551969566 554127579 556432762 556753349 556760559 557384491 557981033 558603325 558770409
1146.7 558770409 558986969 559573975 560509758 560882645 560787926 560921211 560465126 559710617 559183044 558931160
1156.3 558931160 558354645 557803612 557528191 557260094 557610550 557390480 556948471 556837692 557144012 558424721
1166 558424721 559720001 561130447 562670593 564369354 566271362 568417702 570340996 571605453 572996407
1174.6 572996407 574963188 577180595 578960533 580689621 582649879 584608574 586302338 587785950
1182.4 587785950 589029617 589727669 590329323 591317749 592851791 594444885 595253677 595443840 595893745
1191 595893745 595758324 595080223 594873848 594915657 594938736 594666328 594651985 594031410 593071594 592531929
1200.7 592531929 591515656 590962791 590353699 589665833 589379234 588720398 588386917 588047028 587233772
1209.4 587233772 586040382 585293045 585409851 585195541 585104904 584959869 584642639 585125008 585445442 584952621
1219 584952621 584084358 583087387 582248039 581858978 581761894 581517258 581426315 581308632 580687599 580007629
1228.6 580007629 579347229 578669586 578093605 577440491 577068710 577132301 577184143 577049675 576806870 576514587
1238.3 576514587 575866280 575354156 575319176 575320816 575327187 575166855 575358849 575433083 574851074 574326744 573885651
1248.9 573885651 573718452 573280678 572795753 572940636 573139381 573337669 573494301 573621445 573319893 573143616
1258.5 573143616 573424301 573252144 573059387 573234406 573844719 574501762 574889030 575327034 575833092 576296005
1268.2 576296005 576689911 576988373 577657814 578925705 579850082 580883102 582083855 582850609 583439178
1276.9 583439178 583838158 584596443 585592880 586355553 587187080 588379974 589634094 590887222 592219086
1285.5 592219086 592923470 593368530 594267197 595175209 596036949 597281456 598465309 599382248 600019646
1294.2 600019646 600646477 601250877 601358452 601697731 601875305 601971054 602374496 603031998 603783760 603813477
1303.9 603813477 603702965 603514671 603257904 602734261 602418633 602790680 602605629 602455215 602642059 602428551
1313.5 602428551 601738777 601281128 601249046 601214142 601355095 601242790 601516800 602496758 603374100 603977051
1323.2 603977051 604359207 604783821 605185661 605278053 605201607 605240784 605039711 605205727 605333710 604941254
1332.8 604941254 604790955 604469872 604145737 603689117 603639717 603463097 602701187 603312340 604117699 604697876
1342.4 604697876 604958420 605340462 606147728 606286926 606051941 606117668 606696663 606644669 606651802 606702309
1352.1 606702309 606338348 606521416 606302681 605728569 605367470 605283585 604845352 604441071 604386101 604409752
1361.7 604409752 604559975 603503113 603555412 603580666 602875633 602600479 601866608 601316719 601158638 601301842
1371.4 601301842 601382179 601228638 600684319 600110435 600133781 599732742 599751854 599815865 599471016 599204559
1381 599204559 599304314 599119911 597772293 596937637 596759415 596592484 594981956 593972168 594056511 593687172
1390.7 593687172 593275185 592398567 591750603 589951515 586821480 585277328 583998718 583379173 581849213
1399.3 581849213 580995750 580409889 578660393 577283249 576225586 574256096 572347031 571281357 570150909
1408 570150909 569172821 568194847 567002716 566158829 565070114 564111328 563633308 563130531 562232246 561515770
1417.7 561515770 560982819 558612633 559296227 560227013 560401840 560756111 560144539 560680542 561375122
1426.3 561375122 561380730 562135963 562625237 562714081 563129463 564262390 565183830 565960274 567454987 568541336
1436 568541336 567790833 568327866 570657768 572146339 572668266 573171349 573771210 574861259 575101318
1444.7 575101318 575877647 577168427 577809372 578248901 579155083 580242233 580725403 581302528 581980896
1453.3 581980896 583041458 583877068 584449730 584156876 583730774 586242676 587750969 589849396 591083794
1462 591083794 591514359 592707062 593070793 594521484 596159515 598181877 599644318 601000977 603017235
1470.7 603017235 603421783 603535042 605736618 608894653 611743011 613463593 614942741 617012482 618519554
1479.4 618519554 619067001 619241295 620204353 621751366 622899284 624112129 625377274 625244179 624785080
1488.1 624785080 625670471 624915886 623469467 624080353 624842567 624595451 624224892 623918304 619921112
1496.7 619921112 620185738 619202690 616517181 616480026 615620842 615017395 614785919 615765724 615700569 609784889
1506.4 609784889 607073135 606807365 608725433 609080429 610107002 609593239 607689552 607945290 607564087
1515.1 607564087 606622772 604072495 602727699 604326439 605671692 604027710 600811081 601579170 603449707
1523.7 603449707 605660210 605579720 605870705 605878372 605601082 606733246 607312851 607873726 608117523 608000107
1533.4 608000107 606718712 607786064 608992958 609572105 611012344 609346733 605794220 607487450
1541.1 607487450 608369331 608838463 610402679 611271362 609963417 611086082 611913109 612732353 612480164
1549.8 612480164 611849976 613296852 614263611 614874840 611983337 612638626 615019073 617059326 618738365
1558.5 618738365 608860741 606470795 609607239 612213669 612064362 611509972 609573708 607652016 607584381
1567.1 607584381 606336899 605712738 600352249 599470787 598989410 597011795 595466194 593834457 593550873
1575.8 593550873 584350204 583430061 582070122 579626808 577480316 573841171 571458969 567391014
1583.5 567391014 564648056 561136284 558061523 555187912 551209984 548572273 544419518 541843185
1591.2 541843185 537485161 534866028 532066994 528029366 525683975 521662292 519724236 515904121
1599 515904121 513409386 510609283 508062973 506097565 502140579 500848694 498108559 496667786 493448067
1607.6 493448067 492007294 490821037 487745056 487366142 484542542 483736343 481803818 482026520 481486244
1616.3 481486244 474693985 477086182 476367531 476742287 475209465 475959435 476165009 473239174 474086456
1625 474086456 473950996 475767365 474245529 474703255 475208511 475619354 476569977 476534233 478640327 479190445
1634.6 479190445 479740372 477709885 480204544 481853561 482680321 484988747 485559120 487583466 488094406
1643.3 488094406 490317230 492205582 491718674 494517365 493912964 496652832 497844238 500578613 503250160
1652 503250160 501193199 498847122 501988220 506538811 508164635 510077934 511239510 513192291 515139961
1660.7 515139961 516734886 518592720 519181633 522972260 524995995 526976814 529127350 531345406
1668.4 531345406 532814827 534017830 538352051 539885826 543610191 547398796 549263382 550506287
1676.1 550506287 553386040 557171059 559538612 562458725 564249153 567930374 572579269 575163994
1683.8 575163994 576270027 577507095 582472649 585814362 588723602 592473412 595639763 598803177
1691.5 598803177 601357727 604299774 607829704 611298256 610768433 614737015 619764214 625101852
1699.3 625101852 630443344 626844940 631108894 634720764 637738037 639899139 641627731 642869797
1707 642869797 645195770 648238373 649804611 651240845 653247986 655254822 656944122 656522446 656668777
1715.6 656668777 659921188 662521362 658782196 660774765 663674545 665611572 666942139 667498703
1723.4 667498703 667914352 669100037 670274353 670830002 671676407 672959213 672703857 673129272 676291351
1732 676291351 679533768 678195724 673759079 677127457 680258484 681456909 683640060 684038086 682751770
1740.7 682751770 685956955 687928467 687785492 688687973 691453857 694033432 695308380 695998306 696457825
1749.4 696457825 699920273 700612183 700551453 704318085 706565399 708388748 710526581 710741043 711868286
1758.1 711868286 713780365 715289764 717389984 716113052 715670013 718263168 719516220 720785675
1765.8 720785675 722497025 723825684 722031097 722912827 725806427 725968475 724053345 723052521 726680298
1774.5 726680298 728668594 728124237 729775620 730388184 731234894 731160431 730170517 731031342 732275543
1783.2 732275543 733514481 733286133 733566513 734722900 735217819 735272064 735887146 735824280 735997391 735085907
1792.8 735085907 734785156 737955933 739151459 738411636 739013214 740737152 740904160 738890915 740066452
1801.5 740066452 739790878 740283661 742191391 742977829 743601913 743339233 743253021 743668365 744050598 742924500
1811.1 742924500 743085251 744338989 744985428 746315460 746960297 747415771 746564026 746330643 746892090
1819.8 746892090 746342773 747112198 747357101 748393860 749796219 748046188 747974854 749411774 750590591
1828.5 750590591 749977798 746637802 747353363 749559174 750160904 750730972 751233063 751332474 751548462
1837.2 751548462 750850677 750886536 750952377 751212311 751168060 752225723 753665848 750421448 751664429
1845.8 751664429 753036346 752708359 752339325 752358704 752784500 752639008 753357773 753909988 754459381 754814301
1855.5 754814301 754596863 754692688 754354248 754407959 754478912 754554977 754327469 754700165 755399246 755553284
1865.1 755553284 755799484 755187836 755270157 754257584 753292999 754550705 755628204 756286163 756386719
1873.8 756386719 756713562 756614532 756296310 755728836 755393448 755362396 755439987 756546783 756794357 756993637
1883.4 756993637 757009964 756993713 757191620 756563797 757233200 757328568 755944214 756214752 757090759 757298050
1893.1 757298050 757543716 757389908 756318436 756804047 757185974 757291565 757354279 757225952 757407837 757366714
1902.7 757366714 757912064 757869263 757824249 757906952 757470322 757452164 757522736 757492599 757674408 758327179 758068771
1913.3 758068771 757953720 757839966 757952957 759000244 757542038 757016220 757933426 758845596 759730301
1922 759730301 758450089 757237320 757489014 757894897 757763290 757934265 758204575 758382721 758532562 758353729
1931.7 758353729 758516769 758040085 757781754 757733612 757720490 757983170 757883072 757987747 758084030 758717728
1941.3 758717728 758111954 756589661 757109756 757534561 757312851 757097702 757522507 757829971 757872391 757626038
1951 757626038 757469177 757517395 757131042 756762619 756261673 756684494 757068634 757030792 757408524 757455521
1960.6 757455521 757612381 757194595 756641464 756476974 756556549 756646957 756143570 756020508 756529846 757041931
1970.2 757041931 756839294 756562271 756255035 756360931 756790848 756535721 756557846 756718521 756947479 756699600
1979.9 756699600 756360168 756279373 755956802 755959473 755653839 755649414 755904922 756130371 756021194 755804901
1989.5 755804901 756427078 756017380 754621887 754473572 755210800 755365906 755207825 755255280 755395584 755851288
1999.2 755851288 755437241 755331726 755259552 754702759 754617462 754517136 754739456 754725800 754870911 755018997
2008.8 755018997 754699020 754226761 753609924 753526840 753612823 753764038 753741837 753494415 753109512 753242798
2018.5 753242798 753760071 753697968 753704910 753615189 753665771 753484192 753154602 753014297 752864990 753279648
2028.1 753279648 753552094 753586655 752930450 752604675 752737122 752320328 752450409 752547989 752498856 752356262
2037.7 752356262 752338791 752141342 751778564 751772461 751544724 751834412 751939011 751832886 751632309 751416779
2047.4 751416779 751464615 751095810 751004486 750784531 750801544 750927277 751055222 751361771 751221695 751393509
2057 751393509 751290665 751014175 750711288 750421143 750329971 750390396 750789642 750681915 750564804 750652084
2066.7 750652084 750888214 750924225 750697174 750330811 749867935 750038452 749974747 750279770 750686188 750633469
2076.3 750633469 750420151 749809647 749754410 749859314 750200653 750283737 749931107 749847183 749964981 750175552
2086 750175552 749944000 749884491 749723206 749537048 749352722 749358292 749662399 749362183 749214630 748951492
2095.6 748951492 748833466 748799210 748704224 748670197 748444595 748957748 749428253 749752579 749592285 748904037
2105.2 748904037 748241806 747784805 747977982 748118973 748450928 748378677 748505325 748806763 748357239 748110657
2114.9 748110657 747882462 747811432 747488403 747543945 747855530 747770691 747987900 748499222 748892059 748219833
2124.5 748219833 747927475 747703171 747362823 747459335 747130432 747318115 747145691 747198181 747743301 747704926
2134.2 747704926 747267609 746817627 747053528 747289734 747681274 747656860 747444229 747549057 747781677 748226547
2143.8 748226547 747944336 747756119 747523651 747508469 747531662 747150345 747369766 747593079 747882080 747858887
2153.5 747858887 747633667 747345505 747226791 747509689 747403336 747283096 747370758 747817612 747696152 747703171
2163.1 747703171 748009872 747514877 747199402 747167816 747694244 748008194 748155136 748202744 747780075 747596436
2172.8 747596436 747224426 747251740 747295227 747444687 747827530 748118515 748383484 748137665 748136444 747684097
2182.4 747684097 747297363 747471695 747361526 747520065 747930756 748290863 748419495 748480835 748238525 748007812
2192 748007812 747870407 747882385 747929153 747625122 747753754 747807159 748049698 748243179 748368301 748599091
2201.7 748599091 748235855 748180008 748131485 748315887 748500214 748663330 748821640 748644409 748907089 748698196
2211.3 748698196 748450317 748027878 747761536 747973404 747991180 748625641 748929520 748825684 748697052 748851929
2221 748851929 748647842 747863846 747729492 747910614 748493881 748664551 748686829 748651581 748486099 748585281
2230.6 748585281 748273468 748358002 748360825 748425903 748524246 748453827 748544693 748400497 748499680 748289871 748137436
2241.2 748137436 747908859 747804108 748023605 748008728 748271027 748256836 748543777 748731003 748373489 747951279
2250.9 747951279 747664490 747615051 747528458 748089828 748517380 748855209 748763885 748271255 748432846 748334122
2260.5 748334122 748260880 748323364 748415451 748175812 748031387 748070755 747975006 748474197 748585739 748328857
2270.2 748328857 747998276 748288040 748600235 748190155 747989197 747745743 747923584 747804108 747780609 747700424
2279.8 747700424 747334976 747463379 747270432 747605057 747645874 747414474 747420731 747298508 747403030 747417908
2289.4 747417908 747479858 746988525 747171326 747502136 747484741 747642059 747281265 747684708 747969055 748105774
2299.1 748105774 747771606 747177048 747361221 747059097 746889725 746638489 746808548 746984863 747108688 747622757
2308.7 747622757 747316437 747343521 747109680 747019424 747508240 747636566 747779999 747941971 748007889 747640610
2318.4 747640610 747512817 747646179 748272171 748026581 746905518 746689758 747085571 748617477 748772430
2327.1 748772430 748190994 748980179 749659271 749287415 748023834 747872238 748427887 748280411 747520447
2335.7 747520447 747655334 747914581 747838211 747516403 746698914 747657166 747529297 746589661 746908264 747162399
2345.4 747162399 746722641 745588913 745416031 746145325 747373276 747686691 747652817 748069687 748168488 749238281
2355 749238281 749082031 749343185 748864288 747649612 748270798 747207718 746535568 747859650 749386826
2363.7 749386826 747706223 745116196 745561752 746908722 746734009 745325089 744958496 744563141 743890152
2372.4 743890152 743488998 743080063 742950668 742882538 742840958 742920685 742934418 742343445 741882629 741521835
2382 741521835 741335449 741271896 740642014 740795288 741238327 741156769 741177826 741206436 740986710 740471420 740132523
2392.6 740132523 739700851 739291611 739313049 739861679 740232239 739774017 739594040 739607239 739328537 739165115
2402.3 739165115 739124680 738800201 738574066 738554916 738404541 738477249 738340912 738524780 738872681 738491745
2411.9 738491745 737859650 737458344 737568665 737454224 737205734 737199936 737478104 737753601 737587357 737245712
2421.6 737245712 736401520 736007004 736041107 735727997 735939636 736394806 736310043 735959930 735616226 735227890
2431.2 735227890 735228424 735051498 734604721 734218292 733917847 734255371 734430923 734422226 734117355 733665085
2440.8 733665085 733558502 733303070 733320465 733314972 733469391 733500214 733057404 732844772 732630920 732563171
2450.5 732563171 732331390 731674805 731066360 730987625 731084824 730968704 731210480 731545334 731320572 730949249
2460.1 730949249 730918503 730243073 729609070 729768829 729624634 729530945 729662552 729530792 729205475 729296799
2469.8 729296799 729015045 728295135 728001099 727636795 727654572 727691269 727901993 727925186 727459183 727424164
2479.4 727424164 726879044 726438980 726257172 726115112 725899811 725281296 725435944 725752563 725408401 724629745
2489.1 724629745 724436035 724563599 724202652 724033279 723854752 723732986 723591766 723486252 723457260 723224335
2498.7 723224335 722960510 722642441 722344971 721980896 721610260 721401215 721735229 721816711 721498566 721291199
2508.3 721291199 720583420 720217438 720276108 720325546 719958572 719307480 719110718 719096069 719342346 719019318
2518 719019318 718293610 717799911 717756195 718091660 718012466 718001709 717743683 717407455 717107315 716615372
2527.6 716615372 716556091 716653595 716546249 716029053 715812531 715705872 715292358 715148621 715323257 715460663
2537.3 715460663 714973373 714552078 714430618 714499207 714609909 714235229 713646545 713100815 713262177 713358688
2546.9 713358688 712636337 712324524 712382660 712156982 712323303 712535629 712239075 712069778 711450500 710835800
2556.6 710835800 710813904 710766296 710693970 710520477 710406494 710083160 709739304 709463348 709262695 709239731
2566.2 709239731 708894806 708594360 708482819 708611298 708574905 708518295 708458099 707890854 707294922 706604080
2575.9 706604080 706630859 706800461 706533966 706656647 706591568 706290588 705886993 705691528 705337372 704987411
2585.5 704987411 705124207 705042114 704869003 704620590 704710388 704727249 704280396 704074020 703819809 703525085
2595.1 703525085 703291931 703003769 702568207 702101212 701838226 701954498 702238617 702180710 701843109 701340790
2604.8 701340790 700799103 700272598 700151825 700275879 700305786 700302124 700144119 700119553 699827652 699354706
2614.4 699354706 698964233 698534775 698185959 698041687 697945480 697404022 697327042 697190323 696549835 696498947
2624.1 696498947 696563873 696367493 695788651 695320511 695313187 695543518 695603256 695266724 694971390 694593277
2633.7 694593277 694200897 693732452 693528595 693239899 692848892 693075790 692958679 692565918 692187576 692110062
2643.4 692110062 691945343 691429443 691536789 691378708 690832291 690293732 689906387 689934158 690034103 690056534
2653 690056534 689758911 689433823 689028702 688557968 688300858 688274155 688237686 687879486 687575226 687383423
2662.6 687383423 687179184 686910477 686741333 686651154 686798019 686817856 686339798 686288986 686077881 685588226
2672.3 685588226 685156631 684858780 685063324 684936600 684702377 684554901 684429169 684472885 684279709 683950043
2681.9 683950043 683547974 682854996 682433777 682749252 682518997 682056198 681953430 681500320 681219940 681223526
2691.6 681223526 681202393 681022415 681220627 681241074 680622406 680405350 680318375 680271301 679971542 679505310
2701.2 679505310 679173508 678919601 678896942 678651810 678618469 678685150 678741531 678549805 677882843 677608414
2710.9 677608414 677292709 677001495 677152100 677155533 676877289 676709366 676450424 676248398 676194000 675736542
2720.5 675736542 675832901 675978851 675363693 675095367 675095367 674755096 674652634 675186996 674963074 674089127 673564758
2731.1 673564758 673347321 673188324 672813187 673018341 673243790 673320541 673586121 673501511 673565674 673156433
2740.8 673156433 672463989 672219391 672069855 672173233 672199097 672352829 672632217 672379227 671992874 671324158
2750.4 671324158 670468826 670275955 670343552 670457535 670457993 670361862 670520706 670425186 670399780 670234528 669554062
2761 669554062 669197693 669326248 669339142 669061356 669067307 668959656 668603058 668386993 668261642 668184052 667931976
2771.6 667931976 667796783 667452240 667218552 667257080 666825485 666317368 665854034 665695114 665634232 665584030
2781.3 665584030 665555191 665187607 665239029 665302811 664873886 664338989 664073029 663908310 663456573 663646774
2790.9 663646774 663740921 662585144 661530762 661489182 661812820 661903534 661785736 661135483 660229950 659718475
2800.5 659718475 659229507 658851700 658528595 658405685 658666077 658068008 657231140 657088242 656918640 656507645
2810.2 656507645 655814667 655466537 655266647 654717102 654383316 654220657 653994141 653400726 652590561 651949615
2819.8 651949615 651579285 651279221 650985794 650770416 650142059 649738922 649642029 649175949 648465118 647465591
2829.5 647465591 646930161 646935272 646495514 645851517 645427017 644652176 643855896 643538513 642785110 641597748
2839.1 641597748 640634613 639632721 638332481 637279701 636313744 634879837 633572731 632632637 631587410
2847.8 631587410 629970131 628230705 626801033 625646477 624989548 624537010 624176292 623966446 623932266
2856.5 623932266 623891907 624198914 624441185 623801994 623619766 623676491 623610916 623557777 622992363 622776413
2866.1 622776413 622392807 621478920 620892830 620541992 620132637 619859428 619658661 619182701 618769150 618409271
2875.8 618409271 618159180 617902031 617367439 616886024 616729126 616652031 615958633 615154724 614679756 614212494
2885.4 614212494 613301125 612544937 612592735 612143173 611332283 610567856 610168762 609891739 608961487 608379517
2895.1 608379517 607471085 606768837 606597061 605657692 605186882 604866600 604332962 604320259 604007301 602988625
2904.7 602988625 601761551 600940208 600545883 600210915 599715118 598880081 597858963 597182770 596306000
2913.4 596306000 594641380 593279305 592419662 591228523 589894943 588572502 587326393 586751137 586553574
2922.1 586553574 586267815 585799065 585521393 585910683 585894165 585531235 585594254 585954361 586256599 586036987
2931.7 586036987 586057053 586502495 587253799 587947426 588003082 588310318 589015160 589679222 589999352 590248642
2941.3 590248642 590967560 591623154 591971321 592276421 592723274 593282776 593617325 593921700 594534874 594717255
2951 594717255 594674568 594893570 594802322 594557228 594398537 594958572 595661507 595725098 595821991 595935516 596382370
2961.6 596382370 596728897 596594391 596664429 597339668 598340683 598973236 599386635 599602394 599837341 599993210
2971.2 599993210 600481186 601399498 601526489 601755409 602320366 602738495 603138466 603214531 603162498 603111687
2980.9 603111687 603379135 603753471 604114189 604317093 604380226 604718323 604694939 604625587 604654312 604544411
2990.5 604544411 604902763 605340691 605338097 605228348 605076599 604822693 604905205 604720306 604150200 604162445
3000.2 604162445 604170914 603869820 603560219 603014793 602428551 602160606 602142487 602013092 601812439 601449127
3009.8 601449127 600675888 600138702 600066376 599887810 599572754 599292717 598965645 598551216 598247681 597942696
3019.5 597942696 597173462 596467743 596261635 595934181 595585670 595321579 594817123 594390564 593874016 593431854
3029.1 593431854 593045006 592052917 591436234 591247444 590996971 590951881 590285110 589276237 588884392 588722649
3038.7 588722649 588010025 587149467 586690140 586224403 585643806 585275841 585190201 584430466 583227425 582736282
3048.4 582736282 582635803 582318039 581542282 580788765 580269890 580148849 580214577 579474831 578435478 577816505
3058 577816505 577549973 577169456 576338005 575545464 575358963 575310478 574804764 574492264 574204636 573746529
3067.7 573746529 573199959 572448997 571918831 571536942 570993233 569996490 569399681 569399452 569387970 569515381
3077.3 569515381 569191246 568630447 568007584 567057343 566111755 565810318 566059608 565635796 564774055 564095078
3087 564095078 563800163 563825836 563683701 563046417 561999245 561304245 560782013 560238571 559816093 559442253
3096.6 559442253 559181595 559040527 558577385 557511444 556968575 556622543 556126060 555728416 555011711
3105.3 555011711 554787674 554773521 554293213 553570099 552929077 552333412 551886864 551963158 551594734 550725021
3114.9 550725021 549710617 548996353 548904648 548369942 547553749 547308083 547298889 546500130 545312538 544815559
3124.6 544815559 544722290 544261093 543602180 543305740 542411728 541323204 540954437 540691032 540086288 539041595
3134.2 539041595 538271637 538016510 538100319 538005905 537585640 536869926 535560837 534620476 533973427 533281860
3143.9 533281860 532500420 531588516 531230659 531119080 531102753 530844879 530193481 529415321 528363419 527727470
3153.5 527727470 527267418 526312256 525684319 525480423 524866333 523917809 522855034 522281761 522404633
3162.2 522404633 522080078 521123505 520132523 519447594 518736725 518081436 517916794 517578545 516810150 515759125
3171.8 515759125 514773026 513969536 513406830 513227386 512768936 512036591 511134758 510398560 510220833 509611740
3181.5 509611740 508397636 507674332 507528534 506953926 505812416 505100975 504970512 504798889 504439354
3190.1 504439354 503577194 502378044 501635475 501417313 501131477 500023460 499023018 498728256 498173714
3198.8 498173714 497472038 496826553 496388512 496152954 495912819 495429115 494554253 493766365 493066330 492740974
3208.5 492740974 492451286 491303520 490113716 489735489 489732666 489018288 487866669 487588844 487548447 486962280
3218.1 486962280 486362877 485511436 485061760 484915428 483917732 483303452 483085899 482792587 482239227 481169624
3227.8 481169624 480804901 480424767 479672356 479350662 479116364 478735886 478151169 477351608 476716919 476202812
3237.4 476202812 475216484 474940147 474878922 473932076 473344231 472999153 472752304 472245483 472003555 471842308
3247 471842308 470875854 470524940 469906845 468996658 468516884 467971153 467795563 467295227 467005692 466860847
3256.7 466860847 466214638 465950241 465504417 464699211 464244576 464121628 463987923 463538170 463094063 462660980
3266.3 462660980 461823425 461215630 460903778 460461121 460160942 459944687 459967117 459783516 459247284 458751221
3276 458751221 458173332 457997017 457530632 456659927 456419449 456218529 455947723 456081810 455832901 455112152
3285.6 455112152 454637108 453925591 452984848 452751503 453140564 453203125 452633972 452031212 451524277 451119270
3295.3 451119270 450582199 449937820 449641762 449395447 448935051 448375702 448243599 448240166 447720413 447337532
3304.9 447337532 447144318 446569328 445971680 445382156 444467964 444021530 444029121 443707848 442841377 441793938
3314.6 441793938 441610184 441355209 440248146 439784546 439736328 439222565 438882484 438743896 438135796 437227325
3324.2 437227325 436580811 436138611 435518456 434729767 433471870 432126389 431757126 431674080 431256065
3332.9 431256065 430532494 429748230 429137421 428258171 427434082 426833191 426229782 425197449 424277611
3341.6 424277611 424186745 423883591 423329086 422405701 421356659 420940247 420493813 419962921 419246254 418652687
3351.2 418652687 418489265 417905655 416896706 416030426 415504417 414914169 414168243 413511047 412700768
3359.9 412700768 412237358 412236290 411864738 411521225 411221504 410633202 410084534 409183044 408206177 407578926
3369.5 407578926 407304611 406945381 406077042 405693398 405556831 404981842 404402542 403693047 402943649 402736473
3379.2 402736473 402504539 401906548 401773262 401581154 401242790 401112366 400558701 399918289 399712563 399788704
3388.8 399788704 399215775 398403893 398132668 397724609 397543831 397548828 397365608 397161140 396470337 395665894
3398.4 395665894 395607758 395879936 395923805 395714149 395396996 394924850 394071350 393752098 393740196 393293762
3408.1 393293762 393276405 393485985 393677788 394044762 394233322 393915062 393440132 393415489 393760338 394036407
3417.7 394036407 393620796 393064613 392745667 392630157 392805824 392784424 393069916 393386841 393294945 393287544
3427.4 393287544 393195839 393446922 394381981 394501991 393743858 394076080 394608459 394132767 393788376 394154129
3437 394154129 394533615 394809227 395432816 396083527 396502647 396452560 396670685 397065125 397619476 398557320
3446.7 398557320 397654915 397275734 398453636 399176941 399717598 399815712 400204201 401102219 401616249 401828690
3456.3 401828690 402379341 403194199 403397903 403306198 403570900 404642830 405539856 406098137 407087288 408050270
3466 408050270 408808899 409084167 409313087 409605179 409929085 410291557 411004028 412111130 412449265 412896500
3475.6 412896500 413945580 415063820 415607605 415866203 417026787 417983704 418117790 418232079 419396019
3484.3 419396019 420751076 421257477 421762352 422253876 422810249 423420486 424038811 424367599 424916191
3493 424916191 426318054 427816620 429108353 429493599 429498253 430013885 430887947 432017822 433468361
3501.6 433468361 434707642 434681473 434848557 436046295 437383232 438338661 439584541 440577202 440428009
3510.3 440428009 440706024 441613655 443023033 443681450 443999176 444715309 445372047 446737671 447704506
3519 447704506 448583336 450041237 451481743 452009354 451931686 452709198 453381424 454710197 455923653
3527.7 455923653 456708870 457722397 458636246 459881401 461020012 462257614 463096428 464597931 465557632
3536.4 465557632 465463371 466791878 468016891 469250336 470322876 471805038 473042145 474122314 475307541
3545 475307541 475249062 476716194 477010956 478487663 480723801 482029533 484116783 483581352 484660606
3553.7 484660606 485771523 486607628 488836098 489126511 490331154 492090836 493534622 493953743 495527573
3562.4 495527573 497528496 498299942 502497444 504093361 503732452 503803177 503206100 506258698 507514076
3571.1 507514076 509342842 511935692 513351021 514200211 515174484 516495323 516803627 519633484 521661377
3579.7 521661377 522315445 524374466 525915565 527228432 528002510 532021370 534692307 532754936 534391556
3588.4 534391556 533788834 536057549 539345589 542104340 543339233 543620415 547004471 546268845 547544594
3597.1 547544594 550679855 550975723 553920593 555638771 556550751 558601456 560521927 562787209 565106659
3605.8 565106659 567338181 566946907 569584999 569162979 568649292 576566505 580030975 577881050 580331497
3614.5 580331497 579052620 582331085 586917534 586702881 587875023 587857590 588919487 592435150 595017853
3623.1 595017853 596502151 599162102 601940269 603603783 609479828 612486343 603102913 604879990
3630.9 604879990 608544350 613946228 615906525 614305687 616697006 619997368 622878380 623451233
3638.6 623451233 624199600 625910378 628077393 629902344 630156174 631937218 635471725 641507874 640633926
3647.3 640633926 635417137 641580963 643725281 641231461 639804573 644032364 647631378 651139679
3655 651139679 657105408 650244370 650260010 654833298 656010284 657574158 658462448 660061646 660422592
3663.6 660422592 661821899 663674088 663748779 667111206 669083405 668492889 669411850 664102097 664850235
3672.3 664850235 671258545 679822464 682202988 666273499 665639877 671710739 676858597 675348053
3680 675348053 674673615 676799927 678398285 679771652 680228806 680125580 683480301 690765381 683115540
3688.7 683115540 677467117 685772781 680700760 679576645 684957809 685650940 687164688 687946625 687243271
3697.4 687243271 687750473 687566605 689455261 692973328 689225616 685815048 689878845 691882935 691771164
3706.1 691771164 692324142 694402466 697308273 690554123 694193192 699954376 686491241 689132309
3713.8 689132309 693659515 694231567 695000839 696831512 697997055 695273361 695425644 700884247 699038391
3722.5 699038391 693663940 698139420 699554672 698797760 696207275 695273132 698444214 699458694 704958954
3731.2 704958954 702571869 694645386 703749619 704474792 692681427 691709671 694366226 695420761
3738.9 695420761 698390198 702040558 697817764 700205231 712498474 709158325 689903336 695755157
3746.6 695755157 700662003 707030334 705743484 694624329 705702820 703679276 693372803 698007812
3754.3 698007812 702604904 705875320 700093994 700668259 706995163 701162491 697969055 701228790
3762 701228790 703251190 703689117 706246796 704191437 699328461 701820526 706984253 708649368 699903488
3770.7 699903488 699934082 703036575 703705597 704792404 704551773 704702225 705202179 708136520 707971268
3779.4 707971268 699669724 701367493 703456039 704143829 706816711 705301514 704397049 704929276 704812546
3788 704812546 705253677 705193863 705408630 705110931 705375977 705573196 706421890 709544373 706897430 702907104
3797.7 702907104 704082031 706650848 712172318 709738312 699330597 700311050 702467117 707957077
3805.4 707957077 716174850 708219147 700649109 703865204 705146255 705345840 705915298 705675659 707367630
3814.1 707367630 714502487 716484146 700640182 702534103 707721558 712197037 716023483 700090027
3821.8 700090027 699156418 704013062 705988541 708304367 708007126 703024673 702889099 705276184 709428787
3830.5 709428787 712042847 702932587 704428635 712411957 708154602 706426773 714695053 708383331
3838.2 708383331 701830902 708965836 703603592 702087173 709659653 708294373 702942505 704727554
3845.9 704727554 706149063 705917816 707864914 707509995 708557358 714464798 710629349 711944580 698704224
3854.6 698704224 696930847 706454773 706269684 703759308 704962540 706634521 709566345 705734024
3862.3 705734024 705972519 713376617 707523499 699960403 703234406 708108597 714875717 708537140
3870 708537140 698433151 701836014 707069626 710291672 701819687 702048874 705796432 705974731 708271713
3878.7 708271713 713358459 709273453 700742035 705599823 706898422 708364334 714750977 702220993
3886.4 702220993 701472778 705650635 706141510 710071259 709725800 700488815 701499329 705892563 705348358
3895.1 705348358 705884857 706667862 709319077 711540909 701715851 706287613 709202347 703545380 708409576
3903.8 708409576 706084747 703079453 703096237 704067535 706548843 706121597 705564423 705293503 705463028
3912.5 705463028 705481949 704906311 706263580 709162827 706736450 702747650 707315598 707690964 702234192
3921.1 702234192 703962784 705897293 706774216 705191422 702619324 704410553 705897751 706885681 705937958
3929.8 705937958 705705948 708232574 705885544 704243546 705673294 705518799 705195084 705094757 704925156
3938.5 704925156 704877090 704871063 706416550 707617722 703652344 702541275 704274139 705125122 706255798
3947.2 706255798 704297104 704441223 705350952 703345718 704834595 705418243 704090652 704124298 704643555
3955.8 704643555 704187775 703721313 705109863 704979248 705109787 705499649 703579178 703541412 704495239
3964.5 704495239 704534531 704698563 705056534 705366440 704789734 704372635 705531540 705324097 704277878
3973.2 704277878 704438171 704462051 704861526 704267273 703968048 704648209 704768906 704702682 704176331 704609909
3982.8 704609909 704507370 704147644 704378357 704088135 704388733 704519424 704853210 704247589 703573456 704108429
3992.5 704108429 704036026 704468918 704628677 704386673 704476089 704711685 704630432 704153900
4000.2 704153900
##END=$$ End of the data block
