##TITLE=$$ Begin of the data block
##JCAMP-DX=5.00 $$ ACD/SpecManager v 10.08
##SPECTROMETER/DATA SYSTEM=Varian
##DATE=08 Jan 2013 15:11:10
##DATA TYPE=INFRARED SPECTRUM
##DATA CLASS=XYDATA
##ORIGIN=
##OWNER=
##NPOINTS=3735
##FIRSTX=399.26403809
##LASTX=4000.35498047
##MAXX=4000.35498047
##MINX=399.26403809
##MAXY=76.15615845
##MINY=39.37100220
##XFACTOR=1.0000000000
##YFACTOR=0.000000100000000
##FIRSTY=58.07811356
##DELTAX=0.96440572
##XUNITS=1/CM
##YUNITS=TRANSMITTANCE
##XYDATA=(X++(Y..Y))
399.3E80781136M591178K602768o476669l224335P415276K067528k65618O050644N078202
407.9E98620110n21508j212196l320580j280136j94893m604797l350105o505547K937165
416.6E80567513Q258247N318451J6473160j6662484j0227050k907448k759972P3433
424.3E78133850k062225K595672N932160M079590r3995k274703J202201K581101K08778
433E90302429J50604m007644r217987j290665M417381M759713P530250N014114k104339
441.7E95553856m766426l00217l354645k988701Q20542L214035L368416j645928m613266
450.4E85287666j123199K658043n88761j439247k42042j675301j163177n10521K360305
459.1E83563766L5439q63953l059082m550895k9183K71187M971161N188522j363411
$$ plain form
399.3 580781136 585372314 587975082 581498413 578274078 585689354 587756882 587491264 593541908 598620110
407.9 598620110 598098602 596886406 593565826 592285690 592090797 587486000 584135895 577630348 580567513
416.6 580567513 588825760 594144211 610617371 593954887 583727837 580820389 578060417 578133850
424.3 578133850 576071625 578667297 584599457 588679047 588585052 586310349 587512550 590093651 590302429
433 590302429 590453033 586445389 577227402 575936737 580354118 585113831 592644081 597658195 595553856
441.7 595553856 590787430 590487213 587132568 584143867 584964409 588178444 591546860 589900932 585287666
450.4 585287666 584164467 586822510 586233749 584794502 584552460 582877159 581713982 581203461 583563766
459.1 583563766 583599205 582735252 579676170 575125275 575096092 575367279 580338440 585526962 584163551
467.7E84163551l278045n267411k719345j94320k382279n59349K523041M037170K362404
476.4E78685417k040405k87399J571235r19990m814949l522530N497589L540306L53813
485.1E78063087J423150m278450k459755j819230k32505J873321j101646j4267J697388
493.8E73151093K904930J519127j298600j231003O50826n3711j667404j171494o98166
502.5E72105598J440583O4544J53046k80228L70446L223495k632255l157731O65398
511.1E71952896n92880J0757O42357k37465j152305j964798l040848j576653Q57201
519.8E64898262K676086K271271K8649r00155j55372N37872o23855j151391j123886
528.5E66457481j37024P55043J069108J371803o93093l70903j791648k552910J450729
$$ plain form
467.7 584163551 580885506 575618095 572898750 572704430 570322151 569762802 572285843 576323013 578685417
476.4 578685417 576645012 576357613 577928848 577008858 572193909 568671379 574168968 577709274 578063087
485.1 578063087 579486237 575207787 572748032 570928802 570696297 572569618 571467972 571453705 573151093
493.8 573151093 576056023 577575150 576276550 575045547 575696373 575642662 573975258 572803764 572105598
502.5 572105598 573546181 573610725 573763771 573483543 573853989 577077484 574445229 571287498 571952896
511.1 571952896 571360016 571370773 572013130 571775665 570623360 568658562 565617714 564041061 564898262
519.8 564898262 567574348 569845619 569874268 568974113 568818741 569356613 568732758 567581367 566457481
528.5 566457481 566320457 567075500 568144608 569516411 568823318 568452415 566660767 564107857 565558586
537.2E65558586J461372m89234k352448k80113J103973j735649j226349N78308J379471
545.9E63997917J661377R14612j701317j487923m0702q69103l66516J47324L57971
554.5E62613640j279221k397346j035004J725121J411171p43714Q09899Q05549R32694
563.2E62842789j626587k457390J367493l26157q5945M31442M58222K179260P6904
571.9E62860031j639442l75214J432381j279183k069702K055969K113877j30158j980400
580.6E60988159o10008L28674j582184l13606J683731K31896J6784K34986N68847J068840
590.2E62616119j01165R67292J139222K23426o92367p07741P63512m04167R07363J478157
599.9E66189651n84144m90418q24546l94707M3373p3395r01832j97907M57993n97344
$$ plain form
537.2 565558586 567019958 566530724 564178276 563898163 565002136 563266487 562040138 562618446 563997917
545.9 563997917 565659294 566573906 564872589 563384666 563343964 562474861 562108345 562255669 562613640
554.5 562613640 561334419 558937073 557902069 559627190 561038361 560294647 561104546 561910095 562842789
563.2 562842789 561216202 558758812 560126305 559800148 559714203 560145645 560603867 562783127 562860031
571.9 562860031 561220589 560845375 562277756 560998573 558928871 560984840 563098717 562968559 560988159
580.6 560988159 560378151 560706825 559124641 558811035 560494766 560726662 560743446 560978432 561547279 562616119
590.2 562616119 562514954 563482246 564621468 564844894 564152527 563444786 564208298 563804131 564711494 566189651
599.9 566189651 565605507 565115089 564290543 563895836 563939209 563865814 562963982 562766075 563224068 562626724
609.5E62626724O24619K51961m78402m38118j347770j115113J27793P04574L20893
618.2E61277161O54716n1575J34163P04956M85611J191941J267662R73510K3690O56280
627.8E67318115J564102P87888J397705J976051J191445R9945p21398p76710J472397
636.5E74309540K974319J093025j20697J081238J312866M88396J521111J269989K25753
645.2E84155540Q05703J87568j11923l85551N78613J685944r4834L05138J691475R12895
654.8E89730568l50494j35308N55039r6283j21193l17345n27763n7564P79152M85954
664.5E89944763l86047R93576J734390r56230q81233J68457J014251J521264J100349
673.2E94253540R0332M39758J258927j7014q5449J606674J568718N37720O65779O57463
$$ plain form
609.5 562626724 563251343 563503304 563024902 562586784 561239014 560123901 560251694 560956268 561277161
618.2 561277161 561931877 561880302 562014465 562719421 563205032 564396973 565664635 566638145 566661835 567318115
627.8 567318115 568882217 569670105 571067810 573043861 574235306 574335251 573613853 572837143 574309540
636.5 574309540 577283859 578376884 578256187 579337425 580650291 581138687 582659798 583929787 584155540
645.2 584155540 584961243 585148811 585036888 584651337 585229950 586915894 586821060 587126198 588817673 589730568
654.8 589730568 589380074 589244766 589799805 589703522 589582329 589264984 588737221 588679657 589458809 589944763
664.5 589944763 589558716 590552292 592286682 591330452 590449219 590617676 591631927 593153191 594253540
673.2 594253540 594343872 594783630 596042557 596025543 595940094 597546768 599115486 599653206 600318985 600976448
682.8F00976448K60162M37165P99141J213874M15574q25959j67274R02328J037979
691.5F05049438J100388R66568Q98209K29187n39971k73666k45628J205749J611519
700.2F10001793M38690P32575L39088Q42247L46184n14527R79653O32286J59531Q1977
709.8F14039497O0273L96499M67377J031341J480408J300774k93770R6169J130676
718.5F19709244M36859O6376k03324J109963P14721l93180N71518O81114Q63266Q21342
728.1F24377899k1896j16272J106491J376800N90516O53495J186867J648598M96483
736.8F31298981q21572j161117k67639N97686K15302M50249L98636J145744J743660
745.5F33599930J82686n75219N88799J288223M16451M55475J68838j77078R01756O60477
$$ plain form
682.8 600976448 601236610 601673775 602472916 603686790 604102364 603276405 603109131 604011459 605049438
691.5 605049438 606149826 607116394 608014603 608243790 607703819 607430153 607184525 608390274 610001793
700.2 610001793 610440483 611173058 611512146 612354393 612700577 612186050 613165703 613797989 613957520 614039497
709.8 614039497 614099770 614496269 614963646 615994987 617475395 618776169 618482399 618578568 619709244
718.5 619709244 620146103 620212479 620009155 621119118 621833839 621440659 622012177 622693291 623556557 624377899
728.1 624377899 624356003 624239731 625346222 626723022 627313538 627967033 629153900 630802498 631298981
736.8 631298981 630477409 629316292 629048653 629646339 629861641 630311890 630710526 631856270 633599930
745.5 633599930 633782616 633207397 633796196 635084419 635500870 635956345 636125183 635948105 636849861 637510338
755.1F37510338l63579j85280J416397J867104M12063K28730P86133N94329N38941
763.8F42805176P5149k46734L32565K88010P4539K10724L02581k92892K05765R15146
773.5F44670029q7357N72586N77469l6621n4474j224289j020431K76184J232223M05350
783.1F45310669j82953M84619J101685J250686l36227j47705P9880p50733L32108O97479
792.7F47839508o5765K16980Q60824M35562n52902j787720r77325j12686n72815m9515
802.4F45234146l94745j30310n48248j290512o13632j068421j290207j251106j139564
811.1F37507401n21393o51856j275329j97258O1035j097183m60511n53665n82085J61248
820.7F32390404o5537k26631J043587J862716J226159J991119J280594N52444J242371
$$ plain form
755.1 637510338 637146759 636961479 638377876 640244980 640657043 640885773 641671906 642266235 642805176
763.8 642805176 642880325 642633591 642966156 643254166 643328705 643539429 643842010 643549118 643754883 644670029
773.5 644670029 644582672 645155258 645732727 645696106 645641632 644417343 643396912 643673096 644905319 645310669
783.1 645310669 645127716 645612335 646714020 647964706 647628479 647480774 647560654 646809921 647142029 647839508
792.7 647839508 647773743 647990723 648851547 649287109 648734207 646946487 645969162 645856476 645283661 645234146
802.4 645234146 644839401 644709091 644160843 642870331 642256699 641188278 639898071 638646965 637507401
811.1 637507401 636986008 636334152 635058823 634861565 634922600 633825417 633364906 632811241 632229156 632390404
820.7 632390404 632324867 632098236 633141823 635004539 636230698 638221817 639502411 640054855 641297226
829.4F41297226J225204K407151J575851J252289K725067J944046K85874L09219J519394
838.1F54541321J031112J063004J373672J223221J280899J168595J022339P60192J638337
846.8F65102692J249847N91507m5395k84576O52771Q09402J828461J866379P16400
855.4F72487488r5978J401825K043381k29340N5466R00802J641922J296311J29852
864.1F79631729M89578Q00858L2806o12945K34451l22342p07016j682358j973495n77774
873.8F75313492o22864M47540J047440O75507j035843j346207K32239K28882L20892
882.4F75261078n59845n71518l69415q5755o75125j557159J82495j984j76468n1803
892.1F71394501k86637k52990n99671k65274m69513j60751j61591l77807p10907k65656
$$ plain form
829.4 641297226 642522430 644929581 646505432 647757721 650482788 652426834 652712708 653021927 654541321
838.1 654541321 655572433 656635437 658009109 659232330 660513229 661681824 662704163 663464355 665102692
846.8 665102692 666352539 666944046 666898651 666614075 667266846 668076248 669904709 671771088 672487488
855.4 672487488 672391510 673793335 675836716 675607376 675662842 676563644 678205566 679501877 679631729
864.1 679631729 680121307 680922165 680954971 680342026 680576477 680254135 679547119 677864761 675891266 675313492
873.8 675313492 674690628 675138168 676185608 676861115 675825272 674479065 674711304 674940186 675261078
882.4 675261078 674701233 674129715 673760300 673674545 672999420 671442261 671624756 671622772 671446304 671394501
892.1 671394501 671107864 670854874 670255203 669989929 669520416 669359665 669198074 668820267 668109360 667843704
901.7F67843704k60238j240464O07910J317444Q28858R76410J114273J013717J49231
910.4F72350845m03137o31409M30146m86527r05304L95127n35584j051712j137390
919.1F68025055j145401j348114j724930j590423j631470k519303k547607j563187
926.8F53954620j116027m74854j219330j250305j275024k124939j286850p78122n10636
935.5F43918533n77774j58615n3940n10482r10950j318970j25275m76036j152458r99794
945.1F37634239p01065k8305m0970M26216K5177n67131j100578j303444q20846r50509
954.8F32572784q32672q92791p45583r62715j355438j553536j669083k047576k233544
963.4F20279846j222420j218071j176147j362801q67271N5313j584053k261658j525192
$$ plain form
901.7 667843704 667583466 666343002 666950912 668268356 669097214 670073624 671187897 672201614 672350845
910.4 672350845 671947708 671316299 671746445 671259918 670354614 670749741 670214157 669162445 668025055
919.1 668025055 666879654 665531540 663806610 662216187 660584717 658065414 655517807 653954620
926.8 653954620 652838593 652363739 651144409 649894104 648619080 646494141 645207291 644429169 643918533
935.5 643918533 643340759 643182144 643128204 642617722 641706772 640387802 640262527 639786491 638634033 637634239
945.1 637634239 636933174 636904869 636863899 637290115 637315292 636748161 635647583 634344139 633523293 632572784
954.8 632572784 631740112 630847321 630101738 629139023 627783585 626230049 624560966 622513390 620279846
963.4 620279846 619057426 617839355 616663208 615300407 614433136 614488449 612904396 610642738 609117546
972.1F09117546j566200k129402j631623j038360j478348k246361k653084k126922
979.8E94247246k813111l024253l125077l745842l262710k854653k748146l453941
987.6E69219513k863388k631607l879891k973938k215995l074913k941437k093582
995.3E46544762j851082k326508k731552j978073j911163k517319k052307j288223
1003E29888535j489830j665268n96276n62668j677856k489662j919518j139755j214943
1011.7E17132759j005478j623001j758308j370354j541786j534157j340523j758728
1019.4E05200424k357559k068443k147255j648407j237679j364403j918869j882705
1027.1D90575104n77126o60515n43289j091499j303902j238289j022911M04091L48320
$$ plain form
972.1 609117546 607551346 605421944 603790321 602751961 601273613 599027252 596374168 594247246
979.8 594247246 591434135 588409882 585284805 581538963 578276253 575421600 572673454 569219513
987.6 569219513 566356125 563724518 559844627 556870689 554654694 551579781 548638344 546544762
995.3 546544762 544693680 542367172 539635620 537657547 535746384 533229065 531176758 529888535
1003 529888535 528398705 526733437 526137161 525574493 523896637 521406975 519487457 518347702 517132759
1011.7 517132759 516127281 514504280 512745972 511375618 509833832 508299675 506959152 505200424
1019.4 505200424 502842865 500774422 498627167 496978760 495741081 494376678 492457809 490575104
1027.1 490575104 489997978 489337463 488794174 487702675 486398773 485160484 484137573 484541664 484889984
1035.8D84889984K88468L36151J632843Q91647K93579J656952N60150Q1062o08749
1044.5D90022087J010361J368332j098252j453323j663551p70760p50770j84479N8670
1053.1D86538315p46231r68895p99866q5678r53941K73208P52030N69458O62307J236916
1062.8D86477623L774948K619705R35288N36651J791726J925392N6724L32032P54966
1071.5D99205055J595536J376037P72019R92202O87447l27797j67999N39169k9526
1080.1E04642143N97344Q49113J443253R51004P74994J599311P2365M27704L99094
1088.8E11756325M08554J475715J364327P37724J030045J679878O14052J618194J098862
1097.5E21783676j65405L78876K08969J314544J685944J942863J151200J01738K70843
$$ plain form
1035.8 484889984 485178452 485514603 487147446 488039093 488332672 489989624 490549774 490630836 490022087
1044.5 490022087 491032448 492400780 491302528 489849205 488185654 487414894 486664124 486479645 486538315
1053.1 486538315 485792084 484823189 484023323 483937645 482983704 483256912 484008942 484578400 485240707 486477623
1062.8 486477623 490252571 492872276 493807564 494344215 496135941 498061333 498118057 498450089 499205055
1071.5 499205055 500800591 502176628 502948647 503940849 504628296 504300499 504132500 504671669 504642143
1080.1 504642143 505239487 506088600 507531853 508482857 509257851 510857162 510929527 511357231 511756325
1088.8 511756325 512164879 513640594 515004921 515742645 516772690 518452568 519066620 520684814 521783676
1097.5 521783676 521618271 521997147 522206116 523520660 525206604 527149467 528300667 528402405 528673248
1106.2E28673248K23580M94613N93682J014137L02505K98958J000939J397056J483002
1114.9E35481720L95508k35787r95330j70784L07960N1765K15378P8278J146965M85268
1124.5E36760941J60560N03464L61671P39060N56030O75926J091042K139015J802139
1133.2E44789848J353531J525460P74688P52411J217308J806717J942787J709748R05685
1141.9E56778183J88789L54882P60002N97191J98059P04689M14047R7656j9111J89323
1151.5E60263710Q69446j17111o95496o82640j58386j54686j008034n05943k15226
1160.2E57595634L28980m9706p42683k20032J64757J047402J645088J874847J635895
1168.9E63280182J578331J591682J532250J864090J744766J657333J868668K196579
$$ plain form
1106.2 528673248 528896828 529391441 529985123 530999260 531301765 531600723 532601662 533998718 535481720
1114.9 535481720 535877228 535641441 534646111 534475327 534783287 534835052 535050430 535128708 536275673 536760941
1124.5 536760941 536921501 537424965 537786636 538525696 539081726 539757652 540848694 542987709 544789848
1133.2 544789848 546143379 547668839 548443527 549195938 550413246 552219963 554162750 555872498 556778183
1141.9 556778183 556966972 557321854 558081856 558679047 558877106 559581795 559995842 560093498 560074387 560263710
1151.5 560263710 561133156 561016045 560320549 559637909 559479523 559324837 558316803 557810860 557595634
1160.2 557595634 557924614 557874908 557132225 556912193 557076950 558124352 559769440 561644287 563280182
1168.9 563280182 564858513 566450195 567982445 569846535 571591301 573248634 575117302 577313881
1176.6E77313881J767616J414223J960640J626892J498299K022285J650848J495247
1184.3E90749931Q75740N18685J266975R68056O12717M42504J38169l90511j28364
1193E95053902M82788K022K20146k00539q25806n63774n58281n76667j045647q89816
1202.6E91098328l37601m04511m24118o41250r12209o38313j42937m18739o57044l83987
1212.3E86137619p27577n94826n8975J72729K59018l36609n45539m28009n57099n35164
1221.9E82785568l00674O294n52978n37262K69012m5967o24352q73451r32274q97560
1231.5E78296356p85713m57115p9041K60773K50969N7907k71225p93800o28891k04506
1241.2E75645714j51062K38457K49557k56233l65524k63939k77825n65643m84009k18277
$$ plain form
1176.6 577313881 579081497 580495720 582456360 584083252 585581551 587603836 589254684 590749931
1184.3 590749931 591625671 592144356 593411331 594379387 594992104 595434608 595572777 595182266 595053902
1193 595053902 595536690 595538712 595758858 595558319 594732513 594168739 593610458 593033791 591988144 591098328
1202.6 591098328 590760727 590356216 589932098 589290848 588378639 587740326 587597389 587178650 586521606 586137619
1212.3 586137619 585410042 584815216 584756241 584928970 585187988 584851379 584305840 583877831 583320732 582785568
1221.9 582785568 582484894 582491188 581938210 581400948 581669960 581623993 580999641 580126190 579193916 578296356
1231.5 578296356 577510643 577053528 576974487 577235260 577486229 577544136 577272911 576479111 575850220 575645714
1241.2 575645714 575494652 575733109 575982666 575726433 575360909 575096970 574819145 574253502 573769493 573551216
1250.8E73551216k49328l1014L04565M20647L47519O7787n40123m32205K52190J28021
1260.5E73819275m730M32014L16925P9384M58221P02897J126213P04345k68669O6071
1270.1E77431946Q62732J237869Q76045R02672J003113Q68034Q01316K88581O36483
1278.8E84908791J326103J185913Q66623R79118J198387J256371J061020P78656P20749
1287.5E94281731O97212R42154J142387J138077O84547N32990P29561P20825O83250
1296.2F01552734L48435L41682K65198M90913L32375K42386N48553q5411J48010K78206
1305.8F04463081J94626l00445j027336l72925k289N38025K68822q51365o40373k26822
1315.4F02042999l18145k19613J61324O8130L39203P65610R59587R51348N63850N22575
$$ plain form
1250.8 573551216 573301888 573270874 573575439 573996086 574343605 574411392 573871269 573439064 573691254 573819275
1260.5 573819275 573814545 574246559 574563484 574642868 575101089 575803986 576930199 577634544 577365875 577431946
1270.1 577431946 578294678 579532547 580408592 581311264 582314377 583182411 583983727 584272308 584908791
1278.8 584908791 586234894 587420807 588287430 589266548 590464935 591721306 592782326 593560982 594281731
1287.5 594281731 594978943 595921097 597063484 598201561 598886108 599419098 600148659 600869484 601552734
1296.2 601552734 601901169 602242851 602508049 602998962 603331337 603573723 604122276 604036865 604184875 604463081
1305.8 604463081 604657707 604357262 603329926 602957001 602954712 603492737 603761559 602910194 602269821 602042999
1315.4 602042999 601724854 601505241 601666565 601734695 602073898 602839508 603799095 604750443 605314293 605836868
1325.1F05836868K64664r5291j48049r7923j65901K9144M3946p5036K5521m07753o35414
1335.7F04574776n31845Q0299Q8425k32392L07846N19677Q10318O24275N45654K23732
1345.3F07010765k62146L8643J43700L05976j82876J44806J02081n78079R3613K79007
1355F07095490j96076n80139l36266m15268k35672k20985l64990J60713p29790L59307
1364.6F04536324L09639n97954l69492r07860q59642l93219k9258o9695k48794m02680
1374.3F00967369J06163K56462m85344k4261j35002Q3046J04675n66788q40606j339188
1383.9E98126526o88629j44806N34j455574q65669R6244q38279o65856q36067p94487
1393.6E91933937j687927k559471j361847j196900j019439k335549l44887r841j467514
$$ plain form
1325.1 605836868 606101532 606006241 605858192 605760269 605594368 605623512 605667458 605592422 605617943 605210190 604574776
1335.7 604574776 604042931 604123230 604211655 603979263 604287109 604806786 605617104 606241379 606787033 607010765
1345.3 607010765 606748619 606787262 606930962 607236938 607054062 607198868 607300949 606722870 606816483 607095490
1355 607095490 606899414 606319275 605983009 605567741 605332069 605111084 604746094 604906807 604177017 604536324
1364.6 604536324 604845963 604248009 603878517 602970657 602111015 601717796 601688538 601618843 601370049 600967369
1374.3 600967369 601073532 601329994 600844650 600820389 600685387 600768433 600873108 600306320 599465714 598126526
1383.9 598126526 597437897 597293091 597293625 595838051 594972382 595068626 594230347 593564491 592728424 591933937
1393.6 591933937 590246010 587686539 586324692 585127792 584108353 581772804 581427917 581418076 579950562
1402.2E79950562j224061j350746k637977k171822q73146p84683o66275j115341j182404
1410.9E67944107m96788j313896j156731r26590q74443n47523k99454K68059k845803
1419.6E59750938J26076J418877J27449J39198p81174L61939Q97713J91612N03311
1428.3E62735939L77426M59023N40619J139831P33490N40047J608887J512870j13754
1437E69534378M14391K116508J247559N66024O22216N25245R61113K6513N93032J109047
1446.6E77716026K22512m0818J224976J487045N14870O44760P14226J199531J035958
1455.3E84719086K46315N2108J58196K159729J388130J832695R91631R97734J493225
1464E94038849n91202J713638K227517K105903J472435J120606J427459K22245Q11653
$$ plain form
1402.2 579950562 578726501 577375755 574737778 572565956 571692810 570908127 570241852 569126511 567944107
1410.9 567944107 567447319 566133423 564976692 564050102 563175659 562628136 562328682 562596741 559750938
1419.6 559750938 559877014 561295891 561423340 561562538 560781364 561143303 562041016 562232628 562735939
1428.3 562735939 563113365 563572388 564113007 565252838 565986328 566526375 568135262 569648132 569534378
1437 569534378 569948769 572065277 573312836 573878860 574501076 575026321 575987434 576013947 576606979 577716026
1446.6 577716026 577938538 577897720 579122696 580609741 581124611 581769371 582483597 583683128 584719086
1455.3 584719086 584965401 585017509 585175705 587335434 588723564 590556259 591547890 592545624 594038849
1464 594038849 593447647 595161285 597388802 599494705 600967140 602087746 603515205 603737450 604549103
1472.6F04549103J810455L373909L021774J556397J859283J869736R31816P92694P43294
1481.3F20508461Q54225J432419J106377Q65097J159057L99399l73115N84373q82034
1490F25654259j834107L77198Q18176k1134q0299M1542m051628M4670j010551k591706
1499.6F17346420L00713o79283o91033m50096O62575R9564o737862m675064J788254
1508.3F06964188K625694Q1978J045875k36702j591987M10690p50580j077156j999245
1517F05472755k005577J297989J113816j414719k039414Q13103J290703J621399o06728
1525.7F05543327N37339J213378k65388O69937J117516P92350M67759j2207j802102
1534.3F08261909J000252Q04253L81279J190872l017502j786728L636284K08512j268349
$$ plain form
1472.6 604549103 606359558 609733467 612755241 614311638 616170921 618040657 618972473 619765167 620508461
1481.3 620508461 621362686 622795105 623901482 624766579 625925636 626325035 625951920 626536293 625654259
1490 625654259 623820152 624197350 625015526 624994392 624914093 624955635 620904007 620948677 619938126 617346420
1499.6 617346420 617647133 616967850 616276817 615826721 616489296 616588860 609850998 605175934 606964188
1508.3 606964188 609589882 609671860 610717735 610481033 608889046 609299736 608549156 607472000 605472755
1517 605472755 603467178 604765167 605878983 604464264 602424850 603237953 604528656 606150055 605543327
1525.7 605543327 606080666 607294044 607028656 607698593 608816109 609608459 610076218 610064011 608261909
1534.3 608261909 609262161 610066414 610447693 611638565 608621063 606834335 610470619 610679131 609410782
1543F09410782K007141J444397r83849J021386M29802J061210p5378j275711J399269
1551.7F14439049Q21914L60756k405586J194801K015686k05879m738121l968506K933045
1560.4F10447159J522827J818428l92075r48791j812248j577339j30005r27697m45022
1569.1F07555237o132546m29229m80233k233162j370048k252617j754646q268166k31552
1577.7E84403038j203842k276650k109069l703232k504616m082260k740135l523636
1585.5E62259598l169861l061791l923110k546196m251099k064285l921929l052025
1593.2E36269302l169403m407615k221375l713570k232971l523445j992416l282700
1600.9E11725807l214454j789055l681984j471710k949028j432648k692681j466178
$$ plain form
1543 609410782 611417923 612862320 611878471 612899857 613329659 614390869 614315491 613039780 614439049
1551.7 614439049 615260963 615621719 613216133 614410934 616426620 616220741 611482620 607514114 610447159
1560.4 610447159 611969986 613788414 613396339 612447548 610635300 609057961 608927956 608000259 607555237
1569.1 607555237 601422691 600993462 600513229 598280067 596910019 594657402 592902756 584634590 584403038
1577.7 584403038 583199196 580922546 578813477 575110245 572605629 568523369 565783234 562259598
1585.5 562259598 559089737 556027946 552104836 549558640 545307541 543243256 539321327 536269302
1593.2 536269302 533099899 528692284 526470909 522757339 520524368 517000923 515008507 511725807
1600.9 511725807 508511353 506722298 503040314 501568604 498619576 497186928 494494247 493028069
1608.6D93028069j718064l025398m04968k915268n86396j656837P9575j197739o655731
1617.3D74947243K656402q70895K49023j271667Q78296m93584l097000J288185r1667
1626D74194336J857948j676941L84980R41162O12335P21283j15585K254943O92482
1634.6D79866943M55590j283188K443237J048546Q26836K193374N12963K385673P96127
1643.3D89246101K305909K186851o91376J148186l04603L236656J406669L185425K302590
1652E04022408k657166Q24623J504250L868103J534385J871910J029931K130851K047348
1660.7E16176643J388054K231102Q76007L333474J789779K443581K625580J818123
1668.4E32682343J145401J552505M177399J548118L669052L823700K118454Q94966
$$ plain form
1608.6 493028069 491310005 488284607 487879639 484964371 484377975 482721138 482800713 481602974 474947243
1617.3 474947243 477603645 476732750 476981773 475710106 476588402 476094818 472997818 474286003 474194336
1626 474194336 476052284 474375343 474760323 475701485 476313820 477035103 476919518 479174461 479866943
1634.6 479866943 480322533 479039345 481482582 482531128 483357964 485551338 486064301 488449974 489246101
1643.3 489246101 491552010 493738861 493047485 494195671 493891068 497127724 498534393 501719818 504022408
1652 504022408 501365242 502189865 503694115 507562218 509096603 510968513 511998444 514129295 516176643
1660.7 516176643 517564697 519795799 520671806 524005280 525795059 528238640 530864220 532682343
1668.4 532682343 533827744 535380249 539557648 541105766 544774818 548598518 550716972 551611938
1676.1E51611938K824898L872338K570686L572922J882934L239975M707070K088470
1683.8E76371231O98700K163162M875565L433304K951736L344078K638321L284187
1691.5E99760284L163643L363610L820495L705292j083221L531951M903183N116768
1699.3F26282005K149506k340164O054954M041214K742424K082939K463761J289978
1707F44766617K012710K763749J442337J809539K123719J826629J658631j49460k78855
1715.6F57975616K666398J656417l304519L504333L021012J673202J472473R21097
1723.4F69586029O7215O94656J349411O94657Q61053J420975l91235M577K872544K931594
1733F80091476k360000l575211M407349L565750J487274K018433K59857j216507L162842
$$ plain form
1676.1 551611938 554436836 558309174 560879860 564452782 566335716 569575691 574282761 576371231
1683.8 576371231 577069931 579233093 584108658 587541962 590493698 593837776 596476097 599760284
1691.5 599760284 602923927 606287537 610108032 613813324 612730103 616262054 621165237 626282005
1699.3 626282005 628431511 626091347 632146301 636187515 638929939 641012878 643476639 644766617
1707 644766617 646779327 649543076 650985413 652794952 654918671 656745300 658403931 658254471 657975616
1715.6 657975616 660642014 662298431 658993912 662498245 665519257 667192459 668664932 669586029
1723.4 669586029 669653244 670347900 671697311 672391968 673253021 674673996 674282761 674287338 677159882 680091476
1733 680091476 677731476 674156265 678563614 682129364 683616638 685635071 685894928 684678421 687841263
1741.7F87841263K067718j92794O73294K363510K153702J551742J016464N06211L552093
1750.4G01533203Q94089M1809L426208K258988K224884K088165m30298R71146K353897
1759G15362091J919022K331237j465835j257553K405929J588440J546707J668931J386337
1767.7G25485306j744690Q68225L270187K12326k564468q80432L668213K033462m89197
1776.4G29858932J567154M72565M86450q4610n85022O61316J343842J730423j64414
1785.1G35286636J7701J218566Q69065J19781N53971k76642k24304p89719m59442L123855
1794.7G39439468J303711l89404Q88901J180877k99453j520233J741638m0741J76239
1803.4G42481003J733322M75693N11093K39868K23694L99475Q4305j507797K16751
$$ plain form
1741.7 687841263 689908981 689716187 690389481 692752991 694906693 696458435 697474899 697981110 701533203
1750.4 701533203 702427292 702469101 705895309 708154297 710379181 712467346 712037048 713008194 715362091
1759 715362091 717281113 719612350 718146515 716888962 719294891 720883331 722430038 724098969 725485306
1767.7 725485306 723740616 724608841 727879028 728091354 725526886 724646454 728314667 730348129 729858932
1776.4 729858932 731426086 731898651 732385101 732300491 731715469 732376785 733720627 735451050 735286636
1785.1 735286636 735304337 736522903 737391968 737511749 738065720 737789078 737564774 736775055 736315613 739439468
1794.7 739439468 740743179 740353775 741242676 742423553 742124100 740603867 742345505 742304764 742481003
1803.4 742481003 744214325 744690018 745201111 745440979 745664673 746064148 746148453 744640656 744857407
1812.1G44857407J421127P34940J084823M32892N19791n14679l0747L44010k91138
1820.8G48558426R43298j30768P31507R70001j575699L46909J344452J058578m93622
1829.4G51753082l200073M63562K144928N23148M34875O87714N72967K40479j105347
1838.1G52515335L24326J22146J05133L44849J236877J408921l623658J392060J717529
1846.8G55543518o80923q36335l7155O72226J97601N14908K36283N42297J55487n7602
1856.4G56250305M37851n48859k9754K21786M61502J93634J96534J85012o9885L50647
1866.1G57648773p96051L5477o60706q97751J235733J218110P74459j57013J99051
1874.8G58600082J4573j44806m24729k34146J59683m18853O52923L46375L26233L37982
$$ plain form
1812.1 744857407 746278534 747013474 748098297 748531189 749050980 748536301 748505554 748849564 748558426
1820.8 748558426 749501724 749370956 750102463 751072464 749496765 749843674 751188126 752246704 751753082
1829.4 751753082 748553009 749016571 751161499 751684647 752119522 752807236 753380203 753620682 752515335
1838.1 752515335 752839661 752961807 753066940 753411789 754648666 756057587 752433929 753825989 755543518
1846.8 755543518 754862595 754026260 753989105 754661331 754858932 755373840 755610123 756152420 756307907 756250305
1856.4 756250305 756688156 756139297 756109543 756331329 756792831 756986465 757182999 757368011 757298126 757648773
1866.1 757648773 756852722 756888199 756227493 755329742 756565475 757783585 758558044 758401031 758600082
1874.8 758600082 758614655 758469849 758045120 757810974 757970657 757551804 758204727 758551102 758877335 759215317
1884.4G59215317j32599N0964n56259M79584J64261j206436K58941J005860K80761
1893.1G59560394q621k10342p91016L17535L84217M88357J81122k58713K5330Q7585
1902.7G59775848M07257m81567k2125P3089k94876K07978n0354K4643L662O57043j3733
1913.3G60286865j54648l8757N035J033402j375122q18405J061554R69543N92117j208572
1923G60353012j009293L18223M99267j38245J39390J67007K32696K20490o13556q8425
1932.6G60080566l30963j58996m8828R155M32434J34964M02222K5329N79071m50668
1942.3G60674286j843414N31005M65546m04739k63520M18549L95966K05993j56860
1951G60022812k37961K15073n7831k11182p83996p7896M46853K2125K61307K9831K52457
$$ plain form
1884.4 759215317 759082718 759133682 758577423 759057007 759221268 758014832 758273773 759279633 759560394
1893.1 759560394 759551773 759341431 758550415 758867950 759252167 759740524 759921646 759662933 759688263 759775848
1902.7 759775848 760183105 759701538 759679413 759752502 759457626 759665604 759615250 759639893 759643555 760300598 760286865
1913.3 760286865 760132217 760093460 760098495 761131897 759756775 758938370 759999924 760969467 761561584 760353012
1923 760353012 759343719 759661942 760161209 760022964 760162354 760329361 760562057 760782547 760168991 760080566
1932.6 760080566 759749603 759590607 759541779 759550934 759983368 760118332 760520554 760545883 761124954 760674286
1942.3 760674286 758830872 759361877 759827423 759422684 759159164 759577713 759973679 760179672 760022812
1951 760022812 759784851 759999924 759942093 759730911 758946915 758869019 759315872 759337997 759599304 759629135 759881592
1961.6G59881592k03095n78155k70386j22528J04370k90298k7390N73273L16086k00959
1971.2G59182510j59073k59780p3090R5825q3084K0294j69983J39161P476j28097k05536
1981.8G58366623m24576o9809m9438L88260K37960J19629j41449m94842J60980l82996
1991.5G57710342r56955p7362N05143L4866J08871L22113J65635M26864m99344l27301
2001.1G57412872K6932l69034j40991m3564R4528j22299r3994o4773J4343l71704l89099
2011.7G55953217L5247l60183L39965O88172J0834o59638j03760R9106n46264q8959
2021.3G55367737p4082J74103j03836k80228M6311J8768L78037j12534J3886k31629
2031G55196533l80096m4632l7079M07791j75247k80762k71149j86386J52741K44751
$$ plain form
1961.6 759881592 759678497 759100342 758829956 758707428 758811798 758521500 758494110 759067383 759383469 759182510
1971.2 759182510 759023437 758763657 758690567 758786392 758703308 758723602 758553619 758692780 758700256 758572159 758366623
1981.8 758366623 757942047 757872238 757822800 758211060 758449020 758568649 758427200 757932358 758093338 757710342
1991.5 757710342 756753387 756676025 757181168 757216034 757324905 757647018 757812653 758239517 757740173 757412872
2001.1 757412872 757439804 757070770 756929779 756886215 756980743 756858444 756764450 756699677 756714020 756342316 755953217
2011.7 755953217 755988464 755628281 755968246 756656418 756667252 756007614 755903854 756002960 755456696 755367737
2021.3 755367737 755293655 755467758 755363922 755083694 755130005 755148773 755526810 755414276 755428162 755196533
2031 755196533 754816437 754771805 754734726 755142517 754967270 754686508 754415359 754228973 754381714 754626465
2040.6G54626465k16065q76388K38571M09317J20773j2893j85547r918l92380j86768
2050.3G53515167j45035j9455k44293J03913M40902k11105l7689l34625j58539j32752
2059.9G52776489k20794J29242K72445N58853j67083n22995j66169K36664N5237L3035
2069.6G52984924r5825o01044K63138L74451J02081k56576k55661j16654m14810J69449
2079.2G52153473J2665J28479L4408j62048J39847M4784J068l53851r1705k43988j23368
2089.8G51539764K25907J96228J22909l20663P7515j96991k61689j67999k3727K6703
2099.5G51217957n31159M09927L82233j37253j50604j09863p1182n12925j93786m5853
2109.1G50257492K27890L72315K05688j42288m11606n7449N0201j17798m99725O4392
$$ plain form
2040.6 754626465 754410400 753534012 753772583 754181900 754302673 754289780 754104233 754094315 753701935 753515167
2050.3 753515167 753370132 753350677 753106384 753210297 753651199 753440094 753402405 753067780 752909241 752776489
2059.9 752776489 752555695 752684937 752957382 753516235 753349152 752826157 752659988 752896652 752951889 752984924
2069.6 752984924 752889099 752288055 752551193 752925644 753027725 752771149 752515488 752398834 751984024 752153473
2079.2 752153473 752166138 752294617 752329025 752166977 752306824 752351608 752352676 751998825 751907120 751663132 751539764
2089.8 751539764 751765671 751961899 752084808 751764145 751841660 751644669 751382980 751214981 751191254 751217957
2099.5 751217957 750686798 751096725 751478958 751341705 751191101 751081238 751010056 750497131 750303345 750257492
2109.1 750257492 750485382 750857697 751063385 750921097 750509491 750452042 750502243 750384445 749884720 749949112
2118.7G49949112J72577J45569M03061Q1100k1133n58777r1095q5068j81503M5318
2128.4G49859161M502N41229k57950j00098J92261j96380l09678l80859K0752m3182
2138G49329758M92172P2098M9972N06745j04752j10245l10745J9455K6398l739M8447
2148.6G50015564j09711J88599P2937M6616j82267n6686l36838l97949J6708J19553
2158.3G49376526M58145K33536K33230k89459j44729J15356j27792J53732l10898J81503
2167.9G49879150K50016J32522K59629o1036K1897l18299k43835k77634J97296M92859
2177.6G50332565L22190J56097k68402k6932m43344j11999K55508j03073j20011J02540
2187.2G50095139L63693J2588K29264r8954j47705M7913J2665K20413j44959K15302
$$ plain form
2118.7 749949112 750121689 750267258 750670319 750751419 750730286 750171509 750080414 749995346 749813843 749859161
2128.4 749859161 749863663 750404892 750146942 750046844 750239105 750042725 749733047 749352188 749372940 749329758
2138 749329758 749821930 749894028 749944000 750450745 750345993 750235748 749925003 749944458 749970856 749967117 750015564
2148.6 750015564 749905853 750094452 750167389 750214005 750031738 749975052 749638214 749240265 749256973 749376526
2158.3 749376526 749834671 750068207 750301437 750011978 749867249 749982605 749854813 750008545 749697647 749879150
2167.9 749879150 750129166 750261688 750521317 750460281 750482178 750163879 749920044 749642410 749839706 750332565
2177.6 750332565 750654755 750810852 750542450 750515518 750072174 749960175 750215683 750112610 749992599 750095139
2187.2 750095139 750458832 750471420 750700684 750601730 750454025 750501938 750514603 750735016 750590057 750805359
2196.9G50805359p324N4855O2485k59171j94778l82462M23813J15357n7602K84805
2206.5G50845337K72827J48315l09982L10059O0882m12216l63846P2937J79825n6076
2216.1G50748062M39835m1657j21612j76697j06354K37732n5466j70745N4321Q28247
2225.8G51635666Q2474l35999p7591m48761j56479P8812J90811o4316J62583M8065
2235.4G51115265j57700P2403r6664O0196p0954n5084l30887k09350K25219L95051
2245.1G50947495J27792l56522L90320j71814l64609K03095n7831j13220k16217L88489
2254.7G50776978L73916J14975k64664k44827N4856j49308K06070j21002o8970k27585
2264.4G50450439j11618M5014j55411O74896K29798l32032o21719J40457O46973l05405
$$ plain form
2196.9 750805359 750798035 750852890 750915375 750656204 750461426 750078964 750502777 750618134 750560532 750845337
2206.5 750845337 751118164 751266479 750956497 751266556 751327438 750915222 750551376 750624313 750804138 750748062
2216.1 750748062 751187897 751146240 751024628 750847931 750741577 750979309 750923843 750753098 750807419 751635666
2225.8 751635666 751718140 751382141 751304550 750855789 750699310 750778122 750968933 750904617 751067200 751115265
2235.4 751115265 750957565 751029968 750933304 750993500 750922546 750867462 750536575 750327225 750552444 750947495
2245.1 750947495 751075287 750718765 751109085 750937271 750572662 750775757 750717926 750604706 750388489 750776978
2254.7 750776978 751150894 751265869 751001205 750756378 750811234 750661926 750867996 750746994 750678024 750450439
2264.4 750450439 750338821 750383835 750228424 750903320 751133118 750801086 750179367 750319824 750966797 750661392
2274G50661392j31225J67007L84750n5618j02081l97644n27954J83563j75476Q8272
2283.7G50094986j23901J00097J40991k79846K40708j7624O5384k81372k63062p7743
2293.3G49598618K72598M86145m41284M6768J38016P1792j23977l53470N1193O3019
2302.9G49809418O2942n26123M06342Q11844K19802n1956o82373m38537m60663N80444
2312.6G49731140O13098k98767k67410j01624P12357M64477j22070n27572N53817K13776
2322.2G50971222j043701M97665K52991K55966j04980j017914J29547N27344j41220
2330.9G50326920m76914K66495j38703n11322J21537J29547J76010L65295J4191m96597
2340.6G49776459m55704m68597k72217R4223N22003j67084r16061k87628Q11615J515731
$$ plain form
2274 750661392 750530167 750697174 751081924 751026306 750924225 750526581 749998627 750182190 750006714 750094986
2283.7 750094986 749971085 750071182 750212173 749932327 750173035 750155411 750220795 749939423 749676361 749598618
2293.3 749598618 749871216 750357361 749916077 749962845 750100861 750172653 750048676 749695206 749746399 749809418
2302.9 749809418 749872360 749346237 749752579 750564423 750784225 750732269 750049896 749611359 749150696 749731140
2312.6 749731140 750344238 750045471 749778061 749676437 750388794 750853271 750731201 750203629 750757446 750971222
2322.2 750971222 749927521 750425186 750678177 750934143 750829163 749811249 749940796 750468140 750326920
2330.9 750326920 749850006 750116501 749977798 749466476 749588013 749717560 749893570 750258865 750273056 749776459
2340.6 749776459 749320755 748852158 748579941 748674164 749196167 749029083 748113022 747825394 748637009 750152740
2350.2G50152740N94101k71453o85807K28653Q87451k77099R32617K27127j293945
2358.9G50494385j998825n80368M00695k07901P82700p83386J36184R32999j54800
2367.6G49021683o12793p41196j52054p85446l53470o17294m38995N62896R3994m32510
2377.2G45544815n92728j97296l88565l15094L75290N85938l17612j067429l35006
2385.9G43292313l9826L03879L86429j30158o8741p5531l10592m53339l23410l19443
2395.5G42261581L01209L54385m70123k89230J00631o332m66614l09982j88828p3471
2405.2G41213226J2589k85721j26266k16446M54559M52194n05447o25305l46833J40992
2414.8G40167542j28098n9662J29852N4703O4774j58463r5138m84772p36084m18549
$$ plain form
2350.2 750152740 750746841 750475388 749789581 750018234 750905685 750628586 751561203 751788330 750494385
2358.9 750494385 748495560 747915192 748315887 748107986 748890686 748107300 748243484 749176483 749021683
2367.6 749021683 748408890 747667694 747515640 746730194 746376724 745759430 745320435 745883331 745977325 745544815
2377.2 745544815 744952087 744754791 744366226 744051132 744426422 745012360 744694748 743627319 743292313
2385.9 743292313 743252487 743556366 743942795 743812637 743743896 743668365 743357773 742904434 742581024 742261581
2395.5 742261581 742562790 742917175 742447052 742157822 742258453 742252121 741785507 741475525 741286697 741213226
2405.2 741213226 741225815 740940094 740813828 740597382 741051941 741504135 740998688 740373383 740026550 740167542
2414.8 740167542 740039444 739979782 740109634 740164337 740229111 740070648 739975510 739490738 738754654 738336105
2424.5G38336105K6627o867m7302Q7662J42822K94724l99399o14929n15824j94625
2434.1G37108994J08871j48239K91138R3231m43344n56031k1057J11161l65525r9792
2443.7G36079407j75324k56729k81067P9346R3307j15509n6610n93414l22571l61023
2453.4G34089813k93808j2893j25046O9656k11029j55487K08740L06931m89350o10199
2463G32777328k08969m63256m9820M6615J00556j46943j95388j94550o46820m29535
2472.7G30589218l33099m6845j61667P1183J46866j86310p5760m64478j81045l10517
2482.3G29047546l97186m82483k77633M44107l67585k41928k4490m01840l13340j74789
2492G26810379o5384m26178k99835j68305p3547J1292J62887j43127n54962j74408
$$ plain form
2424.5 738336105 738362732 738355865 738308563 738396225 738539047 738833771 738434372 737819443 737303619 737108994
2434.1 737108994 737217865 737069626 737360764 737453995 737010651 736454620 736433563 736544724 736179199 736079407
2443.7 736079407 735904083 735647354 735366287 735445633 735538940 735423431 735366821 734773407 734450836 734089813
2453.4 734089813 733796005 733783112 733658066 733727722 733516693 733361206 733569946 733876877 733387527 732777328
2463 732777328 732568359 732105103 732055283 732101898 732202454 732055511 731860123 731665573 731018753 730589218
2472.7 730589218 730256119 730209274 730047607 730118790 730265656 730079346 730003586 729539108 729358063 729047546
2482.3 729047546 728650360 728167877 727890244 728334351 727966766 727724838 727700348 727298508 726985168 726810379
2492 726810379 726744995 726318817 726018982 725850677 725777130 725788422 725951309 725808182 725253220 725078812
2501.6G25078812l25165k61612l44238j68229J15738n1193k98767q59680j55869K01416
2511.2G22931213J0376l96194p85065l51944k94952J86081J64337j81580l72467l44391
2520.9G20565414l7460m9133J86691j54953J7853j62506o74057m91257m77295K442
2530.5G18725739k53296k26136Q3390q6975k71607l84521J00097j51977l05634l60031
2540.2G16869049j46332K45285m05426m68673j36643J7014m22211o11877K5024J4496
2549.8G14979706j3886J70441p1869l66287j63345k10724m81186l95050l39203j14823
2559.5G12993774L4714j39618j91040k79846n65643j06278j2054n04303j14060J79444
2569.1G11295090J68075j70059l50189k80380l26004l73841n01938Q3695j70517n46112
$$ plain form
2501.6 725078812 724753647 724492035 724147797 723979568 724095306 724044113 723745346 722885666 722729797 722931213
2511.2 722931213 722941589 722545395 721760330 721408386 721113434 721299515 721463852 721282272 720909805 720565414
2520.9 720565414 720527954 720478821 720665512 720510559 720528412 720365906 719691849 719200592 718723297 718725739
2530.5 718725739 718472443 718246307 718329697 718242722 717971115 717586594 717686691 717534714 717229080 716869049
2540.2 716869049 716722717 716968002 716562576 716093903 715957260 715974274 715552063 714940186 714965210 714979706
2549.8 714979706 714965820 715136261 715064392 714698105 714534760 714324036 713842850 713447800 713108597 712993774
2559.5 712993774 713028488 712888870 712697830 712417984 711852341 711746063 711734009 711229706 711115646 711295090
2569.1 711295090 711463165 711293106 710942917 710662537 710336533 709962692 709460754 709544449 709373932 708827820
2578.7G08827820J21002n341k16522Q4076n8594n93643n82657k62909J27640o6223
2588.4G07374649k97394Q2398l79868k58865J65634j97983l92532l25241l46756l16086
2598G05107956P3547l79486j95160K67411k48566m4174m1199n09110q58230m59137
2607.7G02713852J26343K27508J73874k68173m26560m79583l10822k82898m76227n77163
2617.3G00420151k97776J54877j62048j24817k86179j38397K03247j73645j93634n58243
2627F98843536m41894L1509J09558k03933l62015j67465n24598m23355l38440l86962
2636.6F96135941l78113k37503j26877k66647o9657k13394M578l38211m58069p5836
2646.3F93976212m47312j00937m48532l89175K81601q4381k64512r1705p6523n89447
$$ plain form
2578.7 708827820 708948822 708943481 708726959 708811035 708752441 708158798 707576141 707313232 707440872 707374649
2588.4 707374649 707077255 707159653 706779785 706520920 706686554 706488571 706096039 705770798 705424042 705107956
2598 705107956 705181503 704802017 704606857 704874268 704625702 704581528 704540329 704031219 703172989 702713852
2607.7 702713852 702840195 703067703 703241577 702973404 702546844 702067261 701756439 701473541 700997314 700420151
2617.3 700420151 700122375 700277252 700115204 699990387 699704208 699565811 699769058 699595413 699401779 698843536
2627 698843536 698401642 698433151 698542709 698338776 697976761 697809296 697284698 696861343 696522903 696135941
2636.6 696135941 695757828 695520325 695393448 695126801 695057144 694843750 694848328 694510117 694052048 693976212
2646.3 693976212 693528900 693427963 692979431 692590256 692871857 692787476 692522964 692431259 692354736 691765289
2655.9F91765289l72162R0561p1487j64261m0741m15649p69730k07977m25797j82953
2665.5F89205093L67813L0594k70767m18777q4076k79389k58941k99378m56543p9574
2675.2F87456055j02768r3842j60980K37198o9504m15420p5837n89599n05142k60849
2684.8F85419312r7352O0883j96762l93066l55454j98364k59552j21002q0414J7090
2694.5F83795319l40043j77001L88717k65045k75269m10461p09228k69318l9749j40915
2704.1F81557007j69983o5994j84555K70309L3112n22004m62188l26615O0425l15094
2713.8F79874420j84021R4605j43891j44653k97165l88946l08762J60599k57874o81686
2723.4F77722626j97296n8136P9574K17133r1782o25687l97109k78702l39661k33993
$$ plain form
2655.9 691765289 691393127 691483688 691412201 691247940 691207199 690791550 690021820 689813843 689388046 689205093
2665.5 689205093 689572906 689603500 689332733 688913956 688829880 688550491 688291550 687992172 687535629 687456055
2675.2 687456055 687353287 687259445 687098465 687335663 687266159 686850739 686774902 686185303 685680161 685419312
2684.8 685419312 685321960 685382843 685186081 684793015 684437561 684239197 683979645 683858643 683778229 683795319
2694.5 683795319 683455276 683278275 683666992 683401947 683126678 682716217 682006989 681737671 681697922 681557007
2704.1 681557007 681387024 681321030 681136475 681406784 681439896 680917892 680455704 680129089 680189514 679874420
2713.8 679874420 679690399 679785004 679641113 679496460 679199295 678810349 678501587 678662186 678404312 677722626
2723.4 677722626 677525330 677467194 677546768 677763901 677672119 677046432 676649323 676370621 676030960 675796967
2733F75796967k35749L27072L22037J20011j32828l30200j85013n12162l37905m6769
2742.7F74785461J07651K78549j13906l14789J78528K59704k14386o86874r05075m9744
2752.3F73325119L44009J40229r1324l87345J42746o637m34265l89633k01111N5771
2762F72497559k14463l46756j4190J31225k76489l10822k76947j35498j20315n35660
2771.6F70397644j1444q2245l60260j25580l9596r919m98428m89120n35202k99988
2781.3F67945862K03552j67465j28021R15l77502n07889l14636k46125o7291j7547
2790.9F66323853l70713q21609n52979L06092r6512n23529n01175m98505Q850j21689
2800.5F63152084m34723n72357n29251j43432j54038n79834n39093k27280l98483m30069
$$ plain form
2733 675796967 675561218 675888290 676210327 676330338 676197510 675867310 675682297 675170135 674832230 674785461
2742.7 674785461 674893112 675171661 675057755 674742966 674921494 675181198 674966812 674279938 673374863 673325119
2752.3 673325119 673669128 673809357 673718033 673330688 673473434 673466797 673032532 672642899 672441788 672497559
2762 672497559 672283096 671936340 671922150 672053375 671776886 671466064 671189117 671053619 670933304 670397644
2771.6 670397644 670386200 670303955 669943695 669818115 669778519 669768600 669270172 668781052 668245850 667945862
2781.3 667945862 668149414 667981949 667853928 667854843 667477341 666969452 666654816 666408691 666341400 666323853
2790.9 666323853 665953140 665131531 664578552 664884644 664788132 664264603 663763428 663264923 663273773 663152084
2800.5 663152084 662717361 662145004 661615753 661472321 661318283 660738449 660199356 659972076 659573593 659143524
2810.2F59143524k76031j26038n91965p12738j86462m89578m71802l49960l45002m13742
2819.8F55180206m01306j90811q59146o91376L891k12326o26907n18494k15683o44073
2829.5F50823975p23572m66385n85861n00412n22309q00094l95813k13089p68891r06829
2839.1F44940720j217728j333084j066590r83886j134720j135559q53234j281700j583023
2847.8F34351196j809501j876030j411743q85506m26521q23632p72819K0714O65855
2856.5F27032013M20074j95770k56271m62494p1716K14805J31378l36914n71480l11698
2866.1F25591927q88901n67970k52991k34604k27928p31316l31116k44751l90472o05507
2875.8F21116371o48880k28653k67219k99569m47845m53186m07791n49507p29790m49104
$$ plain form
2810.2 659143524 658867493 658741455 658149490 657436752 657250290 656760712 656288910 655938950 655593948 655180206
2819.8 655180206 654778900 654588089 653728943 653037567 653041458 652829132 652202225 651683731 651468048 650823975
2829.5 650823975 650100403 649634018 649048157 648547745 648025436 647225342 646829529 646616440 645847549 644940720
2839.1 644940720 643722992 642389908 641323318 640339432 639204712 638069153 637215919 635934219 634351196
2847.8 634351196 632541695 630665665 629253922 628368416 627941895 627118263 626345444 626366158 627032013
2856.5 627032013 627452087 627256317 627000046 626537552 626465836 626680641 626812019 626475105 625903625 625591927
2866.1 625591927 624703026 624135056 623882065 623647461 623419533 622688217 622357101 622112350 621721878 621116371
2875.8 621116371 620467491 620238838 619971619 619672050 619224205 618771019 618363228 617813721 617083931 616634827
2885.4F16634827j36071n58815p23991p99026m63791l11013q62960p02363l04908m87061
2895.1F11284828r80186q17414k82821o13480j106796n99747k63748k13928j80397
2903.7F06226311r82094q73528o16989o54678k00386o37283q27675o42128q53844j404533
2913.4E98533173j395493o24924q01277j284103j231270j051254j399002j427994o46057
2922.1E88671799m50554l36495K8077M01344L79677j42975j47324O7597K19421M02870
2931.7E89093437n2261j69029Q13484R26361J6937m9400Q24737J037751M43039K6016
2941.3E92911072J79558R67102Q71544K61611K15989L74221M65851J96076K11525O1378
2951E96715927J69716J51176k89726K00920L81699L07693M97475O25076L01285K8458
$$ plain form
2885.4 616634827 616498756 615939941 615215950 614416924 613953133 613642120 612779160 612076797 611771889 611284828
2895.1 611284828 610304642 609487228 609204407 608590927 607484131 606884384 606620636 606406708 606226311
2903.7 606226311 605244217 604370689 603753700 603099022 602898636 602261353 601433678 600791550 599937706 598533173
2913.4 598533173 597137680 596512756 595711479 594427376 593196106 592144852 590745850 589317856 588671799
2922.1 588671799 588221245 587884750 587912827 588314171 588693848 588550873 588403549 588471146 588690567 589093437
2931.7 589093437 589041176 588872147 589685631 590611992 590628929 590579529 591404266 592442017 592885056 592911072
2941.3 592911072 593090630 594057732 594929276 595190887 595406876 595781097 596246948 596443024 596654549 596715927
2951 596715927 596885643 597036819 596747093 596948013 597329712 597637405 598134880 598759956 599061241 599089699
2960.6E99089699J29013Q5487L43857K33879M04778N13343O28090P95632K48756O16226
2970.3F03088760N15862P019k5063J86501N34477O35414J050148N30167M2648j90544
2979.9F06375389k45972K99454K25220J77917k8457J81007K37236P7286K50244K08588
2989.6F07757912L37562o9122r2850l76930l46718M13399J78490M3106l42789l22228
2999.2F07179832j24244m03290m56429j85852K31324n05066o34156K7085K0790j39427
3008.8F05010567o50406p20177J8463p4119o74019k32239j63841l58849m45976p27768
3018.5F00981636m57573m58984o32363p76405l21426K51884J58463m07029j042480
3027.2E97295723m58412j66817l99589p71218p19604j6709n54619p68318m61883n48668
$$ plain form
2960.6 599089699 599218712 599304199 599648056 599881935 600286713 600800056 601428146 602223778 602472534 603088760
2970.3 603088760 603604622 603611641 603586578 603773079 604307556 604942970 605993118 606523285 606565933 606375389
2979.9 606375389 606129417 606428871 606654091 606832008 606803551 606984558 607221794 607299080 607549324 607757912
2989.6 607757912 608095474 608026352 607933502 607556572 607209854 607623253 607801743 607844849 607502060 607179832
2999.2 607179832 607055588 606652298 606195869 606010017 606241341 605736275 605102119 605129204 605149994 605010567
3008.8 605010567 604360161 603639984 603658447 603584328 602910309 602678070 602514229 602155380 601709404 600981636
3018.5 600981636 600524063 600065079 599432716 598656311 598334885 598586769 598745232 598338203 597295723
3027.2 597295723 596837311 596670494 596270905 595499687 594780083 594763374 594208755 593440437 592978554 592429886
3036.8E92429886p24526n32074k01416o38732o47812m18702n35888m05236k48260o31180
3046.5E87446060n56145k62832n71480o56967r29566o06460o44074o14700J43166k81449
3056.1E82465553l91350m40559n49927p74612j011963m67300o1379j40991q79517l00789
3065.7E77447166r2659n98907n26657j193695p24564k60048m71916o00891o66275k24800
3075.4E72086754J84669R5711o05621m39568l77540m95873p55234p74536J86424l62358
3085E68742828j019172q91877n4016J68000n16625l68156p17850m20456m52499p32842
3094.7E63737335m81376p80068m13818k28310l02811n92804m92820p24983j012497
3103.4E58707848q3924m2305k21252o53114r80073o57730k71873L9062m22287n83038
$$ plain form
3036.8 592429886 591705360 591173286 590971870 590333138 589685326 589266624 588730736 588325500 588077240 587446060
3046.5 587446060 586889915 586627083 586055603 585398636 584469070 583862610 583218536 582603836 582747002 582465553
3056.1 582465553 582074203 581633644 581083717 580309105 579297142 578829842 578768463 578627472 577747955 577447166
3065.7 577447166 577354507 576755600 576228943 575035248 574310684 574050636 573578720 572977829 572311554 572086754
3075.4 572086754 572271423 572367134 571761513 571321945 570944405 570448532 569693298 568918762 569105186 568742828
3085 568742828 567723656 566831779 566777763 566945763 566429138 566060982 565343132 564922676 564470177 563737335
3094.7 563737335 563255959 562475891 562062073 561833763 561530952 560938148 560445328 559720345 558707848
3103.4 558707848 558623924 558581619 558360367 557707253 556727180 556069450 555797577 555836639 555414352 554831314
3113E54831314p16324o43959n60303m82711l29247p90558n70030m01459j89285k53792
3122.6E49893646j084289r85794n45235n12619m17061l66135q00437n90439j62468
3131.3E44429169n02434j390801j116676K09007j05552l09487n24597p63969m28849
3140E39495811r34639p25402o46439p96356p10449n84450n41840q67576l19214j42937
3149.6E33226509k67982m46968q79632q49876o52199q28361q17032L7193n57823j110115
3159.3E26853714q46176o94351j05515o51893r53751j030350j024055m97361q8119
3168E20962143M9858n67894n49469o49223n69001o30836j073341o06499n29976k91977
3177.6E15543785p45354r70878m09088q07915j040459q77456l49274m97666q34007
$$ plain form
3113 554831314 554114990 553471031 552910728 552428017 552098770 551308212 550738182 550336723 550147438 549893646
3122.6 549893646 548809357 547823563 547278328 546765709 546348648 545982513 545182076 544591637 544429169
3131.3 544429169 543926735 542535934 541419258 541628265 541522713 541213226 540688629 539924660 539495811
3140 539495811 538561172 537835770 537189331 536392975 535682526 535098076 534556236 533688660 533369446 533226509
3149.6 533226509 532958527 532511559 531631927 530782051 530129852 529301491 528484459 528521652 527963829 526853714
3159.3 526853714 526007538 525313187 525207672 524555779 523602028 522571678 521547623 521050262 520962143
3168 520962143 521012001 520444107 519894638 519245415 518676414 518045578 516972237 516365738 515835762 515543785
3177.6 515543785 514798431 513827553 513418465 512610550 511570091 510692635 510343361 509845695 509011688
3186.3E09011688n80559l14407j86500p24411j045571j163559n74608k3574n69611
3195E03828888p54852m47960l81241r63287j009140p64466p35626q5030r8533r70993
3204.6D97617760o58913p2746q67005q29849k97775o97327q73833o45523l75557o75659
3214.3D91623573o65893m88167o41670m35486m25453p26548q69407n64232m54941l49464
3223.9D86002312j28517j80741m82101r91593p56569m55741m01345j04599K12631o12182
3233.5D82101555j584435p66754p27196q92753m69513m25873m96l49350o47697m47731
3243.2D75789757l28369n28374p27310p2708j88637p92198q08373p04613p48138n08690
3252.8D70382347l2081j07232m17785q06618p60613l58619m94080o35986k83814p7285
$$ plain form
3186.3 509011688 508431129 508116722 507930222 507205811 506160240 504996681 504422073 504398499 503828888
3195 503828888 503074036 502626076 502244835 501281548 500272408 499507942 498772316 498687286 498588753 497617760
3204.6 497617760 496958847 496886101 496019096 495189247 494891472 494194145 493320312 492674789 492299232 491623573
3214.3 491623573 490957680 490469513 489827843 489392357 488966904 488240356 487370949 486806717 486351776 486002312
3223.9 486002312 485873795 485693054 485210953 484219360 483462791 483007050 482605705 482501106 482713737 482101555
3233.5 482101555 480517120 479750366 479023170 478130417 477660904 477235031 477234535 476885185 476237488 475789757
3243.2 475789757 475461388 474933014 474205704 474132996 473944359 473152161 472343788 471639175 470891037 470382347
3252.8 470382347 470350266 470243034 469825249 469018631 468258018 467899399 467405319 466769333 466485519 466408234
3262.5D66408234m21639n88760k50931j30692p08313n39588p2098p95021q49304J43585
3272.1D62195473K52342o31485n84717k18925o10581o30302j59950m9057j015778o43158
3281.8D57903862L31955l22914l91541l63121m84466o36826q62388M4822M53263r2583
3291.4D55580063k20375k48070r84459r16290k43187o55747o93893l49121l71208j87416
3301D50710297j65749k82516l05901l49350k60735k16293j36604o95763j514931n80520
3310.7D46201935j31226o68525q06580q26759K136k41013p37610m47540q01277m45442
3320.3D41098099j7662j68495q39234j026077m85268p57141q58002q98971p04613l77731
3330D34964905n32646o40297q76465o38046n94063o54526n08041j105576j175079p16515
$$ plain form
3262.5 466408234 465986595 465397835 465146904 465016212 464307899 463768311 463696213 462901192 462051888 462195473
3272.1 462195473 462447815 461816330 461231613 461012688 460402107 459771805 459611855 459562798 458547020 457903862
3281.8 457903862 458235817 457912903 457521362 457158241 456673775 456036949 455174561 455219383 455672646 455580063
3291.4 455580063 455359688 455111618 454127159 453210869 452967682 452311935 451618042 451268921 450897713 450710297
3301 450710297 450544548 450262032 449956131 449606781 449346046 449129753 448993149 448297386 446782455 446201935
3310.7 446201935 446070709 445402184 444595604 443768845 443770981 443529968 442792358 442344818 441543541 441098099
3320.3 441098099 441080437 440911942 440072708 439046631 438561363 437804222 436946220 436047249 435342636 434964905
3330 434964905 434432259 433791962 432915497 432277451 431683388 431028862 430520821 429415245 428240166 427523651
3339.6D27523651m38423j37825m26598r65004q89816o03371n99327o24961l18909n25971
3349.3D21993446r30328n99976r02290j112137m38537r4262m74739r24644k44980k25334
3358.9D16046219p26395m00924q53043j004562m24881o7215R956o00433j022416j206626
3368.6D09749680r93653j88598l19519r34754o19011j41296j29814j84174l55873p21245
3378.2D05161743o27365j33247j82877m93660n01175p35626j002197n29328j32103
3386.9D00824165l1929j4534q32138p51686M02069J94245m51851m48303l11432j46141
3396.5C98432465k58217O7672K05613p16172r83886k98195J1482l58200l90701j4763
3406.2C95697098p3090l66669p88650l16315K53411L62854N22079k03476j55601n3330
$$ plain form
3339.6 427523651 427085228 426947403 426520805 425555801 424665985 424062614 423463287 422838326 422519417 421993446
3349.3 421993446 421063118 420463142 419560852 418448715 418010178 417915916 417441177 416516533 416271553 416046219
3358.9 416046219 415319824 414918900 414065857 413061295 412636414 412569199 412579155 411978722 410956306 409749680
3368.6 409749680 408756027 408567429 408247910 407313156 406694145 406552849 406423035 406238861 405882988 405161743
3378.2 405161743 404534378 404401131 404218254 403724594 403223419 402487793 401485596 400956268 400824165
3386.9 400824165 400792236 400777702 399945564 399193878 399595947 399790192 399338341 398890038 398578606 398432465
3396.5 398432465 398174248 398241920 398447533 397731361 396747475 396449280 396460762 396102562 395711861 395697098
3406.2 395697098 395624008 395257339 394468689 394152374 394405785 394768639 395290718 395087242 394931641 394878311
3415.8C94878311j23672J27258l77769o0158j98326l49999q6021r9602N95131P51037
3425.5C95056190O13823j49955n47943k68975j56364J12305J8768L05252N4512L48167
3435.1C95385780P50161K2087Q8958J87874J6480P5378N83344n036j16997Q61245O60286
3445.7C98509560N80978l12271L42789J266479N89333L07464L7270P98263P12624M47845
3455.3D03280334M03214j71852L75366M65927Q99811O40411J50719P54013O10542N53093
3465D07961578O13327P21779N12772N76439R71603Q23059L27187K36435Q47244O37360
3474.6D14228783N76248O48193M18015R08317J178284P04384M02832N07393J63841
3483.3D19736290O77719J161575J263619J132889K01645N92308Q70247N15403N39360
$$ plain form
3415.8 394878311 394754639 394881897 394504128 394443970 394245644 393895645 393809624 393710022 394305153 395056190
3425.5 395056190 395670013 395520058 394972115 394703140 394546776 394659081 394677849 394983101 395037613 395385780
3435.1 395385780 396135941 396158028 396246986 396434860 396451340 396526718 397110062 397105026 396988029 397849274 398509560
3445.7 398509560 399090538 398778267 399121056 400387535 400976868 401284332 401321602 402119865 402832489 403280334
3455.3 403280334 403683548 403511696 403887062 404352989 405252800 405893211 406043930 406797943 407408485 407961578
3465 407961578 408574905 409296684 409809456 410385895 411357498 412180557 412507744 412744179 413591423 414228783
3474.6 414228783 414805031 415453224 415871239 416779556 417957840 418662224 419065056 419572449 419736290
3483.3 419736290 420414009 421575584 422839203 423972092 424173737 424766045 425636292 426151695 426691055
3492D26691055J101685J539955N98183N6419N05714J076813J014633J102486J009560
3500.7D34696503R60350J244697k02713Q0147J202355Q49189R43375J358948O70318
3509.4D41803169j64642R15756J117172R74350P88117O62460J361542J003380L15780
3518D48777084M04969J225471J395455J926345J825028P5416K46964N49278J022644
3526.7D57448654P27120P36427J424560J105423J219559J016274Q76312L11623J636848
3535.4D66502800J929779J18713J251336J285247J176339Q47129Q66852J233254R43260
3544.1D76154709R43222L32832J476097P03469J467590K280197K002373K047768r73893
3552.7D86434364R06830J456337J262207K003479J41564J428985J686173J022911Q19587
$$ plain form
3492 426691055 427792740 429332695 429930878 429987297 430493011 431569824 432584457 433686943 434696503
3500.7 434696503 435656853 436901550 436698837 436778984 437981339 438830528 439773903 441132851 441803169
3509.4 441803169 441638527 442554283 443671455 444645805 445433922 446096382 447457924 448461304 448777084
3518 448777084 449182053 450407524 451802979 453729324 455554352 455629768 455876732 456426010 457448654
3526.7 457448654 458175774 458912201 460336761 461442184 462661743 463678017 464554329 464865952 466502800
3535.4 466502800 468432579 468551292 469802628 471087875 472264214 473111343 473978195 475211449 476154709
3544.1 476154709 477097931 477430763 478906860 479610329 481077919 483358116 485360489 487408257 486434364
3552.7 486434364 487341194 488797531 490059738 492063217 492204781 493633766 495319939 496342850 497162437
3561.4D97162437K332612K203788N11971L175316L91845M6006J427955k17476K399063
3570.1E09433517J468239J740074J894150J756058J019897J301346K320290M27666
3577.8E21361237J960334J779099J420097K100067J526986J534614L32756L168907
3585.5E35184097J921578o37131K193718j298790K236176L520507K701950P66373J060791
3594.2E47649269M153900r78088R75838L272705J406059L062324P21016L07312K111893
3602.9E62682228K376022K135048K442513K709884q01506K387085j69448p54242O864090
3611.6E79871674K308273q91991M247055q46710K355003L825531j57814J352463o8359
3620.3E91995125J576919M124985K618141J773835K789611K025223J591873N697518
$$ plain form
3561.4 497162437 499495049 501698837 502210808 505386124 505777969 505823975 507251930 507034454 509433517
3570.1 509433517 510901756 512641830 514535980 516292038 517311935 518613281 520933571 521361237
3577.8 521361237 523321571 525100670 526520767 528620834 530147820 531682434 532015190 535184097
3585.5 535184097 537105675 536468544 538662262 537363472 539599648 543120155 545822105 546588478 547649269
3594.2 547649269 551803169 550825081 551800919 555073624 556479683 559542007 560263023 560570335 562682228
3602.9 562682228 565058250 567193298 569635811 572345695 571544189 573931274 573761826 573007584 579871674
3611.6 579871674 582179947 581287956 585535011 584688301 587043304 590868835 590711021 592063484 591995125
3620.3 591995125 593572044 597697029 600315170 602089005 604878616 606903839 608495712 614193230
3628F14193230J540451q734093K648621M151077N305519K127342j165352K461968L109588
3636.6F25638351K021027L70941J309433K380104K326470J157112L70140K137184L292122
3645.3F41002884N425033m64324m210282N207291J657791k452316j629792M129792
3653F48666077L815918L794098N483322o904373N51223M688950J060715J371078N75180
3661.7F63102188J363068M28924J726837K763901M90570K927323J678238r46045J54495
3670.4F73689499n243301J806564P005081R182739K338944j8574219O61469O933441
3678.1F77800217N051117k265931j311950K363281J762924J234436P75757L61939L190002
3686.8F88961792N233002r983521l267898R716797m357529j589508M743728O54679
$$ plain form
3628 614193230 615733681 606999588 609648209 613799286 619104805 621232147 620066795 622528763 625638351
3636.6 625638351 627659378 628030319 629339752 631719856 634046326 635203438 635573578 637710762 641002884
3645.3 641002884 646427917 645963593 641753311 646960602 648618393 646166077 644536285 648666077
3653 648666077 652481995 656276093 661759415 654855042 655406265 660095215 661155930 662527008 663102188
3661.7 663102188 664465256 664894180 666621017 669384918 669875488 672802811 674481049 673535004 673689499
3670.4 673689499 668446198 670252762 677257843 686440582 688779526 670205307 670866776 677800217
3678.1 677800217 682851334 680585403 679273453 681636734 683399658 684634094 685409851 685771790 688961792
3686.8 688961792 694194794 684211273 680943375 690660172 686302643 684713135 689456863 690111542
3694.5F90111542J530227J275025Q2474L50341n87463K143631L380203m260406l024674
3703.2F91000900L867417J874694q6593K81525K075881K592469o368027M262009N609970
3711.9G05110245j2897721K774659M435272O25915N77927J868668J418609l708648
3719.6G00204926m04206N565109k205657n431366M518890K277222k6017k265167p59582
3728.3G01474152K403717P2250M793472j724930p365951Q311462J427918r253693k96783
3736.9F99841614Q71277K63977L159637L474350l956451K154083J1661224o657409
3744.7G10812302j7643433Q094177N687485P366257j461411j2552719J0385819k980729
3752.4G07707748r079284M116363M428864M087448o026306K02331N995941n450515
$$ plain form
3694.5 690111542 691641769 692916794 692999268 693349609 692762146 694905777 698285980 694025574 691000900
3703.2 691000900 694868317 696743011 696656418 696937943 699013824 701606293 695238266 699500275 705110245
3711.9 705110245 692212524 694987183 699422455 700048370 700626297 702494965 703913574 700204926
3719.6 700204926 699800720 705365829 703160172 697728806 702247696 704524918 704498901 702233734 701474152
3728.3 701474152 703877869 703950119 708743591 707018661 699652710 707964172 709392090 700138397 699841614
3736.9 699841614 700712891 700976868 704136505 707610855 703654404 705808487 717469711 710812302
3744.7 710812302 693168869 701263046 706950531 714316788 712855377 700302658 710688477 707707748
3752.4 707707748 698628464 702744827 707173691 711261139 705234833 705437164 711433105 705982590
3760.1G05982590k322998K865982J827697K83051K029800j007919m097748K047196
3767.8G07607651M761276J238480q301087L30734K944794M53797J048965m74625O6986
3776.5G09676971Q65326K730637J67465p773743J330719K619858J203537K343445k708054
3785.2G10456161j738204P73010M10690R80148k04162k71607j50451K31628j30691
3793.8G10356522J071395L829117k266464m432526J367798L544922N376434n142669
3801.5G13704529r817124J870881K283172N136032O876984r043884o835022M631958
3809.3G08807526K388763L9826N87768J66931P82700N170135J566315j3798752K273026
3817.9G07984238M936752M074173K822418j6398468Q88748M816361J374054K494507
$$ plain form
3760.1 705982590 703659592 706525574 708353271 708636322 710666122 709658203 705560455 707607651
3767.8 707607651 712368927 713607407 705306320 705637054 708581848 709035645 710084610 709609985 709676971
3776.5 709676971 710542297 713272934 713440399 705666656 706997375 709617233 710820770 713164215 710456161
3785.2 710456161 708717957 709490967 709901657 710881805 710677643 710406036 710255585 710487213 710356522
3793.8 710356522 711427917 715257034 712990570 708558044 709925842 713470764 718847198 713704529
3801.5 713704529 703887405 705758286 708041458 713177490 720054474 711010590 704175568 708807526
3809.3 708807526 711196289 711236115 711823883 711990814 712773514 717943649 719509964 705711212 707984238
3817.9 707984238 712920990 716995163 719817581 703419113 704307861 709124222 710498276 712992783
3825.7G12992783P68509l702469r07441J763001L700943J707153r316559J421357Q050766
3834.3G16478043m939957j742859Q745956n909500o855316O124344l374939p46994
3842.1G07778778O993332p35855n166931J130066R59243O61545K395783q55713N50995
3850.7G13711243M822082k715301L111953j4264984k976532Q792496J12381k128754
3858.4G08464584J512375K304688L476410l564606n96466N793381o241532n963592
3866.2G05185242L798523M485778N712738o100006r049377K908401N414582M107895
3873.9G16463776r088898l7766M013901P4616K089538L582993m868622o908112M604874
3882.6G09926300J435852J740036N696945j1527023K62222L666306k16294L220597
$$ plain form
3825.7 712992783 713761292 710058823 709151382 710914383 714615326 716322479 707005920 708427277 716478043
3834.3 716478043 711538086 709795227 718541183 712631683 705776367 711900711 708525772 707778778
3842.1 707778778 714772110 714036255 708869324 709999390 710958633 711620178 714015961 713160248 713711243
3850.7 713711243 718533325 715818024 718929977 704664993 701688461 710480957 710593338 708464584
3858.4 708464584 709976959 712281647 715758057 712193451 711596985 717390366 711148834 705185242
3866.2 705185242 708983765 713469543 719182281 713082275 704032898 706941299 712355881 716463776
3873.9 716463776 707374878 707337112 711351013 711425629 713515167 717098160 712229538 705321426 709926300
3882.6 709926300 711362152 713102188 718799133 707272110 707534332 711200638 710984344 714204941
3890.3G14204941p74231o979981R66568K887497q16497J277847J299286K293777K290192
3898.9G16649399r617539M819718L093109o627579M898300j927642k603989k20032
3906.7G08463745N85327K601776p3852J40686j53961k19879k63749m63943J388245
3915.3G12004395K394561k079010l850784L495712k27432m567184K251586K471085
3923.1G11892929J296692k458954l636398J200104J736755J198196j100311K37503
3930.8G10366516K931366k096329k418289R16519Q56781P99942J24741o41098n90744
3939.5G10249405k01416J924744J599731m421463j561813K095337Q16879O77414j418305
3948.1G09760513N32532J195221j853638P97196l4333j447219j984J277313J002960
$$ plain form
3890.3 714204941 713430710 706450729 707417297 710304794 709488297 710766144 712065430 714359207 716649399
3898.9 716649399 707031860 711851578 714944687 708317108 713215408 711287766 708683777 708463745
3906.7 708463745 709049072 711650848 711576996 711717682 711563721 711343842 711080093 710616150 712004395
3915.3 712004395 714398956 712319946 708469162 711964874 711737442 707170258 709421844 711892929
3923.1 711892929 713189621 710730667 707094269 708294373 710031128 711229324 710129013 710366516
3930.8 710366516 713297882 711201553 708783264 709699783 710556564 711356506 711481247 710840149 710249405
3939.5 710249405 710047989 711972733 713572464 709151001 707589188 709684525 710501404 711178818 709760513
3948.1 709760513 710293045 711488266 709634628 710431824 710397491 708950272 708948288 710225601 711228561
3956.8G11228561j091156r4757l11432K62452Q79135j066056j69830j52283K07062
3965.5G09691696M18701j63498P56455k46735p36465L15170M3717k59858J07804M30984
3975.1G10357971n0735q15583k05230J36108J11542K46811n09949r6130L43475L48663
3984.8G09866943P16782K18811m15268o33392r6894n27801l74069N78842K31247N83038
3994.4G10148239J62048m84085p2097j51368q7204K88620
4000.2G09804153
$$ plain form
3956.8 711228561 710137405 710042648 709731216 709993668 710872803 709806747 709636917 709484634 709691696
3965.5 709691696 710110397 709946899 710703354 710456619 709720154 710035324 710079041 709819183 709926987 710357971
3975.1 710357971 710307236 709491653 709286423 709422531 709534073 709780884 709270935 709174805 709518280 709866943
3984.8 709866943 710583725 710802536 710387268 709753876 709656982 709129181 708755112 709333954 709565201 710148239
3994.4 710148239 710310287 709826202 709754105 709602737 709515533 709804153
4000.2 709804153
##END=$$ End of the data block
