##TITLE=$$ Begin of the data block
##JCAMP-DX=5.00 $$ ACD/SpecManager v 10.08
##SPECTROMETER/DATA SYSTEM=Varian
##DATE=08 Jan 2013 15:41:26
##DATA TYPE=INFRARED SPECTRUM
##DATA CLASS=XYDATA
##ORIGIN=
##OWNER=
##NPOINTS=3735
##FIRSTX=399.26403809
##LASTX=4000.35498047
##MAXX=4000.35498047
##MINX=399.26403809
##MAXY=73.37138367
##MINY=30.97232819
##XFACTOR=1.0000000000
##YFACTOR=0.000000100000000
##FIRSTY=48.99664688
##DELTAX=0.96440572
##XUNITS=1/CM
##YUNITS=TRANSMITTANCE
##XYDATA=(X++(Y..Y))
$$ plain form
399.3 489966469 484299698 485616341 493727417 491069260 484179306 491565247 500000725 504937248
407 504937248 506763115 502324371 495357552 487795677 481329269 481109047 484464989 486304474 484957733
415.7 484957733 485613594 487819939 483587456 469613342 473857880 480701447 480934219 483233719 484369698
424.3 484369698 483481445 486336517 485925179 482139740 479738617 483170395 484665489 482950935 484258804
433 484258804 488215752 490955391 485341339 484040604 485640488 484049606 486363220 489445572 491413269
441.7 491413269 488652496 488459549 488137779 484805222 484532585 484506493 485415726 482723045 479180641
450.4 479180641 480171204 483015709 484997101 483823776 485475845 489381485 490801697 483318787 481231270
459.1 481231270 484676704 484220848 482103081 480871735 481425781 480963364 480854950 484264450 483367157
$$ packed form
399.3D89966469n666771J316643Q111076k658157o889954P385941Q435478M936523
407E04937248J825867m438744o966819p561875o466408k20222L355942J839485j346741
415.7D84957733O55861K206345m232483j3974114M244538O843567K32772K299500J135979
424.3D84369698q88253K855072m11338l785439k401123L431778J495094j714554J307869
433D84258804L956948K739639n614052j300735J599884j590882K313614L082352J967697
441.7D91413269k760773j92947l21770l332557k72637k6092R09233k692681l542404
450.4D79180641R90563K844505J981392j173325J652069L905640J420212p482910k087517
459.1D81231270L445434m55856k117767j231346N54046m62417j08414L409500q97293
$$ plain form
467.7 483367157 480521736 481178513 478676529 473335991 475296173 481299324 482074966 478744011 473963776
476.4 473963776 474732895 474641609 471999321 472326317 472851677 472544937 472573166 471861725 473160172 475156441
486.1 475156441 474519310 473664055 471078682 468203583 470267448 472450027 472646523 475371323 475783920
494.7 475783920 473987312 474202271 470939178 466152878 464209290 466470299 471005898 468840790 466529121
503.4 466529121 467878456 469911346 469841881 463852921 461878586 464257011 466950836 468175049 465629463
512.1 465629463 464506226 468162689 468567734 464683037 463301926 462405510 462589073 462598991 460985336
520.8 460985336 461441803 462490501 462731819 461620331 461264687 460175323 458129044 457876244 458833313
529.5 458833313 460413437 459600334 459063377 460652542 461497688 460010834 456015320 454331017 455575066
$$ packed form
467.7D83367157k845421O56777k501984n340538J960182O003151P75642l330955m780235
476.4D73963776P69119r1286k642288L26996N25360l06740K8229p11441J298447J996269
486.1D75156441o37131q55255k585373k875099K063865K182579J96496K724800M12597
494.7D75783920j796608K14959l263093m786300j943588K261009M535599k165108k311669
503.4D66529121J349335K032890o9465n988960j974335K378425K693825J224213k545586
512.1D65629463j123237L656463M05045l884697j381111q96416J83563R918j613655
520.8D60985336M56467J048698K41318j111488l55644j089364k046279k52800R57069
529.5D58833313J580124q13103n36957J589165Q45146j486854l995514j684303J244049
$$ plain form
538.1 455575066 457873573 459261818 459139862 459358673 459341660 458647270 457163773 455908470 454859543
546.8 454859543 453297691 453409729 455670586 456086197 455895805 457775116 457849045 456081276 454115410
555.5 454115410 453036613 452809105 452410278 453000526 453064461 452241592 451771736 452881012 453125458 451812592
565.1 451812592 451228371 450916176 452911034 454137917 452994118 452531357 453212852 454610367 454514542
573.8 454514542 453839493 452575035 450685616 450349007 451359940 451983604 451394882 452220726 453386688
582.5 453386688 453207397 451698723 451487579 452805595 452920647 453361931 453400803 453358231 454336357 455374260
592.1 455374260 456058540 456115990 455910683 455369034 454902306 454236183 454723015 456016121 455939140 455799484
601.8 455799484 455288925 454894600 454466400 454112511 454671059 454360085 454179230 455588150 456957817
$$ packed form
538.1D55575066K298507J388245j21956K18811j7013o94390j483497j255303j048927
546.8D54859543j561852J12038K260857M15611j90392J879311P3929j767769j965866
555.5D54115410j078797k27508l98827N90248O3935q22869m69856J109276K44446j312866
565.1D51812592n84221l12195J994858J226883j143799m62761O81495J397515r5825
573.8D54514542o75049j264458j889419l36609J010933O23664n88722Q25844J165962
582.5D53386688j79291j508674k11144J318016J15052M41284L8872m2572R78126J037903
592.1D55374260O84280N7450k05307n41649m66728o66123M86832J293106p6981j39656
601.8D55799484n10559l94325m28200l53889N58548l10974j80855J408920J369667
$$ plain form
610.5 456957817 456633415 455041428 453337250 452510567 451163635 450254211 452093239 453010025 453625526
619.2 453625526 454484177 454302826 454897842 455026093 453927879 453054771 453179550 453927574 455735435
627.8 455735435 458065529 460770187 463809586 464261246 463837051 463925591 463354683 463803749 464941559
636.5 464941559 466377563 467839622 468637276 470376701 472396660 473077850 473360977 473294067 473227196
645.2 473227196 474012527 474535675 475712700 477932587 479678879 480012512 479256210 479516144 480333748
653.9 480333748 480181503 478986778 479055367 480344162 481186142 482770996 483198433 482614975 481917686
662.5 481917686 481353951 480854607 480245247 482369881 484550362 482306480 481549377 481705437 483482590
671.2 483482590 484605331 485465317 485752563 485352554 486688347 487996864 489114380 490031929 490831795
$$ packed form
610.5D56957817l24402j591987j704178q26683j346932r09424J839028R16786O15501
619.2D53625526Q58651j81351N95016J28251j098214q73108J24779P48024J807861
627.8D55735435K330094K704658L039399M51660m24195Q8540n70908M49066J137810
636.5D64941559J436004J462059P97654J739425K019959O81190K83127o6910o6871
645.2D73227196P85331N23148J177025K219887J746292L33633p56302K59934Q17604
653.9D80333748j52245j194725O8589J288795Q41980J584854M27437n83458o97289
662.5D81917686n63735m99344o09360K124634K180481k243882p57103J56060J777153
671.2D83482590J122741Q59986K87246m00009J335793J308517J117516R17549P99866
$$ plain form
679.9 490831795 491309624 491796379 492778244 492443657 492178078 493496513 495065575 495573959 495843163
688.6 495843163 495981750 495858383 496459579 497357063 497816391 497501831 497907677 498676643 499763985 501258850
698.2 501258850 500622139 499803238 500017548 500119858 500160561 500399551 501608429 502778397 503262482 504209099
707.9 504209099 505283928 505562973 505707397 505370941 504668045 505103951 506339302 507358742 508078194
716.6 508078194 509347839 510870895 511454010 510525131 510097923 510863457 510919418 511562080 512724075
725.2 512724075 514291229 516068153 516693230 517474785 518047523 518254356 518150673 518337479 519469986
733.9 519469986 520184822 521319923 523032799 523662758 523696060 524321060 524984131 525750275 525719109 525285606
743.6 525285606 525663719 526171265 528290939 529488907 529490051 530764847 531557388 531987228 531907730 532161903
$$ packed form
679.9D90831795M77829M86755R81865l34587k65579J318435J569062N08384K69204
688.6D95843163J38587j23367O01196Q97484M59328l14560M05846P68966J087342J494865
698.2E01258850o36711q18901K14310J02310M0703K38990J208878J169968M84085R46617
707.9E04209099J074829K79045J44424l36456p02896M35906J235351J019440P19452
716.6E08078194J269645J523056N83115r28879m27208P65534N5961O42662J161995
725.2E12724075J567154J776924O25077P81555N72738K06833j03683J86806J132507
733.9E19469986P14836J135101J712876O29959L3302O25000O63071P66144l1166m33503
743.6E25285606L78113N07546K119674J197968J144J274796P92541M29840p9498K54173
$$ plain form
753.2 532161903 532911949 533718605 534241180 534262466 535266762 536186447 536762238 537521553 538835983 539816360
762.8 539816360 539939346 539532814 539380913 540965233 542159882 543333855 543327751 542602539 543165474 542786751
772.5 542786751 543076515 543162155 543075142 543464851 543726883 544209290 543983078 544364166 544438057 544478416
782.1 544478416 544561729 545007172 546355782 546780128 547245941 546821442 545847015 545505714 546092033 546703339
791.8 546703339 546298180 546690331 547418747 547666092 547084198 546652870 546323929 545590286 544223404 542668419
801.4 542668419 543053322 543257370 542381439 540560913 539603500 539694939 537932549 536282768 534952698
810.1 534952698 533279076 531391907 530254822 530160484 529757385 529048729 527769470 526875725 526349640
818.8 526349640 525296898 524178085 524909859 526254539 526576576 527985039 529437714 530851212 532667389
$$ packed form
753.2E32161903P50046Q06656N22575K1286J004296R19685N75791P59315J314430R80377
762.8E39816360J22986m06532j51901J584320J194649J173973o104p25212N62935l78723
772.5E42786751K89764Q5640q7013L89709K62032M82407k26212L81088P3891M0359
782.1E44478416Q3313M45443J348610M24346M65813m24499r74427l41301N86319O11306
791.8E46703339m05159L92151P28416K47345n81894m31328l28941p33643j366882j554985
801.4E42668419L84903K04048q75931j820526r57413R1439j762390j649781j330070
810.1E34952698j673622j887169j137085r4338m03099p08656j279259q93745n26085
818.8E26349640j052742j118813P31774J344680L22037J408463J452675J413498J816177
$$ plain form
827.5 532667389 533961563 534838219 536086502 538419800 540380249 541982803 542913437 544493027 547480049
836.1 547480049 549945450 551147079 551287384 552236023 553461227 555091362 556295776 557439613 558757553
844.8 558757553 559321861 561934090 564079895 565354805 567030373 568874969 569972343 570261955 571943283
853.5 571943283 572684174 574562073 576213074 577340736 579728928 580424957 581219177 581609917 582882729
862.2 582882729 584018936 584350624 584738541 584527740 585634384 584906006 583577042 582997169 581684036
870.9 581684036 579469337 577994308 578057137 577141838 576471977 575592384 575442848 575791969 576180267 576326141
880.5 576326141 575179367 575438805 574750824 574586983 574833183 573700523 573465271 572976799 572915382 573044815
890.2 573044815 573294487 573011894 572957611 573645287 573690224 574234848 574822655 575167274 574564857 574408913
$$ packed form
827.5E32667389J294174Q76656J248283K333298J960449J602554R30634J579590K987022
836.1E47480049K465401J201629J40305R48639J225204J630135J204414J143837J317940
844.8E58757553N64308K612229K145805J274910J675568J844596J097374K89612J681328
853.5E71943283P40891J877899J651001J127662K388192O96029P94220L90740J272812
862.2E82882729J136207L31688L87917k10801J106644p28378j328964n79873j313133
870.9E81684036k214699j475029O2829r15299o69861q79593j49536L49121L88298J45874
880.5E76326141j146774K59438o87981j63841K46200j132660k35252m88472o1417J29433
890.2E73044815K49672k82593n4283O87676M4937N44624N87807L44619o02417j55944
$$ plain form
899.8 574408913 574361458 574256935 575235558 575668869 576297150 576342545 576767960 577753944 578861961 580079765
909.4 580079765 580981178 582068367 581351929 581009140 580020065 578547974 577965279 576372910 575326042
918.1 575326042 573359947 571135864 569034348 566997719 565360451 562891769 560724754 558965073
925.8 558965073 557271576 554603615 552326088 550212212 547541389 546428642 545867271 544823456 543842316
934.5 543842316 543788376 543133087 542061310 541655273 540819283 539906349 539103622 538956413 538161888 537260971
944.2 537260971 537075653 536693459 537126198 537034454 535963936 534952164 534095650 532852516 531864357
952.8 531864357 531040840 529230576 527827911 526644020 524957695 523147888 521675262 519770279 517558479
961.5 517558479 516071358 515013313 514131584 511947365 509909363 508588867 506707764 505050201 503298912
$$ packed form
899.8E74408913m7455j04523R78623M33311O28281M5395M25415R85984J108017J217804
909.4E80079765R01413J087189p16438l42789r89075j472091n82695j592369j046868
918.1E75326042j966095k224083k101516k036629j637268k468682k167015j759681
925.8E58965073j693497k667961k277527k113876k670823j112747n61371j043815r81140
934.5E43842316n3940o55289j071777m06037q35990r12934q02727j47209p94525r00917
944.2E37260971j85318l82194M32739r1744j070518j011772q56514j243134r88159
952.8E31864357q23517j810264j402665j183891j686325j809807j472626j904983k211800
961.5E17558479j487121j058045q81729k184219k038002j320496j881103j657563j751289
$$ plain form
970.2 503298912 501506615 499656982 498093987 496501198 494515038 492205315 489879379 487982750
977.9 487982750 485584679 483257027 480249977 476707268 473320847 469196053 465407639 462130623
985.6 462130623 458863525 455202942 451438942 448478165 445408134 441160622 437154160 434088516
993.3 434088516 431396103 429260674 426614838 423394928 420417252 417355499 414624023 412563286
1001.1 412563286 410285072 408032379 406071205 404020920 402253456 401306381 401023712 399441757 397562561
1009.7 397562561 396527634 395199089 393690720 392369461 391877632 390594597 388408089 386270142
1017.5 386270142 383911781 381998978 380179443 378309479 376560631 375047989 372710838 370911484
1025.2 370911484 370028648 368255005 366766014 365392456 364322853 363450050 363302765 362831573 361618423
$$ packed form
970.2E03298912j792297j849633j562995j592789j986160k309723k325936j896629
977.9D87982750k398071k327652l007050l542709l386421m124794l788414l277016
985.6D62130623l267098l660583l764000k960777l070031m247512m006462l065644
993.3D34088516k692413k135429k645836l219910k977676l061753k731476k060737
1001.1D12563286k278214k252693j961174k050285j767464r47075k82669j581955j879196
1009.7C97562561j034927j328545j508369j321259m91829j283035k186508k137947
1017.5C86270142k358361j912803j819535j869964j748848j512642k337151j799354
1025.2C70911484q82836j773643j488991j373558j069603q72803j47285m71192j213150
$$ plain form
1033.8 361618423 361142960 360705566 361610260 361829224 361627693 362486496 363745308 364939651 364805756
1042.5 364805756 364730530 364412575 365022316 365535889 365159798 364904175 363784294 363093758 362389526 362024460
1052.2 362024460 361043167 360693321 360541458 359113579 359563713 359818268 360227089 361115341 362352180
1060.9 362352180 363854980 365254135 366720009 367480202 369895706 371506958 372722282 374216118
1068.6 374216118 374857483 375659485 375708008 376281738 376505241 376990166 377645187 378421135 379459152 380007057
1078.2 380007057 381670074 382390594 382643280 382995377 384080429 385543594 386507416 388044891 389080925
1086.9 389080925 390866165 392187309 393633347 395277176 396322899 397747993 398602600 400500679
1094.6 400500679 401855278 402670326 403962669 405686493 407575035 408393974 409712219 410485420 411864510
$$ packed form
1033.8C61618423m75463m37394R04694K18964k01531Q58803J258812J194343j33895
1042.5C64805756p5226l17955O09741N13573l76091k55623j119881o90536p04232l65066
1052.2C62024460r81293l49846j51863j427879M50134K54555M08821Q88252J236839
1060.9C62352180J502800J399155J465874P60193K415504J611252J215324J493836
1068.6C74216118O41365Q02002M8523N73730K23503M84925O55021P75948J038017N47905
1078.2C80007057J663017P20520K52686L52097J085052J463165R63822J537475J036034
1086.9C89080925J785240J321144J446038J643829J045723J425094Q54607J898079
1094.6D00500679J354599Q15048J292343J723824J888542Q18939J318245P73201J379090
$$ plain form
1103.3 411864510 413513374 413787689 414749565 416782799 419242706 420019989 419749031 420140419 420938835
1112 420938835 421229210 421934204 423241653 423113937 423871269 424647446 424522858 425016708 424415283 423524971
1121.6 423524971 423470192 424078636 424650040 424877472 425274315 426495361 428004990 428485756 429143143
1130.3 429143143 430518761 432012520 433406677 434791565 436284447 438268166 440451050 442172890
1138 442172890 443347893 443870010 444665337 445471077 446043358 446545868 447573357 449360847 449982147
1146.7 449982147 450527916 451194878 451355438 451649704 451017876 450336456 450149841 450399208 450824623 451087227
1156.3 451087227 451341743 450607300 449862785 449370880 448543854 447708855 447497559 447903748 447901268 448752441
1166 448752441 450514793 452309914 453904686 454979706 456176758 457445297 458534431 459569168 461470604
$$ packed form
1103.3D11864510J648864K74315R61876K033234K459907P77283k70958L91388P98416
1112D20938835K90375P04994J307449j27716P57332P76177j24588M93850o01425q90312
1121.6D23524971n4779O08444N71404K27432L96843J221046J509629M80766O57387
1130.3D29143143J375618J493759J394157J384888J492882J983719K182884J721840
1138D42172890J175003N22117P95327Q05740N72281N02510J027489J787490O21300
1146.7D49982147N45769O66962J60560K94266o31828o81420j86615K49367M25415K62604
1156.3D51087227K54516p34443p44515m91905q27026q34999k11296M06189k480Q51173
1166D48752441J762352J795121J594772J075020J197052J268539J089134J034737J901436
$$ plain form
1174.6 461470604 464413109 466716881 468412476 469945068 471431503 472891846 474043159 475585632
1182.4 475585632 476449890 477050171 478424644 479318810 479925194 480653954 481167793 480732422 479914360
1191 479914360 479605980 479264297 478808479 478277817 477447090 476900024 476856804 476404037 475084915 473287201
1200.7 473287201 471980896 471188126 470309105 469112701 468064995 467568779 467074509 466745644 466280975
1209.4 466280975 465377274 464401741 463642349 463065529 462715454 463023300 463074875 462851982 462812233 462597351
1219 462597351 462540970 462618713 462392807 461620293 460948105 460837517 460882263 460867195 460599251 459890671 459298630
1229.6 459298630 458914528 458022614 457417717 457181282 456711311 456286507 455908356 455971565 456310844 456095200
1239.3 456095200 455589867 455470886 454591522 453529205 453828354 453974304 453710823 453540688 453266029
$$ packed form
1174.6D61470604K942505K303772J695595J532592J486435J460343J151313J542473
1182.4D75585632Q64258O00281J374473Q94166O06384P28760N13839m35371q18062
1191D79914360l08380l41683m55818n30662q30727n47066m3220m52767j319122j797714
1200.7D73287201j306305p92770q79021j196404j047706m96216m94270l28865m64669
1209.4D66280975r03701r75533p59392n76820l50075L07846N1575k22893l9749k14882
1219D62597351n6381P7743k25906p72514o72188j10588M4746j5068k67944p08580n92041
1229.6D59298630l84102q91914o04897k36435m69971m24804l78151O3209L39279k15644
1239.3D56095200n05333j18981q79364j062317K99149J45950k63481j70135k74659
$$ plain form
1247.9 453266029 452823563 452399940 452164421 451827049 451710281 451582832 451552811 451652908 451852226 452136612
1257.6 452136612 451915627 451558685 451263657 451473083 451944923 452374611 453219376 454018631 454546890 455002098
1267.2 455002098 455672112 456452827 457038803 457577705 458097343 458761978 459752350 461249771 462736740
1275.9 462736740 463642082 464701767 465760880 466347504 467092018 468281364 469680748 471036415 472665520
1284.6 472665520 474049950 475014496 476194305 477325706 478633270 479808311 480501137 481108551 482079697
1293.3 482079697 483387566 484622574 485498238 486038704 486501350 486727028 486997528 487102585 487339439
1301.9 487339439 487574005 487850990 488564377 488823738 489392700 489727859 489288635 488682518 488510551 488988075
1311.6 488988075 488667870 488485184 488591118 488469048 488499794 488618965 488996887 489226494 489662399 490109863
$$ packed form
1247.9D53266029m42466m23623k35519l37372j16768j27449l0021J00097J99318K84386
1257.6D52136612k20985l56942k95028K09426M71840M29688Q44765P99255N28259M55208
1267.2D55002098O70014P80715N85976N38902N19638O64635R90372J497421J486969
1275.9D62736740R05342J059685J059113N86624P44514J189346J399384J355667J629105
1284.6D72665520J384430R64546J179809J131401J307564J175041O92826O07414R71146
1293.3D82079697J307869J235008Q75664N40466M62646K25678K70500J05057K36854
1301.9D87339439K34566K76985P13387K59361N68962L35159m39224o06117j71967M77524
1311.6D88988075l20205j82686J05934j22070L0746J19171L77922K29607M35905M47464
$$ plain form
1321.2 490109863 490708733 491213112 491696587 492544632 493067093 493618813 493925591 494116325 493845062 493382301
1330.9 493382301 493100319 492467155 492166481 492133675 492286530 492251282 492245331 492072945 491808929 491854553
1340.5 491854553 491322174 491361809 491555824 492151794 492949219 493453178 494116058 494165840 494289169 494251251
1350.2 494251251 494301834 494151573 493635712 493735466 493814888 493776779 493512268 493585892 493368950 492987137
1359.8 492987137 492417946 491551743 491563110 490537186 490373421 490346260 489586182 489127579 488426476 487688560
1369.4 487688560 486834488 486199074 485893593 486323891 486730766 486335907 486419563 486061096 485405693 484922905
1379.1 484922905 484844055 484026222 482904091 482050400 481288338 481013489 480630341 480577850 478876495 477572327
1388.7 477572327 477223587 476247978 475403137 474471893 474471741 473601761 471231003 469919090 468814278 468417358
$$ packed form
1321.2D90109863N98870N04379M83475Q48045N22461N51720L06778J90734k71263m62761
1330.9D93382301k81982o33164l00674l2806J52855l5248n951j72386k64016M5624
1340.5D91854553n32379L9635J94015N95970P97425N03959O62880M9782J23329l7918
1350.2D94251251N0583j50261n15861R9754P9422l8109k64511P3624k16942l81813
1359.8D92987137n69191q66203J1367j025924j63765k7161p60078m58603p01103p37916
1369.4D87688560q54072o35414l05481M30298M06875l94859Q3656l58467o55403m82788
1379.1D84922905p8850q17833j122131q53691p62062k74849l83148n2491j701355j304168
1388.7D77572327l48740r75609q44841r31244j52q69980k370758j311913j104812l96920
$$ plain form
1398.4 468417358 466192131 464299164 463346939 462002792 460766830 459661293 458142662 456224632
1406.1 456224632 455204468 454132843 453237839 452316971 450798149 449691887 448853149 448489304 448384628
1414.8 448384628 448374901 448383064 448408318 448913307 446691322 446639862 448133698 448921509 449672890 449349899
1424.4 449349899 449757919 450853043 451306458 451779900 452398987 453115616 453503189 454404526 455150948
1433.1 455150948 455704575 457278290 458770142 457792892 457988052 459793587 460755844 461453819 462319412
1441.8 462319412 462697029 463224373 463449516 463676796 464132996 464489708 464234047 464747429 465493431 466005135
1451.4 466005135 466577606 466703720 468480453 470364227 471023483 471537704 470123634 470928688 471256714
1460.1 471256714 472886391 474196434 475174980 476770515 477278214 478941650 480234909 481692467 483281517
$$ packed form
1398.4D68417358k225227j892967r52225j344147j235962j105537j518631j918030
1406.1D56224632j020164j071625q95004r20868j518822j106262q38738l63845j04676
1414.8D48384628r727Q163K5254N04989k221985n1460J493836P87811P51381l22991
1424.4D49349899M08020J095124M53415M73442O19087P16629L87573R01337P46422
1433.1D55150948N53627J573715J491852r77250J95160J805535R62257O97975Q65593
1441.8D62319412L77617N27344K25143K27280M56200L56712k55661N13382P46002N11704
1451.4D66005135N72471J26114J776733J883774O59256N14221j414070Q05054L28026
1460.1D71256714J629677J310043R78546J595535N07699J663436J293259J457558J589050
$$ plain form
1468.8 483281517 485327873 488000069 490159760 492423325 493524170 495966225 498523979 500508690
1476.5 500508690 502580528 504444809 505932732 507634621 509606438 511116600 512496033 513656578
1484.2 513656578 514688377 515956001 516452675 516511650 518276176 518136520 516327667 516679802 516650124
1492.9 516650124 515715179 514933853 514961014 510031128 509007645 508032913 504759521 504212761 503101578
1501.6 503101578 501519165 499571304 499541550 501115799 500229034 494555626 492818794 493005867 492388916
1510.2 492388916 493835831 493678551 492140274 492262726 491606979 491002960 489093323 486332245 487222748
1518.9 487222748 489117966 489037704 487236977 486829491 487011223 489140663 488916702 488568115 489727287
1527.6 489727287 490045700 490316086 490987358 492190285 493702888 494935570 492657547 493669052 494883232
$$ packed form
1468.8D83281517K046356K672196K159691K263565J100845K442055K557754J984711
1476.5E00508690K071838J864281J487923J701889J971817J510162J379433J160545
1484.2E13656578J031799J267624M96674N8975J764526j39656j808853L52135k9678
1492.9E16650124r34945p81326K7161m929886j023483r74732l273392n46760j111183
1501.6E03101578j582413j947861k9754J574249q86765n673408j736832J87073o16951
1510.2D92388916J446915j57280j538277J22452o55747o04019j909637k761078Q90503
1518.9D87222748J895218q0262j800727m07486J81732K129440k23961l48587J159172
1527.6D89727287L18413K70386O71272J202927J512603J232682k278023J011505J214180
$$ plain form
1536.3 494883232 495726814 498075409 498193092 496516190 497247505 498061066 497703018 498724327 499945068
1545 499945068 498710670 500097313 500781631 501693459 502669678 501992340 503078804 504463844 506362877
1553.6 506362877 505171013 505554390 508087769 510886154 512961769 502120514 501072121 503274765
1561.4 503274765 505116158 505295982 505189972 503484421 501380844 500877533 499808884 499640694 494191360
1570 494191360 492793732 491884270 489823532 488366470 487074738 487852745 478517456 476339340 474335899
1578.7 474335899 471461983 468866310 465228691 463280144 459684143 457416763 454054871 450738754
1586.4 450738754 447472954 443661842 441350975 436674500 434049110 430422707 427678223 424512177
1594.1 424512177 420685425 418336334 414225082 412167892 408396454 405826454 402384453 399861488
$$ packed form
1536.3D94883232Q43582K348595J17683j676902P31315Q13561l58048J021309J220741
1545D99945068j234398J386643O84318R11828R76219o77338J086464J385040J899033
1553.6E06362877j191864L83377K533379K798385K075615j0841255j048393K202644
1561.4E03274765J841393J79824j06010j705551k103577n03311j068649j68190n449334
1570D94191360j397628r09462k060738j457062j291732P78007r335289k178116k003441
1578.7D74335899k873916k595673l637619j948547l596001k267380l361892l316117
1586.4D50738754l265800l811112k310867m676475k625390l626403k744484l166046
1594.1D24512177l826752k349091m111252k057190l771438k570000l442001k522965
$$ plain form
1601.9 399861488 398575935 395202217 393720322 390347786 388950577 385858421 384180984 382553444
1609.6 382553444 379112511 378901711 376678162 376446190 374414482 374291840 374448204 368765144 369799194
1618.2 369799194 368313751 368872490 367683525 368558578 368635674 366151161 366901550 366359024 368660316
1626.9 368660316 367354279 366870499 367351837 368000412 368893738 369115028 371895142 373237381 372920456
1635.6 372920456 370428696 373213196 374236565 374921341 376633530 376714134 379283714 379680481 381551628
1644.3 381551628 383437843 382636986 384450493 383279495 385852089 386859055 389883728 392864609
1652 392864609 396809311 392098236 390140610 393576546 394416466 396128960 397008743 398382454 399829979
1660.7 399829979 401617241 405074768 404496155 406822319 408691978 410986748 413348808 416274529
$$ packed form
1601.9C99861488j285553l373718j481895l372536j397209l092156j677437j627540
1609.6C82553444l440933k10800k223549k31972k031708j22642J56364n683060J034050
1618.2C69799194j485443N58739j188965Q75053P7096k484513P50389n42526K301292
1626.9C68660316j306037m83780M81338O48575Q93326K21290K780114J342239l16925
1635.6C72920456k491760K784500J023369O84776J712189Q0604K569580L96767J871147
1644.3C81551628J886215q00857J813507j170998K572594J006966L024673K980881
1652C92864609L944702m711075j957626L435936Q39920J712494Q79783J373711J447525
1660.7C99829979J787262L457527n78613K326164J869659K294770K362060K925721
$$ plain form
1668.4 416274529 418760529 419255867 423515930 424446259 428059158 432432060 435995026 437090149 439044800
1677.1 439044800 443027039 445982018 450022621 452194633 456129951 461281471 464084091 466602211
1684.8 466602211 467876244 473691406 477626648 481226501 485166550 488153648 492403526 496396561
1692.5 496396561 500610275 505086937 510997353 512173500 515541382 521001892 527049675 533470573
1700.2 533470573 528602409 534872665 539810562 543354797 546438637 549754143 551959686 553616142
1707.9 553616142 556898041 559467278 561475601 564099350 567268982 570587387 572067833 573067780
1715.6 573067780 576139565 578284874 574509888 576998405 579914856 581916084 583989754 585321846
1723.4 585321846 586214943 587650032 589022675 589679565 590611610 592836227 593534203 594013519 597573509
$$ packed form
1668.4D16274529K486000M95338M260063R30329L612899M372902L562966J095123J954651
1677.1D39044800L982239K954979M040603K172012L935318N151520K802620K518120
1684.8D66602211J274033N815162L935242L599853L940049K987098M249878L993035
1692.5D96396561M213714M476662N910416J176147L367882N460510O047783O420898
1700.2E33470573m868164O270256M937897L544235L083840L315506K205543J656456
1707.9E53616142L281899K569237K008323K623749L169632L318405J480446R99947
1715.6E73067780L071785K145309l774986K488517K916451K001228K073670J332092
1723.4E85321846Q93097J435089J372643O56890R32045K224617O97976M79316L559990
$$ plain form
1732 597573509 601322098 601805916 598550224 601195679 604490585 606013718 608473663 610100861 609227028
1740.7 609227028 612457314 615753555 617321434 618807640 621976051 624597664 626151619 628637466
1748.4 628637466 630724678 634759521 636855507 637825241 641717224 644448090 647354202 650743332
1756.2 650743332 651005173 652000580 654827118 657493286 661298370 661376114 661065674 664365540 666269073
1764.8 666269073 667895966 669459076 671340103 669934158 671175995 675453033 676473465 675679932
1772.5 675679932 674416885 677857895 679953613 678894424 680770569 681796036 683317184 683770447
1780.3 683770447 683022766 684259491 686089554 688112030 687965927 687975388 689026184 689809113 690708389
1788.9 690708389 692581558 693632431 694442368 693727112 692472534 695688629 696894150 696163483 697222366
$$ packed form
1732E97573509L748589M83818l255692K645455L294906J523133K459945J627198q73833
1740.7F09227028L230286L296241J567879J486206L168411K621613J553955K485847
1748.4F28637466K087212M034843K095986R69734L891983K730866K906112L389130
1756.2F50743332K61841R95407K826538K666168L805084P7744l10440L299866J903533
1764.8F66269073J626893J563110J881027j405945J241837M277038J020432p93533
1772.5F75679932j263047L441010K095718j059189J876145J025467J521148M53263
1780.3F83770447p47681J236725J830063K022476j46103R461J050796P82929Q99276
1788.9F90708389J873169J050873Q09937p15256j254578L216095J205521p30667J058883
$$ plain form
1797.6 697222366 699175873 700076828 698907166 701106720 701492004 701552582 703221283 703611145 704141235
1806.3 704141235 704327316 704209976 704703903 706148300 706123734 706761246 708166428 708518066 709167404
1815 709167404 709101562 709874268 709911728 710035477 711075363 711638031 712692032 712578278 713926315 715746536
1824.6 715746536 713458405 712400742 714063873 716329041 717466202 714990768 714614334 716761856
1832.3 716761856 717466965 717761154 718174133 718534927 718809280 718004456 718926163 719230118 719209213 719794388
1842 719794388 721677399 723306885 719155426 720255127 721747360 721727982 721401978 721777496 722864304
1850.7 722864304 723027039 723527908 723318787 723711472 724002075 724068985 724550095 724222183 724619598 724775696
1860.3 724775696 725448151 725759430 726071091 726409302 726462402 727435837 727533493 728471527 727282410 725754776
$$ packed form
1797.6F97222366J953507R00955j169662K199554L85284O0578J668701L89862N30090
1806.3G04141235J86081j17340M93927J444397k4566O37512J405182L51638O49338
1815G09167404o5842P72706L7460J23749J039886N62668J054001j13754J348037J820221
1824.6G15746536k288131j057663J663131K265168J137161k475434l76434K147522
1832.3G16761856P05109K94189M12979L60794K74353q04824R21707L03955k0905N85175
1842G19794388J883011J629486m151459J099701J492233j9378l26004L75518J086808
1850.7G22864304J62735N00869k09121L92685K90603O6910M81110l27912L97415J56098
1860.3G24775696O72455L11279L11661L38211N3100R73435R7656R38034j189117j527634
$$ plain form
1869.9 725754776 726739883 727339249 727951355 728075256 728551407 728026962 728065948 728429565 728338547 728770828
1879.6 728770828 728406906 729088974 729583359 730015030 730132675 729482803 729475250 729435654 730546188 730764694
1889.2 730764694 729139557 729220200 730385971 730722504 730948639 731049271 729925842 730232315 730286407
1897.9 730286407 730475464 731111221 731265564 731631165 731806335 732231750 731898041 731816330 731885223 731779404
1907.6 731779404 731851349 731794357 731744156 731504211 732348633 732062988 731922150 732284622 732416534 733713837
1917.2 733713837 732306747 731513214 732116470 732414017 733348999 733024445 732236710 732298889 732798615 732681046
1926.8 732681046 732776642 732889328 732724915 732747345 732759933 733217239 732893448 732646484 732298508 732193298
1936.5 732193298 732289810 732131271 732599335 732067490 732743530 733606491 731674500 731319809 732111053 732131653
$$ packed form
1869.9G25754776R85107N99366O12106J23901M76151n24445L8986L63617r1018M32281
1879.6G28770828l63922O82068M94385M31671J17645o49872p553l9596J110534K18506
1889.2G30764694j625137Q0643J165771L36533K26135J00632j123429L06473N4092
1897.9G30286407J89057O35757J54343L65601J75170M25415l33709q1711O8893j05819
1907.6G31779404P1945n6992n0201k39945Q44422k85645j40838L62472J31912J297303
1917.2G33713837j407090p93533O03256K97547R34982l24554p87735O2179M99726j17569
1926.8G32681046R5596J12686j64413K2430J2588M57306l23791k46964l47976j05210
1936.5G32193298R6512j58539M68064n31845O76040Q62961j931991l54691P91244K0600
$$ plain form
1946.1 732131653 731858139 732231674 732076492 731713562 731242294 731280365 731856003 731738663 731532745 731044998
1955.8 731044998 731284714 731471939 731465683 731643982 731315308 731133041 730863037 731160049 731156616 731379852
1965.4 731379852 731949463 731516876 731163101 730990677 731032867 731050186 731351318 731088867 730865402 731178284
1975.1 731178284 731007080 731131592 730981369 731184235 731165466 731080704 731136017 730758209 730945282 730692368
1984.7 730692368 730632782 730624084 730757599 730714493 730387650 731127319 731209564 730484467 729992981 730424805
1994.3 730424805 730554276 730002213 729797745 729485931 729864502 730070572 730086899 729922638 729714355 729613190
2004 729613190 729232788 729207230 728865433 728992920 729095840 729113388 729199219 729038010 729109497 728474808 728033295
2014.6 728033295 727793503 727808304 727942352 728081055 728271942 728237991 728792877 728349915 727704773 727357025
$$ packed form
1946.1G32131653k73514L73535j55182l62930m71268L8071N75638j17340k05918m87747
1955.8G31044998K39716J87225o256J78299l28674j82267k70004K97012l433K23236
1965.4G31379852N69611m32587l53775j72424M2190J7319L01132k62451k23465L12882
1975.1G31178284j71204J24512j50223K02866j8769q4762N5313l77808J87073k52914
1984.7G30692368n9586q698J33515m3106l26843P39669Q2245p25097m91486M31824
1994.3G30424805J29471n52063k04468l11814L78571K06070J6327j64261k08283j01165
2004G29613190l80402k5558l41797J27487J02920J7548Q5831j61209P1487o34689m41513
2014.6G28033295k39792J4801J34048J38703J90887l3951N54886m42962o45142l47748
$$ plain form
2024.2 727357025 727121582 727254868 726974335 726805344 726325607 726491241 726853485 727122955 727225266 726539154
2033.9 726539154 726300125 726243896 726320572 725906601 725756149 726015472 725962906 725659561 725162735 725492554
2043.5 725492554 725424500 725209122 724824753 724720306 725111542 724828949 724717484 724389877 724635162 724484024
2053.2 724484024 724143677 724557114 724363403 724195251 724229813 724599304 724152527 723688202 723398666 723095398
2062.8 723095398 723680725 723610382 723611984 723337555 723410263 723795776 723807602 724115143 723665390 723421707
2072.5 723421707 723054123 722960205 723205185 723123016 723313522 723446732 723469391 722951126 722899246 722751617
2082.1 722751617 722396011 722043686 721560211 721806717 721987305 722411194 722502899 722705078 722392120 721364212
2091.7 721364212 721130219 720858383 720863876 720560760 720844498 721257629 720991898 721136475 721131287 721131287 720663071
$$ packed form
2024.2G27357025k35443J33286k80533j68991m79737J65634L62244K69470J02311o86112
2033.9G26539154k39029n6229P6676m13971j50452K59323n2566l03345m96826L29819
2043.5G25492554o8054k15378l84369j04447L91236k82593j11465l27607K45285j51138
2053.2G24484024l40347M13437j93711j68152L4562L69491m46777m64325k89536l03268
2062.8G23095398N85327p0343J602k74429P2708L85513J1826L07541m49753k43683
2072.5G23421707l67584r3918K44980q2169J90506J33210K2659n18265n1880j47629
2082.1G22751617l55606l52325m83475K46506J80588M23889R1705K02179l12958j027908
2091.7G21364212k33993k71836N493l03116K83738M13131k65731J44577n188%m68216
$$ plain form
2102.4 720663071 720653915 720423813 719934769 719975052 719838257 720153885 720228882 720585098 720458374 720002289
2112 720002289 719720535 719231720 719156799 718631287 718812332 719036484 719272079 719867249 719974670 719932556
2121.6 719932556 719467087 719285355 718563004 718272018 718669052 718879395 719159317 719024811 719170227 719051437
2131.3 719051437 719154053 718993683 718784256 718920975 718340378 718258591 718354492 718694153 718840637 718931656
2140.9 718931656 719053040 718805771 718976364 718562469 718279419 718442612 718722687 718651505 718544235 718815308
2150.6 718815308 718631668 718873978 718798828 718704147 718591614 718213348 718391571 718460159 718500671 718461075
2160.2 718461075 718811417 718826370 718661346 718824768 718716507 718731766 718674011 718739853 718452682 718350601
2169.9 718350601 718346405 718379593 718580017 718331833 718606339 718701477 718928909 718923950 718828430 719161148 719017792
$$ packed form
2102.4G20663071r156k30102m89044M0283j36795L15628P4997L56216j26724m56085
2112G20002289k81754m88815p4921n25512J81045K24152K35595N95170J07421m2114
2121.6G19932556m65469j81732p22351k90986L97034K10343K79922j34506J45416j18790
2131.3G19051437J02616j60370k09427J36719n80597q1787R5901L39661J46484R1019
2140.9G18931656J21384k47269J70593m13895k83050J63193K80075p1182j07270K71073
2150.6G18815308j83640K42310p5150r4681j12533l78266J78223O8588M0512l9596
2160.2G18461075L50342J4953j65024J63422j08261J5259n7755O5842k87171j02081
2169.9G18350601m196L3188K00424k48184K74506R5138K27432m959r5520L32718j43356
$$ plain form
2180.5 719017792 719184799 718838425 718524094 718528748 718805008 719270859 719336014 719596100 719347458 719300461
2190.1 719300461 719176788 719228516 719247437 718537598 718534317 719028397 719865036 719846268 719581146 719681778
2199.8 719681778 719428406 719202042 718941879 719098358 718999405 719106522 719008331 718879395 719356918 719351501
2209.4 719351501 719402008 719168167 719124374 719140778 719179687 719341431 719244003 719677963 719918137 719894257 719534988
2220 719534988 719418640 719225388 718865891 719045792 718971710 719466400 719798431 719623413 719355469 719330978
2229.7 719330978 719562378 719484634 719747238 719514465 719267807 719211731 719244537 719310760 719162445 719249802
2239.3 719249802 718717346 718352203 718351669 718777542 719228058 719414673 719573669 719180679 719106369 718963470
2248.9 718963470 719349899 719283905 718649063 718665619 718448944 718695755 718456650 718452072 718711090 718583603
$$ packed form
2180.5G19017792J67007l46374l14331M654K76260M65851O5155K60086k48642m6997
2190.1G19300461j23673N1728J8921p09839l281M94080Q36639j8768k65122J00632
2199.8G19681778k53372k26364k60163J56479r8953J07117r8191j28936M77523n417
2209.4G19351501N0507k33841m3793J6404L8909J61744r7428M33960K40174k3880l59269
2220G19534988j16348j93252l59497J79901p4082M94690L32031j75018k67944k4491
2229.7G19330978K31400p7744K62604k32773k46658n6076L2806O6223j48315Q7357
2239.3G19249802n32456l65143n34M25873M50516J86615J58996l92990p4310j42899
2248.9G18963470L86429o5994o34842J6556k16675K46811k39105m578K59018j27487
$$ plain form
2258.6 718583603 718664780 718428955 718541794 718262100 718279266 718705292 718959885 719029465 718675690 718509750
2268.2 718509750 718274384 718540039 718389816 718150330 717964554 717574921 717599792 717450333 718042984 718322296
2277.9 718322296 718308945 717984695 717614059 717700729 717089310 717036362 716846771 717214661 717779770 717744980
2287.5 717744980 718059082 717738800 717649841 717366028 717282181 717001190 716472549 716747818 716846466 717440491
2297.2 717440491 717577820 717614975 717772141 717593765 717416153 716709595 716443481 716490860 716989059 717165146
2306.8 717165146 717302017 717821198 717953644 717963715 716999435 716803589 717176132 716918182 716849289 717382278
2316.4 717382278 718492203 718929214 718945084 718602524 718525391 718751373 718754578 718337708 717567139 717728729
2326.1 717728729 718327103 719269333 718972549 718496170 719534454 719769821 718654099 717653732 718409119
$$ packed form
2258.6G18583603Q1177k35825J12839k79694J7166M26026K54593O9580l53775j65940
2268.2G18509750k35366K65655j50223k39486j85776l89633K4871j49459N92651K79312
2277.9G18322296j3351l24250l70636Q6670o11419n2948j89591L67890N65109l4790
2287.5G17744980L14102l20282q8959k83813q3847k80991n28641K75269R8648N94025
2297.2G17440491J37329L7155J57166j78376j77612p06558k66114M7379M98199J76087
2306.8G17165146J36871N19181J32446J0071r64280j95846L72543k57950o8893N32989
2316.4G17382278J109925M37011J5870l42560p7133K25982L205m16870p70569J61590
2326.1G17728729N98374R42230k96784m76379J038284K35367j115722j000367P55387
$$ plain form
2334.8 718409119 719131851 718963928 718351822 718453064 719382935 719013672 718113632 717566147 717590942 717905579
2344.4 717905579 718496780 717732468 715285721 713895111 714977112 717223969 717906418 717942429 717493286
2353.1 717493286 717793045 718676758 717407990 717367249 717865753 719122696 718917999 718544693 719813232
2361.8 719813232 719585800 717731476 715684280 717049789 717101288 716196747 715506592 714387817 714248505
2370.4 714248505 713028336 712225189 711384201 710929718 710534515 710062180 709919586 708955002 708371964
2379.1 708371964 707537003 706904755 706673965 706563187 706533279 706019592 705811462 705235443 704603119 704285431
2388.8 704285431 704190979 704360809 704156952 703645020 703181915 703271332 703202515 703268738 703129654 702641830
2398.4 702641830 702477493 702238464 702108841 701506042 701642685 701760178 701020660 700810699 700645294 700826263
$$ packed form
2334.8G18409119P22732j67923o12106J01242R29871l69263r00040n47485K4795L14637
2344.4G17905579N91201p64312k446747j390610J082001K246857O82449L6011m49143
2353.1G17493286K99759Q83713j268768m0741M98504J256943k04697l73306J268539
2361.8G19813232k27432j854324k047196J365509N1499r04541o90155j118775j39312
2370.4G14248505j220169q03147q40988m54483l95203m72335j42594r64584n83038
2379.1G08371964q34961o32248k30790j10778k9908n13687k08130n76019o32324l17688
2388.8G04285431r4452J69830k03857n11932m63105Q9417o8817O6223j39084m87824
2398.4G02641830j64337k39029j29623o02799J36643J17493p39518k09961j65405J80969
$$ plain form
2408.1 700826263 700786133 700502853 699869156 699245682 699258957 699159927 699182587 698944092 698877182 698660278
2417.7 698660278 698240662 697998657 697981796 698060684 697360458 697203140 696922836 696410675 696460114 696275101
2427.3 696275101 695874786 695243530 694885635 694517059 694336395 693978271 693789520 694137573 693968735 693689651
2437 693689651 693185959 693100357 692846756 692404861 692223511 691920242 692023697 691684570 691721344 691642303
2446.6 691642303 690873642 690213623 689915237 690029068 689653702 689662247 689570618 689384995 689100189 688537369
2456.3 688537369 688432617 687690353 687261124 687007065 686458664 686041794 685784302 685982971 686207199 686274567
2465.9 686274567 685782776 685319214 684452896 683936615 683897400 683171616 683064575 682824860 682605820 682354584
2475.6 682354584 681937332 681950150 681498413 680988998 680400696 680075607 679796906 679553452 679549561 679218597
$$ packed form
2408.1G00826263m0130k83280o33697o23474J3275r9030K2660k38495o6910k16904
2417.7F98660278m19616k42005j6861P8888p00226j57318k80304n12161M9439j85013
2427.3F96275101m00315o31256l57895l68576j80664l58124j88751L48053j68838k79084
2437F93689651n03692q5602k53601m41895j81350l03269J03455l39127L6774p9041
2446.6F91642303p68661o60019k98386J13831l75366Q545r1629j85623k84806n62820
2456.3F88537369j04752p42264m29229k54059n48401m16870k57492J98669K24228O7368
2465.9F86274567m91791m63562q66318n16281l9215p25784j07041k39715k19040k51236
2475.6F82354584m17252J2818m51737n09415n88302l25089k78701k43454l891l30964
$$ plain form
2485.2 679218597 678957901 678800278 678753510 678021393 677067871 676598282 676329880 676299210 676106491 675856781
2494.8 675856781 675635300 675569839 674991074 674161758 673482208 672758179 672344131 671985550 672184143 672283783
2504.5 672283783 672056198 671648636 670950317 670651627 670519257 670343781 669460526 668689423 668640594 668713074
2514.1 668713074 668484192 667785873 667410126 666933289 666550674 666327820 666092606 665865173 665402527 665024338
2523.8 665024338 664712372 664998169 664975281 664587402 664466858 663830872 662932816 662610931 662885666 662698364
2533.4 662698364 662524719 662095871 661358948 661235352 660948563 660366669 659754181 659776917 660015259 659875488
2543.1 659875488 659226303 658546295 658522263 658365479 658230896 657650070 657071075 656657410 656209259 656265030
2552.7 656265030 655968018 655688782 655210800 654969940 654847183 654274139 653749847 653270874 653316193 652923431
$$ packed form
2485.2F79218597k60696j57623m6768p32117r53522m69589k68402l0670j92719k49710
2494.8F75856781k21481o5461n78765q29316o79550p24029m14048l58581J98593R9640
2504.5F72283783k27585m07562o98319k98690j32370j75476q83255p71103m8829P2480
2514.1F68713074k28882o98319l75747m76837l82615k22854k35214k27433m62646l78189
2523.8F65024338l11966K85797k2888l87879j20544o35986q98056l21885K74735j87302
2533.4F62698364j73645m28848p36923j23596k86789n81894o12488K2736K38342j39771
2543.1F59875488o49185o80008k4032j56784j34583n80826n78995m13665m48151N5771
2552.7F56265030k97012k79236m77982k40860j22757n73044n24292m78973M5319l92762
$$ plain form
2562.4 652923431 652883224 653041611 652561417 652190399 651677094 651437912 650698166 650079117 649998779 650016098
2572 650016098 650022202 649743347 649702072 649214249 649071426 648620377 647909546 647756195 646915665 646452026
2581.6 646452026 646360016 646461945 646447830 646237793 646309128 645833893 644964828 644160233 643971176 643637161
2591.3 643637161 643209229 643238831 643244476 643151703 642653275 642215500 641733246 641306152 640849991 640424805
2600.9 640424805 640462265 640202942 639826698 639706612 639695473 639240608 638524933 637859650 637472725 637340355
2610.6 637340355 636841393 636512222 636163483 636049614 635956039 635452042 634918709 634174881 633920822 633750954
2620.2 633750954 633511200 633295097 632718658 632053223 631782455 631821480 631411209 631330566 630852509 629502373
2629.9 629502373 628817635 629087868 629454498 629053917 628575859 628172340 627586365 626772690 626366768 626417999
$$ packed form
2562.4F52923431m0207J58387m80194l71018n13305k39182p39746o19049q0338J7319
2572F50016098O104k78855m1275m87823j42823m51049p10831j53351q40530m63639
2581.6F46452026r2010J01929j4115k10037P1335m75235q69065q04595j89057l34015
2591.3F43637161m27932K9602N645r2773m98428m37775m82254m27094m56161m25186
2600.9F40424805L7460k59323l76244j20086j1139m54865p15675o65283l86925j32370
2610.6F37340355m98962l29171l48739j13869r3575n03997n33333p43828k54059j69868
2620.2F33750954k39754k16103n76439o65435k70768L9025m10271q0643m78057j350136
2629.9F29502373o84738K70233L66630m00581m78058m03519n85975q13675m05922N1231
$$ plain form
2639.5 626417999 626038437 625657387 625047150 624796829 624820251 624653244 624384422 623558121 622815437 622072296
2649.1 622072296 621794205 621818542 621815529 622013664 621783409 621262131 620740395 620497093 619900932 619430733
2658.8 619430733 619081421 618435936 618325081 617969170 617781105 617974014 618039818 618146973 617883224 616794930
2668.4 616794930 615978203 616120262 615650787 615392570 615615234 615730400 615907021 615541573 615062599 614353027
2678.1 614353027 613860359 613518333 613037338 612577171 612366295 612770233 612635345 612255363 611781769 611302986
2687.7 611302986 611064377 610652161 610200577 609620895 609689445 610095940 610351143 610145912 609740639 609698792
2697.4 609698792 609203873 608562393 607899475 607547760 607471466 607347946 607201920 607074127 607336769 607001152
2707 607001152 606455536 606128540 605516548 605027199 605219421 605265350 604644089 604727325 604640121 604294815
$$ packed form
2639.5F26417999l79562l81050o10237k50321K3422j67007k68822q26301p42684p43141
2649.1F22072296k78091K4337l013J98135k30255n21278n21736k43302n96161m70199
2658.8F19430733l49312o45485j10855l55911j88065J92909O5804J07155k63749j088294
2668.4F16794930q16727J42059m69475k58217K22664J15166J76621l65448m78974p09572
2678.1F14353027m92668l42026m80995m60167k10876M03938j34888l79982m73594m78783
2687.7F11302986k38609m12216m51584n79682O8550M06495K55203k05231m05273m1847
2697.4F09698792m94919o41480o62918l51715p6294j23520j46026j27793K62642l35617
2707F07001152n45616l26996o11992m89349J92222M5929o21261Q3236q7204l45306
$$ plain form
2716.6 604294815 603947563 603297157 603127594 602937622 602873535 602560272 602434998 602734184 602491760 601923218
2726.3 601923218 601404305 601525421 601408348 600837708 600357666 600125732 600034752 599935379 600209427 600097122
2735.9 600097122 599962959 599667816 599102287 598918533 598688354 598660736 598452110 598114128 597978516 597936401
2745.6 597936401 598142586 598288536 597723427 597020454 597031975 596738663 596300011 596143150 596222420 596189919
2755.2 596189919 595752487 595701027 595466843 594993629 594473648 594131088 594271889 594503632 594298210 593585701
2764.9 593585701 593531456 593510475 593359261 593123055 592351570 591997223 591961823 591980934 591892776 591916504 591496468
2775.5 591496468 590689507 590241127 589556389 589160423 589160690 589016151 588333435 587953186 587884026 587514114
2785.1 587514114 587757454 587764778 587213936 586222572 585611496 585621834 585024071 584299507 583499413 583271027
$$ packed form
2716.6F04294815l47252o50406j69563j89972o4087l13263j25274K99186k42424n68542
2726.3F01923218n18913J21116j17073n70640m80042k31934r0980r9373K74048j12305
2735.9F00097122j34163k95143n65529j83754k30179k7618k08626l37982j35612m2115
2745.6E97936401K06185J45950n65109p02973J1521k93312m38652j56861P9270l2501
2755.2E96189919m37432n1460k34184m73214n19981l42560J40801K31743k05422p12509
2764.9E93585701n4245k0981j51214k36206p71485l54347l5400J9111q8158K3728m20036
2775.5E91496468q06961m48380o84738l95966K67j44539o82716l80249o9160l69912
2785.1E87514114K43340P324n50842r91364o11076J0338n97763p24564q00094k28386
$$ plain form
2794.8 583271027 583219604 582729340 582457237 581963043 581328850 580697098 580297623 579999390 579713898 579422073
2804.4 579422073 578758049 577903366 577295532 577309341 577153015 576401482 575702820 575345039 574434662 573450203
2814 573450203 573206139 572730179 572636795 572450333 571428795 570437965 569791107 569498405 569117966 568449974
2823.7 568449974 567361221 566521034 565983772 565335808 564650917 564115410 563891335 563202858 562610703
2832.4 562610703 561736755 560504532 559668388 558738747 558221588 557325211 555971832 554604225 553045959
2841.1 553045959 551830597 550668564 549305382 547671509 546034470 543910713 541667213 540068626
2848.8 540068626 538292732 536791916 535995140 535167656 534104919 533510971 533348351 533237457 533252678
2857.4 533252678 533514099 533976669 533946495 533740044 533727760 533607712 532866859 532016716 531576309 530772667
$$ packed form
2794.8E83271027n1423m90264k72103m94194o34193o31752l99475k98233k85492k91825
2804.4E79422073o64024q54683o07834J3809j56326p51533o98662l57781r10377r84459
2814E73450203k44064m75960r3384j86462j021538r90830o46858k92702l80439o67992
2823.7E68449974j088753q40187n37262o47964o84891n35507k24075o88477n92155
2832.4E62610703q73948j232223q36144r29641n17159q96377j353379j367607j558266
2841.1E53045959j215362j162033j363182j633873j637039k123757k243500j598587
2848.8E40068626j775894j500816p96776q27484j062737n93948j62620j10894J5221
2857.4E33252678K61421M62570l0174k06451j2284j20048p40853q50143m40407q03642
$$ plain form
2867.1 530772667 529978561 529252129 528650627 528165932 527953415 527874336 527099953 526407852 525563622 524715843
2876.7 524715843 524150581 523672295 523156624 522354393 522180634 522081299 521781235 521148834 520632172 520087852
2886.4 520087852 518437271 517686806 517404442 516622887 515906982 515041885 514453583 514043236 513486023
2895.1 513486023 512511635 511706543 510902939 510273361 509827995 508445816 507278404 506876984 506890221
2903.7 506890221 506717606 505860062 504493523 503168221 502298470 501143913 500395699 499797478 498742371
2912.4 498742371 497458420 495778847 494510689 493135796 491745834 490480499 488767586 487506485
2920.1 487506485 486365471 485234985 484722366 484401741 484232788 483982086 483556900 483688049 483952370
2928.8 483952370 483901901 483903923 484311600 484976349 485378265 485881615 486372604 486917114 487452240 487730598
$$ packed form
2867.1E30772667p94106p26432o01502m84695k12517p9079p74383o92101q44230q47779
2876.7E24715843n65262m78286n15671q02231j73759r9335l00064o32401n16662n44320
2886.4E20087852j650581p50465k82364p81555p15905q65097n88302m10347n57213
2895.1E13486023r74388q05092q03604o29578m45366j382179j167412m01420J3237
2903.7E06890221j72615q57544j366539j325302q69751j154557p48214n98221j055107
2912.4D98742371j283951j679573j268158j374893j389962j265335j712913j261101
2920.1D87506485j141014j130486n12619l20625j68953k50702m25186J31149K64321
2928.8D83952370n0469K022M07677O64749M01916N03350M90989N44510N35126K78358
$$ plain form
2938.5 487730598 488303604 489098816 489988060 490284729 490659790 491621132 492085648 492422523 492987289 493578033
2948.1 493578033 493678589 493942223 494541626 494635963 494625587 494859581 495370903 495316963 495290756 495635071
2957.7 495635071 495650978 495987816 496727371 497632713 498119545 498509827 498844376 498776932 498867607 499380646
2967.4 499380646 500387573 500923462 501339378 502151070 502925529 503896523 504654350 505061646 505616951
2976.1 505616951 506184921 506343460 506856537 507473488 507942200 508521309 508424644 508537941 508966827 509395218
2985.7 509395218 509990387 510173683 510156136 510460091 511029701 511100578 511157494 511097298 510471954 510426064
2995.3 510426064 510758171 510550232 510084190 509911995 509678993 509674072 509718742 509466934 509257812 508351860
3005 508351860 507542191 507469521 507147675 506658363 506758499 506676636 505942612 505548325 505250702 504930153
$$ packed form
2938.5D87730598N73006P95212Q89244K96669L75061R61342M64516L36875N64766N90744
2948.1D93578033J00556K63634N99403R4337j0376K33994N11322n3940k6207L44315
2957.7D95635071J5907L36838P39555R05342M86832L90282L34549o7444R0675N13039
2967.4D99380646J006927N35889M15916Q11692P74459R70994P57827M07296N55305
2976.1E05616951N67970J58539N13077O16951M68712N79109r6665J13297M28886M28391
2985.7E09395218N95169J83296j7547L03955N69610P0877N6916o0196o25344m5890
2995.3E10426064L32107k07939m66042j72195k33002m921M4670k51808k09122r05952
3005E08351860q09669p2670l21846m89312J00136q1863p34024l94287k97623l20549
$$ plain form
3014.6 504930153 504368057 503887558 503590622 502944107 502797661 502406578 501574821 500909309 500136795 499561195
3024.3 499561195 499103355 498431129 497791901 497407227 496750450 496271667 496184196 495906448 495166855 494285660
3033.9 494285660 493659935 492752075 492309494 491903114 491190529 490746613 490010490 489344254 488322105
3042.6 488322105 487430611 486958580 486372261 485684471 484751701 484367104 483852272 483069725 482451057 481609192
3052.2 481609192 480577736 479434853 478851662 478620949 477961235 476876945 476295700 476002007 475521812
3060.9 475521812 475175858 474777451 474517632 473935356 473206978 472174721 471388092 471614304 471079865
3069.6 471079865 470105629 469394150 468924484 468528786 467683868 466948814 466581192 466278610 465662041 465035324
3079.2 465035324 464539032 464603500 464382210 463288345 462842369 462435150 461800995 461095352 460488968 460034790
$$ packed form
3014.6E04930153n62096m80499k96936o46515j46446l91083q31757o65512p72514n75600
3024.3D99561195m57840o72226o39228l84674o56777m78783q7471k77748p39593q81195
3033.9D94285660o25725r07860m42581m06380p12585m43916p36123o66236j022149
3042.6D88322105q91494m72031n86319o87790r32770l84597n14832p82547o18668q41865
3052.2D81609192j031456j142883n83191k30713o59714j084290n81245k93693m80195
3060.9D75521812l45954l98407k59819n82276p28378j032257p86629K26212n34439
3069.6D71079865r74236p11479m69666l95698q44918p35054l67622l02582o16569o26717
3079.2D65035324m96292O4468k21290j093865m45976m07219o34155p05643o06384m54178
$$ plain form
3088.9 460034790 459304543 458950462 458334045 457702179 457612305 457586670 457201271 456168060 455343361 455113487
3098.5 455113487 454798203 453684273 452963486 452828293 452392082 452042961 451700096 451205788 450188484
3107.2 450188484 449375038 448903122 448278961 447645416 446903076 446712723 446425171 445839882 445152588 444360123
3116.9 444360123 444280891 444162064 443517647 442885818 442177658 440987129 440142136 439860115 439344482 438692398
3126.5 438692398 437938805 437546501 437263832 436606216 436105080 435827866 434954338 433697281 433133049
3135.2 433133049 432462234 431500206 430715599 430290222 430199165 429456596 428560448 427932777 427005272 426285400
3144.8 426285400 426052170 425259972 424474487 424644890 424289017 423370781 422692947 421934853 421034813 420372543
3154.5 420372543 419988289 419280624 418309021 417638054 417429733 416806679 415857925 415193825 414415627 413932762
$$ packed form
3088.9D60034790p30247l54081o16417o31866q9874k5635l85399j033211q24699k29874
3098.5D55113487l15284j113930p20787j35193m36211l49121l42865m94308j017304
3107.2D50188484q13446m71916o24161o33545p42340j90353k87552n85289o87294p92465
3116.9D44360123p9232j18827o44417o31829p08160j190529q44993k82021n15633o52084
3126.5D38692398p53593l92304k82669o57616n01136k77214q73528j257057n64232
3135.2D33133049o70815r62028p84607m25377r1057p42569q96148o27671r27505p19872
3144.8D26285400k33230p92198p85485J70403l55873r18236o77834p58094r00040o62270
3154.5D20372543l84254p07665r71603o70967k08321o23054r48754o64100p78198m82865
$$ plain form
3164.1 413932762 413561897 412654381 411585197 410831413 410072556 409550438 409520226 408992004 408065720 407224121
3173.8 407224121 406526909 405868988 405327225 404742889 403989716 403501244 402845345 402419281 401896515 401040688
3183.4 401040688 400449638 399659882 398931885 398096352 397654228 397553329 396896133 396114693 395350494 394853249
3193 394853249 394538879 394089584 393019409 391921272 391414185 390997505 390845375 390322914 389542046 389010849
3202.7 389010849 388489075 388042641 387825050 387108994 385755730 385427361 385276947 384803429 384388466
3211.4 384388466 383716660 383465729 382829475 382105713 381588745 380805206 380211868 379702835 379283600 378978424
3221 378978424 378791695 378129807 377634010 377213936 376209793 375832748 375222130 374339485 374134369 374172707
3230.7 374172707 374045334 373453140 372976685 372512817 371775932 371127853 370613632 370151024 369766731 369404678
$$ packed form
3164.1D13932762l70865r07516j069184p53784p58857n22118l0212n28222r26284q41599
3173.8D07224121o97212o57921n41763n84336p53173m88472o55899m26064n22766q55827
3183.4D01040688n91050p89756p27997q35533m42124j00899o57196p81440p64199m97245
3193C94853249l14370m49295j070175j098137n07087m16680j52130n22461p80868n31197
3202.7C89010849n21774m46434k17591p16056j353264l28369j50414m73518m14963
3211.4C84388466o71806k50931o36254p23762n16968p83539n93338n09033m19235l05176
3221C78978424j86729o61888m95797m20074j004143l77045o10618q82645k05116L8338
3230.7C74172707j27373n92194m76455m63868p36885o48079n14221m62608l84293l62053
$$ plain form
3240.3 369404678 369051552 368749390 368195724 367669220 367079239 366770096 366615372 365318413 364419136
3249 364419136 364493370 364205360 363884811 363591652 363141022 362319717 361700783 361798248 361429939 360732613
3258.6 360732613 360365715 359998055 359633942 359143829 358799667 358552284 358008766 357578011 357303963 356974297
3268.3 356974297 356781502 356515999 355591965 355087929 355207710 354674568 354373245 354181137 353576050 353197670
3277.9 353197670 352772255 352272453 351748734 351577454 351760826 351621132 351132317 350534859 350131950 349859962
3287.5 349859962 349320183 348883858 349116096 349250259 349016190 348796043 348167419 347671967 347732620 347112503
3297.2 347112503 345662498 345293541 345881424 345708809 345165215 345075455 344876137 344416389 344314041 344248619
3306.8 344248619 344248047 344324188 343951569 343177567 342066078 341597672 341333580 340474167 340117455 340163918
$$ packed form
3240.3C69404678l53126l02162n53666n26504n89981l09143j54724j296959q99277
3249C64419136P4234k88010l20549k93159m50630q21305o18934R7465l68309o97326
3258.6C60732613l66898l67660l64113m90113l44162k47383n43518m30755k74048l29666
3268.3C56974297j92795k65503r24034n04036J19781n33142l01323j92108o05087l78380
3277.9C53197670m25415m99802n23719j71280J83372j39694m88815n97458m02909k71988
3287.5C49859962n39779m36325K32238J34163k34069k20147o28624m95452O0653o20117
3297.2C47112503j450005l68957N87883j72615n43594q9760j99318m59748j02348o5422
3306.8C44248619n72P6141l72619p74002j111489m68406k64092q59413l56712M6463
$$ plain form
3316.5 340163918 339673386 339125366 339277763 338876495 338038788 337607231 337097168 336722031 336035538 335357399
3326.1 335357399 334636421 333867111 333834801 333769684 334074821 334172592 333147049 332400627 332227097 331941605
3335.8 331941605 331259422 330765266 330597687 329761848 328872681 328468552 327710228 327035408 326704063 326489983
3345.4 326489983 326148987 325475693 324862633 324121666 324072151 324219475 323600807 323336449 323132095 322685699
3355.1 322685699 322159576 321950798 321577263 320874596 320970688 320729141 320132751 319799919 319602966 319626522
3364.7 319626522 318991165 318020535 317773781 317913914 317410984 317126160 317080059 316405220 315962505 315677147
3374.3 315677147 315254459 314759159 314780712 315002804 314632053 314206295 313661613 313537045 313687038 313171387
3384 313171387 312591496 312733288 312882538 312683449 312681141 312370567 312447071 313031292 312764473 311924171
$$ packed form
3316.5C40163918m90532n48020J52397m01268q37707m31557n10063l75137o86493o78139
3326.1C35357399p20978p69310l2310o5117L05137R7771j025543p46422j73530k85492
3335.8C31941605o82183m94156j67579q35839q89167m04129p58324o74820l31345k14080
3345.4C26489983l40996o73294o13060p40967m9515J47324o18668k64358k04354m46396
3355.1C22685699n26123k08778l73535p02667R6092k41547n96390l32832j96953K3556
3364.7C19626522o35357r70630k46754J40133n02930k84824m6101o74839m42715k85358
3374.3C15677147m22688m95300K1553K22092l70751m25758n44682j24568J49993n15651
3384C13171387n79891J41792J49250j99089k308l10574P6504N84221k66819q40302
$$ plain form
3393.6 311924171 311516781 311436195 311169300 311090336 310984993 310833149 310745831 310613785 310798435 311045971
3403.3 311045971 311138172 310442486 309828262 309883556 310067730 310327072 309834862 309723282 310214119 310304070
3412.9 310304070 310422497 310504475 310382233 309931812 309867287 310318890 310516949 310201607 309733982 309932594
3422.6 309932594 310633488 311300297 311472778 311343594 311388206 311286602 311110516 311297665 311706448 312407475
3432.2 312407475 313016624 312860146 312755165 313191814 314025993 314431953 313895454 313515587 314150734 314879551
3441.8 314879551 314381943 314668083 315538349 316215534 317419014 317353897 317657223 318386898 318422813 318939953
3451.5 318939953 319839306 320661430 320858307 321363411 321749992 321872025 322436752 322943420 323856735 324636841
3461.1 324636841 325044212 325044174 325517044 326369591 327000237 327815781 328042183 328806267 329398308 329508133
$$ packed form
3393.6C11924171m07390q0586k66895p8964j05343j51844q7318j32046J84650K47536
3403.3C11045971R2201o95686o14224N5294J84174K59342m92210j11580M90837Q9951
3412.9C10304070J18427Q1978j22242m50421o4525M51603J98059l15342m67625J98612
3422.6C09932594P00894O66809J72481j29184M4612j01604j76086J87149M08783P01027
3432.2C12407475O09149j56478j04981M36649Q34179M05960n36499l79867O35147P28817
3441.8C14879551m97608K86140Q70266O77185J203480o5117L03326P29675L5915N17140
3451.5C18939953Q99353Q22124J96877N05104L86581J22033N64727N06668R13315P80106
3461.1C24636841M07371l8M72870Q52547O30646Q15544K26402P64084N92041J09825
$$ plain form
3470.8 329508133 330189896 330970802 332144966 332832146 333270111 334011192 334723587 335036278 335637894
3479.5 335637894 336903152 337563744 337979355 338316078 339503021 340081024 339872818 341274757 342515678
3488.1 342515678 343512039 344449692 345052223 345507965 345981216 346996269 347838898 348788567 349110985
3496.8 349110985 349438820 350608635 352068024 353355637 353820877 354666824 355310402 355695343 356663094
3505.5 356663094 357680130 358621254 359660759 360683632 361039085 361894341 362628098 363290520 364557724
3514.2 364557724 365651741 366466713 366872025 367892838 368667068 368941383 370187569 372187729 373558235
3522.9 373558235 373259506 374023323 375841522 377568550 378744011 379165878 379608841 379973068 380653000
3531.5 380653000 382094154 384057655 385289307 386702957 387842712 387578735 388543663 389835052 390868187
$$ packed form
3470.8C29508133O81763P80906J174164O87180M37965P41081P12395L12691O01616
3479.5C35637894J265258O60592M15611L36723J186943N78003k08206J401939J240921
3488.1C42515678R96361R37653O02531M55742M73251J015053Q42629R49669L22418
3496.8C49110985L27835J169815J459389J287613M65240Q45947O43578L84941R67751
3505.5C56663094J017036R41124J039505J022873L55453Q55256P33757O62422J267204
3514.2C64557724J094017Q14972M05312J020813P74230K74315J246186K000160J370506
3522.9C73558235k98729P63817J818199J727028J175461M21867M42963L64227O79932
3531.5C80653000J441154J963501J231652J413650J139755k63977R64928J291389J033135
$$ plain form
3540.2 390868187 392146492 393659935 394899940 396406555 397396584 397298470 399039421 399711876 400889740
3548.9 400889740 402913170 404749146 406538315 405602531 406758156 408407364 410176086 412153320
3556.6 412153320 412250252 413928146 415574989 417446289 418809013 420243988 421722832 422339325 426225739
3565.3 426225739 427391014 427437515 428395195 427881508 430941048 432659645 433649521 435387650 437813835
3574 437813835 439365501 440530777 442412605 442823639 445290642 447548027 448466072 450159073 452327080
3582.6 452327080 454251060 454923744 458799286 461366653 460534782 461976585 461142006 463597221 466759567
3591.3 466759567 469827003 471653366 473021202 476455040 475809402 477764702 481382942 482480621
3599 482480621 484708061 485779419 487387390 489486656 490536499 491935883 495323753 499364395 499427452
$$ packed form
3540.2C90868187J278305J513443J240005J506615R90029r8114J740951O72455J177864
3548.9D00889740K023430J835976J789169r35784J155625J649208J768722J977234
3556.6D12153320R6932J677894J646843J871300J362724J434975J478844O16493L886414
3565.3D26225739J165275M6501R57680n13687L059540J718597R89876J738129K426185
3574D37813835J551666J165276J881828M11034K467003K257385R18045J693001K168007
3582.6D52327080J923980O72684L875542K567367q31871J441803q34579K455215L162346
3591.3D66759567L067436J826363J367836L433838o45638J955300L618240J097679
3599D82480621K227440J071358J607971K099266J049843J399384L387870M040642O3057
$$ plain form
3607.7 499427452 502831497 502952271 501214676 508183212 511318283 509805603 513378334 513103943 516294441
3616.4 516294441 520547562 520965080 523102303 523598442 524567909 528112183 531313210 533461647 536770668
3625.1 536770668 539490395 541092949 547720184 550420685 542831154 546387138 550053864 555220375
3632.8 555220375 557674179 556306152 558484001 561739578 564548798 566019630 568084488 571093102
3640.5 571093102 574262161 576040573 576234207 578269501 582456703 589155540 590300026 588783112
3648.2 588783112 595922356 596275864 591876602 591183281 596556740 601251411 605695686 611554146 604498329
3656.9 604498329 605555267 610765648 612257195 614325638 615850372 618666725 619920959 621186142
3664.6 621186142 623454895 624902267 630038223 633141975 633153191 634609909 628071899 629536934 637202415
$$ packed form
3607.7D99427452L404045J20774j737595O968536L135071j512680L572731k74391L190498
3616.4E16294441M253121M17518K137223M96139R69467L544274L201027K148437L309021
3625.1E36770668K719727J602554O627235K700501p589531L555984L666726N166511
3632.8E55220375K453804j368027K177849L255577K809220J470832K064858L008614
3640.5E71093102L169059J778412J93634K035294M187202O698837J144486j516914
3648.2E88783112P139244L53508m399262o93321N373459M694671M444275N858460p055817
3656.9F04498329J056938N210381J491547K068443J524734K816353J254234J265183
3664.6F21186142K268753J447372N135956L103752J1216J456718o538010J465035P665481
$$ plain form
3673.3 637202415 647794418 652192993 633224182 633451500 640113525 645230713 643254395 642559586
3681 642559586 645269775 647446823 649272385 649586411 650148544 655084991 662910233 654040070 649422760
3689.7 649422760 659187851 653675842 652296677 657624664 658107300 659479980 660003128 659932175 661463623
3698.4 661463623 662114410 664460144 667760620 662927170 659152527 663649597 666575928 667696381
3706.1 667696381 668112183 670184937 674822769 668298874 670914993 675455475 661515503 665642700
3713.8 665642700 670616760 670401535 670596161 673704681 676154709 672270203 672519379 679074173 676881485
3722.5 676881485 671490402 676396484 678270416 677559662 673506699 672638626 676596069 677923508 684699020
3731.2 684699020 684179459 674835739 683272095 686043167 676247253 675513458 677738876 678098526 680138931
$$ packed form
3673.3F37202415J0592003M398575j8968811K27318O662025N117188j976318o94809
3681F42559586K710189K177048J825562L14026N62133M936447P825242q870163m617310
3689.7F49422760R765091n512009j379165N327987M82636J372680N23148p0953J531448
3698.4F61463623O50787K345734L300476m833450l774643M497070K926331J120453
3706.1F67696381M15802K072754M637832o523895K616119M540482j3939972M127197
3713.8F65642700M974060k15225J94626L108520K450028l884506K49176O554794k192688
3722.5F76881485n391083M906082J873932p10754m052963q68073L957443J327439O775512
3731.2F84699020n19561r343720Q436356K771072r795914p33795K225418L59650K040405
$$ plain form
3739.8 680138931 681988525 677420883 681681290 695344620 688609924 669660110 678078384 682774887
3747.5 682774887 688083344 688276596 679344559 689091415 683560104 674269333 679228134 683997574
3755.3 683997574 687785797 682456512 684305573 689940186 681679687 679579010 683447189 684670715
3763 684670715 685443344 689864578 687992706 682175980 684961166 690731430 692634506 683214417 683360748
3771.7 683360748 686101608 686606598 687724304 687125320 687738113 688366470 692050781 693541870 684634018
3780.3 684634018 685810471 687945557 689101868 691683731 688691406 686856155 687800598 689013977
3788 689013977 689883194 690094986 690559998 689507294 689347305 689150314 690462112 695265503 692317505
3796.7 692317505 686689453 688104858 692363052 699531021 694171753 682560806 686183701 688902130
$$ packed form
3739.8F80138931J849594m567642M260407J3663330o734696j8949814Q418274M696503
3747.5F82774887N308457J93252q932037R746856n531311r290771M958801M769440
3755.3F83997574L788223n329285J849061N634613q260499k100677L868179J223526
3763F84670715P72629M421234j871872n816726K785186N770264J903076r420089J46331
3771.7F83360748K740860N04990J117706n98984O12793O28357L684311J491089q907852
3780.3F84634018J176453K135086J156311K581863k992325j835251R44443J213379
3788F89013977Q69217K11792M65012j052704j59989j96991J311798M803391k947998
3796.7F92317505n628052J415405M258194P167969n359268j1610947L622895K718429
$$ plain form
3804.4 688902130 692828827 698536224 690887527 685428772 689539032 691485519 691422882 691876755 691374664
3813.1 691374664 692479858 699647293 699755707 683543777 687673950 694501419 700693512 702925034
3820.8 702925034 684010162 685974731 690913925 692082443 694645538 694656754 690222168 690076523 691754608
3829.5 691754608 695292892 698329544 689812088 690657425 698017197 692650299 691164856 699841156
3837.2 699841156 693270874 688937759 696137772 689183044 688255005 696214676 694256363 688586349
3844.9 688586349 691032104 693106842 692945633 694690247 694897079 696901932 701425629 694816208 698399277
3853.6 698399277 687191010 685517273 695433960 695039978 692235336 693513565 695162582 697397385
3861.3 697397385 692267303 692409286 699475784 694123459 687702255 690705414 696400833 703955078
$$ packed form
3804.4F88902130L926697N707397p648697n458755M110260J946487o2637M53873n02091
3813.1F91374664J105194P167435J08414j6211930M130173O827469O192093K231522
3820.8G02925034j8914872J964569M939194J168518K563095J1216m434586j45645J678085
3829.5F91754608L538284L036652q517456Q45337P359772n366898j485443Q676300
3837.2F99841156o570282m333115P200013o954728r28039P959671j958313n670014
3844.9F88586349K445755K074738j61209J744614K06832K004853M523697o609421L583069
3853.6F98399277j1208267j673737R916687l93982k804642J278229J649017K234803
3861.3F97397385n130082J41983P066498n352325o421204L003159N695419P554245
$$ plain form
3869.1 703955078 695932388 684597397 687735596 694921646 700136948 689587021 688856125 691721191
3876.8 691721191 691373520 694409103 700390244 697504807 688617783 693189087 694896011 695887146 700704041
3885.4 700704041 688357773 688363571 692191238 692735214 696584778 696640549 689418335 690148468 693043365
3894.1 693043365 691725922 693042831 694890823 697517395 698866730 688674164 693707809 696358643
3901.8 696358643 690434036 695650864 693551102 690739441 690751495 691493454 693137436 692608871 693014450
3910.5 693014450 692672882 692523193 693009644 692966385 694363174 696534958 693089828 689081650 693774490
3919.2 693774490 694726868 690453796 691898804 693432846 694795532 693585052 691127090 691975479 692585297
3927.9 692585297 693698959 692935028 693048935 695967712 693543854 691588135 692533493 691397705 691226578
$$ packed form
3869.1G03955078q022690j1334991L138199P186050N215302j0549927p30896K865066
3876.8F91721191l47671L035583N981141k885437q887024M571304J706924R91135M816895
3885.4G00704041j2346268N798L827667N43976L849564N5771p222214P30133K894897
3894.1F93043365j317443J316909J847992K626572J349335j0192566N033645K650834
3901.8F96358643n924607N216828k099762k811661J2054P41959J643982n28565M05579
3910.5F93014450l41568j49689M86451m3259J396789K171784l445130m008178M692840
3919.2F93774490R52378m273072J445008J534042J362686j210480k457962Q48389O09818
3927.9F92585297J113662p63931J13907K918777k423858j955719R45358j135788j71127
$$ plain form
3936.6 691226578 692314529 692165298 691467819 691110840 693132553 695097733 691432266 690290451 690982590
3945.2 690982590 691713333 693901901 692241287 692493896 693061676 690435715 691576309 692301102 691890717
3953.9 691890717 691865234 692119751 691850815 690635605 691587448 691662445 691564865 691982040 690752869 690681992
3963.6 690681992 690911484 690613251 690436249 690458298 690730743 690801163 691101379 692306595 693024445 692305984
3973.2 692305984 691925659 692055588 692085724 691326828 690788345 691354599 691976242 692476044 692145157 691941376
3982.8 691941376 692435684 691869049 690869827 690961151 691267624 691509705 691663437 691055679 691298752 691683884
3992.5 691683884 692023163 692366257 691076202 690216827 690344772 690914001 691622162 691926270
4000.2 691926270
$$ packed form
3936.6F91226578J087951j49231o97479l56979K021713J965180l665467j141815O92139
3945.2F90982590P30743K188568j660614K52609N67780k625961J140594P24793m10385
3953.9F91890717k5483K54517k68936j215210R51843P4997r7580M17175j229171p0877
3963.6F90681992K29492k98233j77002K2049K72445P0420L00216J205216P17850p18461
3973.2F92305984l80325J29929L0136p58896n38483N66254O21643M99802l30887k03781
3982.8F91941376M94308n66635r99222R1324L06473K42081J53732o07758K43073L85132
3992.5F91683884L39279L43094j290055q59375J27945N69229P08161L04108
4000.2F91926270
##END=$$ End of the data block
