##TITLE=$$ Begin of the data block
##JCAMP-DX=5.00 $$ ACD/SpecManager v 10.08
##SPECTROMETER/DATA SYSTEM=Varian
##DATE=08 Jan 2013 15:41:22
##DATA TYPE=INFRARED SPECTRUM
##DATA CLASS=XYDATA
##ORIGIN=
##OWNER=
##NPOINTS=3735
##FIRSTX=399.26403809
##LASTX=4000.35498047
##MAXX=4000.35498047
##MINX=399.26403809
##MAXY=73.46997070
##MINY=30.94551849
##XFACTOR=1.0000000000
##YFACTOR=0.000000100000000
##FIRSTY=48.17471695
##DELTAX=0.96440572
##XUNITS=1/CM
##YUNITS=TRANSMITTANCE
##XYDATA=(X++(Y..Y))
399.3 481747169 473634262 482968445 494250603 490257950 489204407 488259315 494062080 500171547
407 500171547 498224030 495724220 490945930 489545784 488787956 491061745 491347046 488104630 488909340
415.7 488909340 490541992 487986069 471572189 469095840 477816467 482196617 484415703 483940887
423.4 483940887 485555916 488078461 492838783 492948074 488373451 487466965 487310333 482518196 482164154
432.1 482164154 484707375 481897354 482129822 486695976 492447433 491879425 487800217 487938080 487814102
440.7 487814102 488264046 484514046 483628426 488815231 489513397 486834068 482194977 483957901 483532867
449.4 483532867 481633759 488016586 490480499 486188049 482830315 482521629 484551010 487388344 488155785
458.1 488155785 487829742 488767967 483844986 480883484 484480553 484768524 483494987 483714333 483577271
466.8 483577271 481743774 477752762 474686928 474481430 472931709 472349701 480182419 483544846 479956284
475.5 479956284 478332176 476174736 471303864 471691208 470593262 471148529 475716286 474464111 472243423
484.1 472243423 470838585 467282829 467966309 473236008 473834000 471576347 473829079 474390717 472809372
492.8 472809372 475000229 475612488 473705292 471207504 468282661 469894753 471002960 468391685 469110603
501.5 469110603 469471016 468289146 468391190 469976349 472630005 469112587 465211143 468155327 471338844
510.2 471338844 469993935 468550262 468811111 467746658 464369240 462247505 463047447 463317833 464669342
518.9 464669342 464939079 463673935 463038177 461067924 461847076 463677177 464097252 462339172 460196495
527.5 460196495 459905586 458924866 459749413 460597191 460675354 461929741 462056351 461390457 458335266 456241417
537.2 456241417 456867676 457220688 458276482 459286308 460184479 460409660 458953857 457173233 455633011
545.9 455633011 454945030 453636513 452423363 453891525 455568733 456151505 456113205 456466751 456639748
554.5 456639748 454003143 452298317 452572708 453151627 453541946 453640289 454451485 453681183 453645706 454315643
564.2 454315643 453531342 453173866 452768898 453017654 451958923 451401253 452903366 453345261 453168907
572.9 453168907 453142853 454037437 452621346 449493523 449413643 450804749 452314644 452838516 452954178
581.5 452954178 452754402 452431831 452593079 452904816 452918663 452713928 452771568 452418060 453935814 456543274
591.2 456543274 457830048 457395325 454063568 451823959 453450928 455491829 455687180 455871010 456913795
599.9 456913795 456431046 456225510 456608963 456385612 455852547 454628220 454417572 454401436 453631592 454781418
609.5 454781418 456406364 456481628 456017838 453901863 452355995 452877197 453234634 454187698 454065208
618.2 454065208 453482666 454642754 455632133 456494637 456961250 456166801 455515480 455439796 455488586 456516075
627.8 456516075 458319321 459829063 461510010 462816620 463675117 464630432 464495506 464574089 466329460
636.5 466329460 467666779 468368187 469631653 471703949 473735886 473838730 472972183 472469559 472346611
645.2 472346611 474067917 475734329 476843033 479051743 480484467 480723991 480355034 479750481 478963852
653.9 478963852 478776398 479224930 479641266 481135902 482329292 482655182 482776680 482410545 481100540
662.5 481100540 479990540 480518646 481237030 482964821 485312042 485640144 484661598 483033028 482580605
671.2 482580605 483527794 484840851 485609436 486083603 487639809 488323975 488402100 488574448 490043983
679.9 490043983 492138824 492380219 493135338 494203606 494600639 495265350 495487633 495557823 496222420 496985664
689.6 496985664 497144203 496874733 497218895 498007469 498583031 499247322 499768829 500625648 500720482 499907341
699.2 499907341 500034637 500539703 501800194 502438507 501685715 501700554 502713089 503632088 504375687 505482903
708.8 505482903 505238838 505175896 506019974 506164932 507041245 507551460 508090706 509193192 510346603 511772232
718.5 511772232 511714478 510733185 510841522 511809196 512006378 512257156 513710136 515504456 516712151
727.2 516712151 517263031 518132248 518803902 519429665 519445457 519513168 520417023 520351105 520673866 522046967
736.8 522046967 523599358 524347191 524433708 524938354 525616531 526028366 525982323 526843376 527918587 529078178
746.5 529078178 530238228 530544815 530651550 529993935 530385933 531886101 532997780 533337402 533824692
755.1 533824692 536153336 537457848 537305183 537596397 537605667 537578163 538932076 540458984 540811653 541008377
764.8 541008377 540878639 540834770 541495476 542359772 542064514 541663589 542347527 542579956 542943687 543484955
774.4 543484955 544474564 545147514 544804153 544770737 544720192 544580956 544575424 545556297 545713615 545098953
784.1 545098953 545642090 546401100 547757339 548371429 547990112 547589607 547524300 547577133 547051430 546687889
793.7 546687889 546740379 547783356 547833290 546616364 546680260 547133293 545930405 544208412 544166374 543989182
803.4 543989182 542893524 541788902 541062851 540372963 538712997 536376572 534315720 532875023 531321220
812 531321220 530639610 530355797 530181770 530386620 529972076 529811211 529049988 527515640 526323624 525948410
821.7 525948410 525792694 525994072 527556152 529025421 530952988 533358154 534974785 535330048 535935555
830.4 535935555 538746338 540919876 542381287 544294510 546175537 547991257 549897461 551510162
838.1 551510162 551645317 552290878 553451080 554842987 555940094 556569862 558607101 561024895 563014297
846.8 563014297 564497528 566522408 567719116 568137627 569302711 570804825 572793541 573557892 574935226
855.4 574935226 576654778 578549690 580564995 581001778 581773987 582133713 583101501 584040794 584607124
864.1 584607124 584856644 584809875 585335503 584548874 584893074 584281273 582090683 580284004 578674812
872.8 578674812 577800713 576359215 576464462 576569252 575910645 575970192 576186256 575904770 574719124 574997940
882.4 574997940 575414391 575103569 574352875 573710403 573608665 573615952 573795700 572835312 572874832 573552780
892.1 573552780 573829613 573904495 573648148 574285240 574785194 575001831 574829521 575020447 574782104 574187202
901.7 574187202 574532852 574911690 575793343 576543427 577355385 578066025 579216347 580236740 580989456
910.4 580989456 581972961 581145020 580983353 580447998 579752808 579897575 578348389 575842285 573157806
919.1 573157806 571994591 570623055 568701324 566827469 564196548 561562920 558768120 556533318
926.8 556533318 554258766 552587547 550744209 548301773 546635284 545368156 544785919 544105568 543420944
935.5 543420944 542562561 542033806 541831474 541134720 540417900 539309006 538924065 538488121 537823639 537639122
945.1 537639122 537141724 536655273 536582756 536085739 534360504 533657341 533122559 532025909 531378174 530379829
954.8 530379829 529117737 526929054 525072670 523225670 520931625 518839836 516849060 515972481 514510307
963.4 514510307 512148628 510651207 510104790 508936920 506651878 504758759 503712502 502666664 500654335
972.1 500654335 498464699 496590958 494796104 492587509 490456200 488489952 485388031 482319183
979.8 482319183 479479256 476251335 472687225 469159470 465816307 462512474 459195328 455457649
987.6 455457649 451995850 448740807 445646935 442311172 438789902 435115814 431290169 428606987
995.3 428606987 425993118 422880096 419755745 417014351 414477425 412136688 409990501 407603188
1003 407603188 405757027 403986130 402716064 402020416 400970650 399784126 398302040 396672287 395220757
1011.7 395220757 393433151 391509895 390804787 390124969 388353119 386077423 383894653 382054787 380308342
1020.3 380308342 378630066 376364288 374440117 372757912 371736221 371068306 368949776 367209702
1028.1 367209702 366047401 365138931 364016190 363278656 362824974 361777611 361356163 361023483 361219521
1036.7 361219521 361684608 362552109 362813034 363249664 364654579 364862862 365154877 364718819 364449539
1045.4 364449539 363999329 363173981 363330345 363026924 362884064 361612511 361121101 361435928 361331329
1054.1 361331329 361041374 359976578 360434418 360841522 361271439 361740150 362820625 364461823 365208778
1062.8 365208778 366567612 367526550 368730049 370162582 372331848 374158516 374825325 376010666 376553421
1071.5 376553421 377216301 377825470 378166008 378220062 378919487 379206200 378901405 380840530 381850128
1080.1 381850128 382743530 383983765 384213715 384914627 386317177 387838821 388580284 390281830 391816673
1088.8 391816673 393491135 395367126 396254501 397459412 398652496 400448418 401377678 402240791 404142075
1097.5 404142075 405874290 407615051 408617287 409580116 410594444 411644249 412855034 414007797
1105.2 414007797 414921455 416418877 418412590 419102287 419852486 420341797 420676994 421485634 421936111
1113.9 421936111 422766151 423553276 424223785 424310303 424210777 423872795 423156776 423263817 423372154 423847122
1123.5 423847122 424174118 424421387 425499229 426822052 427756844 428219147 429549370 431098022 432347336
1132.2 432347336 433351364 434356995 436410103 438563042 440455170 442327690 443472404 444150887
1139.9 444150887 444802551 445074615 445552864 446673508 447805977 448997498 450017014 450638275 450933075
1148.6 450933075 451011620 451558495 451886444 451120758 450473862 450584984 450470314 450350533 450627136 450372658
1158.3 450372658 449925194 449455528 448598289 447874069 447715034 448149529 448684959 449414673 450536613
1166.9 450536613 452009430 453710594 455177460 456720200 458297310 459200134 460175323 461753616 464053841
1175.6 464053841 466491890 468225555 470019760 471990700 473343163 474091721 475053177 476053848 476964645
1184.3 476964645 477791252 478809776 480060501 480505066 480754051 480673943 480196228 479929123 479342041
1193 479342041 478670273 478176003 477552223 477036705 476664505 475899010 474893303 473952484 472892914 471463051
1202.6 471463051 470276375 469253464 468359947 468087997 467478867 467042732 466539879 465263519 464264908
1211.3 464264908 463787537 463598289 463138466 462895699 462762070 462607040 463205910 463353310 462910652 462543831
1220.9 462543831 462167320 461932068 461787834 461637268 461317940 461335754 461196136 460234947 459506721 459112778
1230.6 459112778 458515320 457804413 457226486 456897087 456456528 456227989 456322899 456211472 455961761 455613365
1240.2 455613365 455255661 454550552 453805809 453858032 453899345 453472595 453265038 453399162 453325653 452814560
1249.9 452814560 452121468 451831512 451824951 451630249 451628189 452006645 452584801 452375641 451762161 451988258
1259.5 451988258 452229881 452071228 452021217 452347183 453177795 454181480 454691811 454994125 455570183 456455193
1269.2 456455193 457269821 457435379 457996559 459073982 460110054 461425209 462778358 463976746 465255928
1277.8 465255928 466671753 467165565 467079391 467848129 469042664 470430336 472227554 473732643 474972878
1286.5 474972878 476448708 477949181 479179230 479798775 480241013 481009026 482046700 482959480 483996124
1295.2 483996124 485180206 486078262 486901245 487066193 487097015 487261467 487425880 487604294 487850800 488613663
1304.8 488613663 489098740 489648476 489738083 489299507 488953400 488579979 488617859 488062325 487836914 488110847
1314.5 488110847 488406982 489095116 489510727 490051270 490132675 490248604 490702438 491112061 491677055 492014771
1324.1 492014771 492716446 493553162 494203529 494553566 494379845 493872261 493569298 493407059 492915039 492259293
1333.8 492259293 491825562 492132759 492540245 492542992 492406502 492272873 491967926 491670151 491768761 491865234
1343.4 491865234 492660484 493475914 494008331 494575233 494766960 495385056 495320702 494900436 494497223 493981705
1353.1 493981705 493669891 493307419 493380814 493254395 493499756 493302574 492718697 492401886 491953354 492116127
1362.7 492116127 491021271 490575638 490429268 489735336 489234886 488145752 487585602 487125473 486420631
1371.4 486420631 486249237 486498413 486833267 486866798 486580276 486043129 485598526 484836197 484287643 483895798
1381 483895798 483275375 482262077 481307602 481044922 481110573 481205559 479279289 478162231 477888489 476902428
1390.7 476902428 475837936 474704514 474562149 473749580 471276016 469815865 469037056 468487434 466346779
1399.3 466346779 464731674 463446770 461870003 460719681 459917336 458346863 456403542 455583801 454660683
1408 454660683 453612976 452187958 450979652 450352745 449377060 448948135 448979416 449300385 448951225 448364143
1417.7 448364143 449672623 448161583 447376442 448501320 448854675 449380951 449251328 449853630 450903053
1426.3 450903053 451281853 452172775 453148880 453515434 453489532 454305458 455468330 456470108 458095016
1435 458095016 459788933 459010506 458742065 460225182 460710754 461046104 462124214 463083534 463937340
1443.7 463937340 463955231 464057579 464889450 465997086 465465622 465076294 465639381 465944023 466713219 467191696
1453.3 467191696 468319473 469635201 470487213 471014290 469697342 471020660 471559486 473192139 474707260
1462 474707260 475804482 477619476 478021622 479070778 480316238 481919785 483664513 485390167 487899971
1470.7 487899971 490074654 492685814 494940720 497090797 499696083 501333961 502438049 504452095
1478.4 504452095 506478462 508302422 509581070 510717621 512351913 513771248 515030251 516498642
1486.1 516498642 517447433 517306023 518362389 517942772 516483536 516691704 516624794 516069031 515287018
1494.8 515287018 515134087 510521049 509454422 508618240 505110207 504330482 503180580 501591377 500180893
1503.5 500180893 500338478 500229378 496071777 492409439 492411499 493413963 492317886 493294334 493109055
1512.2 493109055 491495476 491620636 491392441 491463852 489405365 486054649 487134743 488973122 488011246
1520.8 488011246 485754280 486606445 487373772 489274673 489291115 489650879 490686951 490739098 490844536
1529.5 490844536 491222496 492309723 493775978 495351410 494108162 494716530 495423851 496152534 498410339
1538.2 498410339 497906151 495669327 497705688 499367409 498413696 499262276 501167259 500292740 501106834
1546.9 501106834 501437912 502347488 502965813 502209129 503480721 504747505 506738510 506129303 506244812
1555.6 506244812 508252411 509871407 509414864 502663803 501920662 503506126 505194511 505184898 505220375
1564.2 505220375 503982468 502238197 501735535 500434723 500153046 494290771 492986298 492143555 490028954
1572.9 490028954 488834152 487493668 486943855 477466660 476509552 474497299 471326256 468897781 465741005
1581.6 465741005 463813400 460005531 457711334 454233971 450960770 447822762 443904572 441516151
1589.3 441516151 437129440 434544792 430550575 428048820 425204811 421239243 418728790 414519005
1597 414519005 412383766 408218689 405830994 403072891 400444527 398750572 395146027 393686676 390473099
1605.7 390473099 389059677 385874519 384226570 382900429 379745941 379338531 376719017 376390648 374432983
1614.4 374432983 374409485 374588356 368192825 369401360 368250427 368763771 367609673 368800468 368975906
1623.1 368975906 366386108 367122002 366583748 368753204 367329407 366719856 366830864 367477989 368675461
1631.7 368675461 369081688 371653023 372335663 373711014 372010918 373736610 374081078 374765701 376672974
1640.4 376672974 376661415 378976517 379274788 381491241 383986282 383830299 385814629 384349060 386451988
1649.1 386451988 387037468 389559593 391847115 396759338 394221382 390623283 393444977 394224281 396248703
1657.8 396248703 397023201 398328857 400083847 401891708 404964333 404491730 407440567 409358978 411688652
1666.5 411688652 414201431 416391220 418503456 419462280 423972588 425426407 428611755 432073593
1674.2 432073593 434875755 436848297 439360046 443582153 446457748 450443687 452634048 456392212
1681.9 456392212 461732903 465596008 469229927 469325676 474442482 478038673 481318970 485123711 488379517
1690.6 488379517 492892113 496790123 501159401 505805130 510550537 510748100 515380135 521587334
1698.3 521587334 527863350 534334068 530297813 535633125 540165939 543961525 547122803 550346870
1706 550346870 552413597 554198189 557787819 560584106 562659645 564998970 567669601 570607262 571837616
1714.7 571837616 572925262 576882553 580973091 576425896 577698288 580613060 582726402 584633865
1722.4 584633865 585676804 586663055 588143845 589325829 589930382 591093369 593516731 594421234 594992065
1731.1 594992065 598347549 602301483 602377319 597854195 601246071 604754257 606498451 609372101 610624657
1739.8 610624657 608945160 612500839 616436348 618314743 619919281 623074837 625464516 626657867
1747.5 626657867 628566666 630517273 635004120 637573090 638516960 642528610 645257568 648045349
1755.2 648045349 651384277 651375732 652494888 655466995 657946777 661506119 661875763 662072830 665382309
1763.9 665382309 666854324 668095016 670001907 671944580 670042419 671483002 676146393 677015457
1771.6 677015457 675362396 674546204 678082886 680690384 680146179 681572723 682456665 683858337 684545059
1780.3 684545059 684260941 685409546 687080688 688895493 688876419 688905258 690001373 690849915 691658249
1788.9 691658249 693739014 695104141 695549927 694092712 693183441 696371078 697539749 696947708 697889099
1797.6 697889099 700009384 700866318 699847260 701953812 701886063 701848907 703407135 704204178 705135345
1806.3 705135345 705475311 705216293 705615997 707367554 707006607 707399368 708609619 708820190 709808655
1815 709808655 709982452 710686340 710385971 710532074 711690292 712181854 713225632 713155975 714477386 715879517
1824.6 715879517 713775253 713268814 714958954 717155685 717714691 715160675 715441513 717403870 717771454
1833.3 717771454 718190765 718662720 718991623 718954620 718017960 719187012 719628983 720134659 721010056 722823029
1842.9 722823029 725127716 720625534 721112366 722679291 722456436 721861420 722271576 723316269 723426590
1851.6 723426590 724166107 724208908 724663315 724875031 724827423 725488052 725263519 725171738 725048828 725986328
1861.3 725986328 726228638 726410751 727036057 727165604 727958374 727941132 729046860 728116608 726381149
1869.9 726381149 727515564 728354568 728720474 728547058 729119797 728872223 728929062 729419556 729373169 729528427
1879.6 729528427 729172668 729615402 729908905 730588531 730825272 730335617 730416489 730408554 731421051 731501541
1889.2 731501541 730086975 730145874 731212006 731566696 731836700 731775208 730459595 730853043 731150055
1897.9 731150055 731695786 732100143 731783981 732079239 732021484 732364578 732343521 732437134 732426300 732354355
1907.6 732354355 732695923 732847824 732717438 732186127 733140030 733154678 732919006 733009033 732918320 734305649
1917.2 734305649 733142014 732420883 733368912 733968353 734699707 733788757 732710190 732724686 733184204
1925.9 733184204 733304825 733367081 733071289 732956924 733361282 733556213 734056396 733897858 733966904 733716660
1935.5 733716660 733028793 732558212 732444916 732933350 732601471 733393097 733911819 732438278 732532730 733242569
1945.2 733242569 733124771 732593536 732884903 732849045 732654724 732515945 732643890 732781143 732415619 732546921
1954.8 732546921 732181320 732180939 732354507 732425919 732574310 732243576 732049103 731564484 731577301 731523972 731897125
1965.4 731897125 732597351 732024841 731531448 731607819 731944199 731896515 732176666 732212143 731948853 732026215
1975.1 732026215 731871109 732000122 731860352 732214813 732284164 731853943 731771011 731565018 731646729 731480865
1984.7 731480865 731464920 731482697 731716614 731625748 731397705 732019958 731847839 730784225 730228195 730817871
1994.3 730817871 730958176 730673981 730490952 730056992 730628815 731049576 731214523 730938492 730681534 730694046
2004 730694046 730361252 730175400 729608078 729678650 729807739 730034943 730025558 729561386 729794159 729501801
2013.6 729501801 729332504 729151764 728860703 728497925 728307114 728729019 729127502 729436951 728771896 728456268
2023.3 728456268 728198166 727772446 727671814 727327194 727409744 727430725 727909851 728162231 728300934 728234024
2032.9 728234024 727505875 727184830 727009964 727123108 726529465 726427383 726823502 726842728 726769562 726122818
2042.6 726122818 726210251 726441422 726689453 726133728 725688324 726026688 725603256 725519180 725266418 725220032
2052.2 725220032 724926529 724903030 725337753 725121994 725419312 725419464 725406570 725074768 725075836 725259857 724822083
2062.8 724822083 724824753 724444046 724408417 724220276 724238663 724343796 724202957 724587936 724154892 723752136
2072.5 723752136 723550568 723517838 723553162 723737183 724068298 724378052 724851761 724365234 724113464 723518295
2082.1 723518295 722930984 722886276 722619705 722880096 722961884 723312836 723497162 723816910 723440170 722333145
2091.7 722333145 722242889 722050400 721890411 721309509 721237183 721794739 722185059 722368164 722189865 722286682
2101.4 722286682 721587906 721303635 720998993 720691147 720978699 720813904 721126251 721186447 721353607 721212387
2111 721212387 721064148 721013031 720339890 720021057 719508743 719545670 719672012 720146484 720687637 720700607
2120.7 720700607 720883484 720343857 720024414 719570465 719390411 719621048 719496918 719541855 719681778 719944763
2130.3 719944763 719831085 720016327 719935379 719918060 720027695 719554825 719398117 719240494 719526749 719669571
2140 719669571 720036240 720143509 719742813 719765549 719500504 719826736 719686508 719292526 719136810 719236832
2149.6 719236832 719639359 719322433 719486008 719686356 719982910 719994812 719607162 719526443 719488068 719528198
2159.3 719528198 719407730 720021667 719778595 719260864 719606628 719632034 719438629 719100037 719347382 719165039
2168.9 719165039 719299698 719531937 719388123 719581146 719314270 719579468 719660873 720027084 720186539 719910583
2178.5 719910583 720110321 719792862 719839935 719677505 719741211 719910355 719919891 720049667 719877090 720054245
2188.2 720054245 719881592 719938736 719775620 719840927 720117874 719648361 719666367 719891281 720282822 720200424
2197.8 720200424 720294189 720400009 720245895 720365677 720024414 720155411 719956818 719882584 720032501 720050735
2207.5 720050735 720382080 720382538 720661926 720578384 720444870 720186234 719907532 720055389 720176010 720564423
2217.1 720564423 720864639 720989380 720570068 720643692 720619278 720353928 720363388 719810638 720079803 720366211
2226.8 720366211 720468903 720341721 720283279 720530624 720318222 720605316 720432968 720276947 720052414 719879150
2236.4 719879150 719988022 719804535 720018311 719789505 719858017 719891968 720088806 720273895 720092087 720398788
2246 720398788 720017014 719542999 719025497 719536514 719835052 719015579 719239502 719459915 719814758 719893265
2255.7 719893265 719936371 719961472 719740982 719776382 719603424 719622879 719227753 719291458 719343872 719355698 719693909
2266.3 719693909 719824677 720183945 719832153 719534454 718960876 718859787 719045944 718735504 718880234 718756943
2275.9 718756943 719361801 719614639 719437408 719037018 718446960 718336639 717850342 717959061 717851639 718182678
2285.6 718182678 718522797 718630371 718925247 718239288 718243179 717966080 717929230 717970963 717799606 718130417
2295.2 718130417 718093567 718820114 718693390 718473282 718291473 717652664 717788086 717740784 717982635 717959595
2304.9 717959595 718239975 718360748 718634186 719289322 718997421 718911362 718266296 718249969 718342743 718085709
2314.5 718085709 718252640 718175278 719005127 719464188 719644165 719438934 718838959 719043655 719216614 719135132
2324.2 719135132 718868713 718752747 719224091 720373154 720322266 720240784 720503006 720561905 720513153 719477539
2333.8 719477539 719735184 719707565 719910736 720443878 720550461 720890732 719410172 719016342 719797440 719908142
2343.4 719908142 719316864 719324341 718454590 715440063 714483719 715789719 717644196 718162613 718002777
2352.1 718002777 717481079 717121735 718104324 718082886 719900360 719821320 718970795 721055527 721329727 720598068
2361.8 720598068 719941101 719208069 717906265 718324432 718076859 717548523 717507706 715408554 714307098
2370.4 714307098 714291763 714094543 712659607 711741562 711700134 711207428 711021118 710408859 709752045 708861618
2380.1 708861618 708151093 707673645 707193909 707122726 706623459 706212082 705916214 705622177 705398788 705123367
2389.7 705123367 704877090 704489746 704305115 704296875 704400330 704138641 703958740 703691483 703323212 703317032
2399.4 703317032 702855225 702655487 702408371 702525482 702639542 701812515 701692429 701736908 701566467 701298218
2409 701298218 701015396 700795059 700454788 700491486 700371552 700201035 700141983 699864044 699588318 699421082
2418.7 699421082 699023361 698662720 698128433 697420120 697533875 697533417 697503586 697632980 697224731 696587982
2428.3 696587982 696172333 695921402 695126495 694726868 694738541 694917603 695356903 695467911 695017319 693972931
2438 693972931 693799591 693945770 693716507 693310318 693023758 692990341 692512589 692729111 692706528 691994171
2447.6 691994171 691319275 690828094 690654373 690279465 690324707 690076370 690058365 690020676 689385910 689177780
2457.2 689177780 688889313 688750839 687918625 687035522 686806335 686542130 686584702 686814270 687223434 686897964
2466.9 686897964 686086884 685431976 685323792 685150375 684347763 684061279 683732300 683482590 683431320 683288651
2476.5 683288651 682810745 682374039 682229843 681250458 680548248 680434570 680523682 680635071 680481644 680070038
2486.2 680070038 679467316 679189453 678328476 677640305 677657928 677565689 677212296 676865845 676725845 676322479
2495.8 676322479 676054535 675371323 674806976 674318466 673532028 673362579 673113785 673095322 672985153 673016968
2505.5 673016968 672947083 672290955 671758118 671113892 671052322 670496445 669700165 669595184 669532089 669331970
2515.1 669331970 668719330 668423843 668287201 668102570 667344131 666908493 666921082 666081390 665887146 665880890
2524.7 665880890 665804977 665677643 665132980 664935074 664742813 664213333 663568573 663536987 663388519 663245773
2534.4 663245773 662982941 662096558 662004013 661957855 661315842 660641785 660523376 660845261 660798569 660273819
2544 660273819 659673462 659469376 659204559 658571320 657756348 657563019 657301331 656755905 656919403 656850128
2553.7 656850128 656626740 656315536 655986862 655617676 655100632 654789734 654412308 654354706 654193344 653986130
2563.3 653986130 653700714 653453217 653427200 653018417 652597046 651945801 651441345 651085281 650927505 650894470
2573 650894470 650774536 650851669 650392380 649956207 649222336 648573380 648255234 647532730 647300034 647317581
2582.6 647317581 647369766 647250214 647518921 647584763 646945343 646381989 645282211 644703979 644291687 643855820
2592.2 643855820 644010010 644104614 644094086 643488388 643105240 643103485 642685928 641897659 641255875 641141739
2601.9 641141739 641089783 640800018 640421753 640122757 639510727 639117203 638688850 637979889 637777672 637567711
2611.5 637567711 637192192 636848564 636920547 636850243 636465073 635921173 635068665 634598732 634150276 633901024
2621.2 633901024 633501549 633269920 633381500 632862892 632445984 631911240 631494370 631275902 630810814 630211983
2630.8 630211983 629845200 629982948 629680748 629387703 629122963 628338089 627532120 627312012 627171364 626583862
2640.5 626583862 626364288 625789757 625073051 625061150 625325699 625198288 624449768 623806725 623191261 622791176
2650.1 622791176 622644615 622473259 622273598 622432518 622583771 622152100 621696930 620806694 620269661 619970131
2659.8 619970131 619530830 619437485 619265022 619548302 619454689 618953819 618522606 618127975 617476540 616583977
2669.4 616583977 616324005 615891647 616071205 616332130 616280975 616705322 616361656 615689774 614891396 614403992
2679 614403992 614270744 614043846 613764496 613679581 614119225 613814888 613405647 613286552 612681656 611832657
2688.7 611832657 611388397 611220284 610818214 610686836 610373192 610521889 610694313 610315170 610201645 609708900
2698.3 609708900 609163666 608418961 607960281 608088493 608255768 608255119 607960243 608047104 607785759 607224503
2708 607224503 606628304 606126251 605917702 605620079 605448074 605326004 605542068 605408287 605028229 604769516
2717.6 604769516 604629936 604688797 604142303 603835678 603594589 603356247 603461647 603495560 603276024 602558632
2727.3 602558632 602245064 602012482 601838989 601690140 601122894 600706329 600479202 600520515 600611877 600802116
2736.9 600802116 600536537 599985924 599791107 599560432 599459457 599306793 599280777 599234238 598983917 598811226
2746.5 598811226 598769608 598771400 598532982 598067207 597408714 596895523 596559105 596660805 596660614 596447372 596391220
2757.2 596391220 595831070 595470734 595107841 594850616 594868736 594894066 594957008 594585724 594553833 594367676
2766.8 594367676 594255981 593988991 593163948 592955132 592794456 592734489 592413406 592075233 591824570 591191368
2776.4 591191368 590870895 590595016 590339088 589831047 589472809 589407463 589229355 588836746 588070488 587573013
2786.1 587573013 587537727 587812424 587386131 586792908 586371880 585572929 585052414 584544678 584548683 584401131
2795.7 584401131 583820686 583435059 582819595 582356148 581759796 581167984 580856628 580312157 579557343 579347954
2805.4 579347954 579000168 578429527 578326988 577446899 576573105 576039429 575598679 575247574 574588013 574202347
2815 574202347 573511200 573106308 572957954 572521629 571618729 570337067 569949913 569744720 569207497 568346062
2824.7 568346062 567566528 566703873 565735130 565407715 564804459 564154663 563600845 563336449 562767296 561362953
2834.3 561362953 560411224 559693298 559087601 558151817 556972771 555633469 553910484 552572174 551357307
2843 551357307 549985390 548172112 546440659 544733582 542554932 540722618 539205475 537838745 536951370
2851.7 536951370 536115150 534645691 533721619 533697090 533853111 534085884 534156418 534508362 534536247 534214020
2861.3 534214020 534092903 533961067 533538017 532893829 532334862 531345863 530626640 529940262 529053459 528687630
2870.9 528687630 528354378 528197861 527794418 527067871 526162148 525184135 524657593 524335136 523995552 523363380
2880.6 523363380 522681084 522425041 522370338 521694145 520913124 520169182 519041100 518427315 517632675 516995697
2890.2 516995697 516722031 515838356 514937019 514062080 513310890 512640152 512153053 511955261 511327934 510042610
2899.9 510042610 508840714 508143005 507691269 507585068 506934929 505714149 504434700 503304367 502765846
2908.6 502765846 501965981 500910034 499820938 498690147 497491646 496448669 495648804 494076614 492386856
2917.2 492386856 490888786 489322128 488078384 486805687 485706291 485230598 484948235 484628181 484557152
2925.9 484557152 484378777 484511337 484873276 484645233 484516869 484942322 485265427 485290451 486039734 486840401
2935.6 486840401 487152176 487689095 488470764 489431877 489871826 490608253 491621284 491920357 492172241
2944.2 492172241 492598038 493030853 493165894 493659096 494662209 495413666 495752907 495864525 495755615
2952.9 495755615 495722733 496287994 496316414 496243019 496397552 496436119 496959648 497328682 497812500 498232613
2962.6 498232613 498552437 498890343 499457512 500401726 500792732 501518059 502210197 502845306 503862305
2971.2 503862305 504383507 504756508 505169258 505944901 506544838 506677017 506822014 507181320 507949905 508798332
2980.9 508798332 509372101 509181404 509046440 509269218 509811134 510739861 511020470 511157837 511531143 511822052
2990.5 511822052 511687813 511513176 511738663 511430283 511289482 511636314 511565552 511370087 511063499 510465508
3000.2 510465508 509990959 509964600 510325317 510163879 509193382 508501472 508310165 508319359 508172340 507616348
3009.8 507616348 506894722 506488457 506483727 506340675 506142998 505547066 504611359 504048653 503870354 503692894
3019.5 503692894 502869873 502130356 501704674 501144104 500839882 500506706 499764519 498904800 498296356 497757721
3029.1 497757721 497174187 496584244 496204338 495875893 495179214 494318085 493661842 493427925 492821388 492019615
3038.7 492019615 491350975 490437393 489876137 489400253 488727913 487864609 486817894 485803642 485276756
3047.4 485276756 485146408 484594536 484028778 483429031 482629738 481642914 480793495 480163193 479376907 479006577
3057.1 479006577 478287773 477553444 477247086 476588097 475823135 475225182 475066299 474472809 473481903 472627754
3066.7 472627754 471831360 471457977 471211700 470906792 470524750 470319557 469750214 468812447 467976952 467321587
3076.4 467321587 467066727 466579247 466027756 465310593 464983978 464857178 463984871 463378601 462817841 462495232
3086 462495232 462324219 461985130 461633568 460918694 460279694 459647903 459243622 458509789 457607689 457280693
3095.6 457280693 456766777 456140366 455657692 455564690 455098953 454322548 453837013 453241920 453212700 452931366
3105.3 452931366 451829376 451000328 450475883 449846611 449302559 448859253 448280907 447635574 446902618
3114 446902618 446248131 445802727 445568428 445150452 444659805 444187927 443412323 442870140 441994934 441132812
3123.6 441132812 441043968 440828018 439972267 438795853 438394547 437918701 436701012 436183281 435980530
3132.3 435980530 434834023 433913994 434023514 433587494 432722130 432190399 431858635 431279144 429895515
3141 429895515 428886032 428385429 427764740 427350349 426957169 426473999 425884438 425211639 424585457 424081612
3150.6 424081612 423780251 423133316 421967506 421107445 420359039 419816055 419481125 418577881 417793121
3159.3 417793121 417185822 416586838 415817375 415143585 414960709 414127541 413374977 412892342 412171669 411426888
3168.9 411426888 410489082 409991226 409562645 408947716 408025017 407051353 406654510 406419830 406188431 405363808
3178.6 405363808 404466515 403904915 403001328 402247047 401811371 401171761 400445633 399911346 399105072 398345070
3188.2 398345070 397717133 396908913 396614685 396312180 395300903 394299049 393905907 393763123 393329582
3196.9 393329582 392530594 391877556 391531715 390932503 390217133 389752464 389532166 389012566 388358040 387759247
3206.5 387759247 386527481 385677681 385732269 385695229 385009651 384077606 383481674 382718811 381969795 381768303
3216.2 381768303 381645813 381162643 380296059 379480743 379404106 379486008 378852501 378188744 377688026 377040482
3225.8 377040482 376399879 375716362 374959373 374609947 374712524 374693756 374530640 373511009 372329292
3234.5 372329292 372005768 371615028 371091766 370570068 370237579 369854851 369384193 369104805 368733215 368541374
3244.2 368541374 368010254 367284737 366497421 365672684 365553741 365376663 364734497 364275475 364616127 364422264
3253.8 364422264 362914696 362247238 362273293 361558189 360695724 360461731 360355949 360032997 359853249 359752426
3263.4 359752426 359045448 357959366 357660522 357635117 357136116 356778908 356653442 356306686 356166840 355972481
3273.1 355972481 355349998 355232506 354815369 353998222 353575478 353163490 352789040 352188148 351830597 351738281
3282.7 351738281 351615448 351684113 351605644 351334076 350629692 350040436 350140190 350081787 349340935 348670731
3292.4 348670731 348479385 348324051 348317070 348297539 347990532 347582397 347511559 347148437 346034431 345374641
3302 345374641 345390511 345472946 345069122 344371185 344020844 344372597 344535370 343511353 342770119 342542114
3311.7 342542114 342476463 342099228 341308136 341349983 341339073 340710526 339722672 339136887 338962440 338194962
3321.3 338194962 337723122 337536583 337600937 337705803 336987801 336028786 335341873 334767189 333835754 333205833
3330.9 333205833 333065491 332702332 332486534 332453728 332261353 331744232 330950890 330632553 330437279 329563599
3340.6 329563599 329137077 328875580 327967529 327407074 326900101 326285744 325983391 325724869 325269012 324987793
3350.2 324987793 324802322 324024429 323256836 322830315 322685280 322398033 321770782 321507759 321433792 321263580
3359.9 321263580 320633888 319987411 319916573 320007591 319792652 319170742 318695107 318451328 318086262 317022915
3369.5 317022915 316112823 315833092 315514603 315828876 315947151 315353832 315215187 315249138 314483395 313927536
3379.2 313927536 314249916 313920307 313414478 313327293 313348656 313110924 312543983 312695522 312856331 312903118
3388.8 312903118 312567749 311858139 311962833 311558323 311086216 311399632 311267185 311113377 311037998 310574703
3398.4 310574703 310276127 310547600 310865974 310687141 310428047 310153999 310092316 310410175 310234585 309988289
3408.1 309988289 310083218 309888039 309659443 310071163 310449333 310126114 310156536 309904041 309467430 309523697
3417.7 309523697 309455185 309968090 309867249 309620495 310503635 311168613 311181145 310523624 310405827 310837784
3427.4 310837784 311412487 311787357 311512547 311488075 311836510 312367516 312329865 312748528 313606052 313422947
3437 313422947 312985916 312929211 313651733 314187298 314638290 315032673 315353165 316278534 316860504 317429104
3446.7 317429104 316893616 316707268 317878304 318632298 319076176 319135609 319623928 319936295 320258293 321233330
3456.3 321233330 321914635 322485390 322770691 323587036 324618683 325402145 325601692 325456161 326125145
3465 326125145 326791458 327714729 328254433 328545952 329253120 329576073 330137901 331101379 332135620 332774200
3474.6 332774200 333294640 333932953 334627609 335542450 336533508 337185898 337171288 337707634 338552666 339616966
3484.3 339616966 340390472 340636292 341822624 342453384 342947769 344215050 344864998 345226364 346079102
3493 346079102 347051620 347992210 349086952 349459381 349925842 350744019 351530914 352647362 353886223
3501.6 353886223 355304642 355793190 355914574 356345863 357100677 358498459 360166893 361146469 360963211
3510.3 360963211 361896172 362868767 363450089 364446793 365199966 366313934 367464027 368518600 369261208
3519 369261208 370149841 371234665 372490158 373992538 373884964 374042740 375476685 377171059 378065071
3527.7 378065071 378547058 379627876 380672836 381662941 382467918 383896103 385146790 386654015 388232040
3536.4 388232040 388495255 389533920 390528336 391914024 393410454 394402275 395228004 396074562 397777481
3545 397777481 398825722 400099449 400174294 401065941 403184586 404969406 407625961 408073883 408552361
3553.7 408552361 408797340 409428062 412063293 413504944 414931564 416254921 417964935 418983955 420472298
3562.4 420472298 422136078 422835655 427255821 429342232 428567734 427842140 427378464 431218338 433511772
3571.1 433511772 435327225 437130699 438782158 440479012 441890106 443556137 443942947 446630516
3578.8 446630516 448872528 449564896 451044006 452749062 455056801 456496391 460250702 461932640
3586.5 461932640 461055260 464161415 463338547 465271111 468510017 471407166 472923355 473913040 477489052
3595.2 477489052 477137299 479149742 482678413 483347359 485737534 486581993 487485085 489750862 491778603
3603.9 491778603 494431076 497948723 501149483 500319710 502772675 503571053 503402557 510411911 512631912
3612.5 512631912 511027451 515154610 514298439 517441101 523497772 525452461 526303139 525314331 526442337
3621.2 526442337 530210991 533543396 535547409 537714233 539790840 542455101 550661430 554645729
3628.9 554645729 544354820 546805038 551136856 556707611 558896790 557744255 560097809 563480911
3636.6 563480911 566594963 567851486 569842262 572997742 576263428 578380623 578417664 580123405 584153366
3645.3 584153366 590865593 593490372 592153435 597208519 597254448 593502121 592399254 597701530 602507515
3654 602507515 607068443 613169556 607129669 608180466 612945442 614573936 616645584 617535858 619808960
3662.7 619808960 621396980 623199654 625195122 626205940 631413155 635293007 634441261 633492279 628016281
3671.4 628016281 631107216 639691811 649941406 652755890 634760780 635443268 642692947 647481766
3679.1 647481766 645087051 644868088 648061066 650261154 651498795 652042847 652442856 656043701 662948837
3687.8 662948837 655567169 652091217 661846848 656425095 654043884 659376450 660544205 661849060
3695.5 661849060 662125397 661814270 663352051 663927765 666338196 669736099 664879150 661921310 666419601
3704.1 666419601 668420944 668596725 668939896 671693115 676534958 669659424 672542725 678692703 664957809
3712.8 664957809 667565308 672328796 672895889 673517914 676045303 676845856 673087692 675005417 681237869
3721.5 681237869 678259354 672864761 677808609 680498199 680252457 677528229 676795731 679598694 680376434
3730.2 680376434 686751633 685438995 676023865 685573044 689861298 679399796 677664413 679573746
3737.9 679573746 679680786 681609344 684425278 680175095 683722534 697178726 690075989 671161270
3745.6 671161270 679202042 684920044 692837067 693529663 681238403 690469894 686125946 676667404
3753.3 676667404 681137619 685520401 688824997 683346481 685668564 692055588 684485245 682316360
3761 682316360 686334076 688129349 688281631 691458664 689675674 684596329 687829819 693489914 694959030
3769.7 694959030 685593262 685755615 688431625 688399658 689419098 689288559 689895172 690606155 694082794
3778.4 694082794 694962006 686841431 688016968 689258347 690192032 693268738 690859909 688925323 689871063
3787.1 689871063 690644989 691088333 691691284 691673965 690624390 691086578 691124115 692902908 697403488
3795.8 697403488 694319305 689027786 690546799 694933090 701610489 696394958 684392166 687462463
3803.5 687462463 690747757 695862503 701787415 691649094 686866760 691697311 693460464 693495102
3811.2 693495102 693934555 694049072 695435791 702031250 702602692 687049561 690780487 696791840 702937927
3819.9 702937927 707247696 687898865 688168869 692484360 694033661 697090988 696640015 692214890
3827.6 692214890 692306595 694197922 697669830 699930267 691702042 693214569 700773849 695743332 694652176
3836.3 694652176 703487625 696594315 691230545 698273010 692396927 690823975 697845612 696136246
3844 696136246 691266556 693805618 695432053 695518265 697423630 696908417 698636398 703930664 698679504
3852.7 698679504 699930344 686682968 686026917 695880966 695264435 692370453 694414902 697141418
3860.4 697141418 699754562 694027252 693745651 701454849 695387497 688981247 693328323 698650894
3868.1 698650894 705320282 698424225 687486954 690028992 696963501 702417679 691045685 690296478
3875.8 690296478 694341507 694703445 697846603 703229065 699069519 690199966 694712067 696000366
3883.5 696000366 696642685 701998825 690926208 690564728 694270554 695241165 699769745 700142212 691614380
3892.2 691614380 692297516 696057358 694523010 694579849 695492249 698568344 700905533 691039886 696468582
3900.9 696468582 699499817 693309021 698006973 695464020 692425766 692174149 692972031 694820099 694635315
3909.6 694635315 694914322 694255447 694180298 694597015 694379578 695847778 699170685 696269608 691295166
3918.2 691295166 696112823 696988678 692267075 693785095 695809021 698072662 696567688 692618942
3926 692618942 693227692 694895935 696659927 695523758 694712524 696767120 694486313 692625885 694061356
3934.6 694061356 693944550 693432617 694015884 694236526 693665314 693437424 695581055 697412643 693130646
3943.3 693130646 691343002 692732162 693864136 695647430 694177856 693767319 694142227 692875290 694525757
3952 694525757 694559021 693271713 693247910 693412323 693500290 693394775 694011078 693609848 693978806 694290695
3961.6 694290695 692835693 693180389 693812408 693451004 692654495 692752380 693994827 693948669 693351669 693832550
3971.3 693832550 694086380 693565063 693505249 694213486 694442215 693491287 693221130 693316727 693257599 693741150
3980.9 693741150 694004135 694363403 693969193 693233719 693090286 693049698 693096008 693376083 694144516 693863220
3990.6 693863220 693202057 693136063 693620071 693746185 692361832 692077789 692417450 692581406 693152390 693597107
4000.2 693597107
##END=$$ End of the data block
