##TITLE=$$ Begin of the data block
##JCAMP-DX=5.00 $$ ACD/SpecManager v 10.08
##SPECTROMETER/DATA SYSTEM=Varian
##DATE=08 Jan 2013 15:41:14
##DATA TYPE=INFRARED SPECTRUM
##DATA CLASS=XYDATA
##ORIGIN=
##OWNER=
##NPOINTS=3735
##FIRSTX=399.26403809
##LASTX=4000.35498047
##MAXX=4000.35498047
##MINX=399.26403809
##MAXY=73.68883514
##MINY=30.95326996
##XFACTOR=1.0000000000
##YFACTOR=0.000000100000000
##FIRSTY=48.63573837
##DELTAX=0.96440572
##XUNITS=1/CM
##YUNITS=TRANSMITTANCE
##XYDATA=(X++(Y..Y))
399.3D86357384j0342789J898956P807541K899819L958816K883454j628914M958763
407D98793030R721451N407219j0204506j3563767k592468K687645j670265o463204
414.7D82115135j156616N746727L480682K020035N581017j694527n832443q421936
422.4D81838074m476967L631172Q799400M227562k888794O72074k692642n658913j573181
431.1D81877785J162681J157074o10237K745972O072693K295723j777993k646827m279290
439.8D85997581j531753J098328J89857L521156O2409j075669n88226l427009M82368
448.4D84729042M005661L312416m477997k076149K914315k725983J887588L736573
456.2D91305466N204124o28319j0208511j375732o19851l993644n82962L448829k32124
$$ y = [486357384, 476014595, 477913551, 485721092, 488620911, 492579727, 495463181, 493834267, 498793030, 508514481, 513921700, 503717194, 490153427, 487560959, 490248604, 488578339, 482115135, 480958519, 486705246, 490185928, 492205963, 497786980, 496092453, 490260010, 481838074, 477361107, 480992279, 489791679, 494019241, 491130447, 491802521, 489109879, 483450966, 481877785, 483040466, 484197540, 483587303, 486333275, 492405968, 494701691, 492923698, 490276871, 485997581, 484465828, 485564156, 485754013, 489275169, 489337578, 488261909, 487673683, 484246674, 484729042, 488734703, 492047119, 487569122, 485492973, 488407288, 485681305, 487568893, 491305466, 496509590, 495881271, 485672760, 484297028, 483677177, 479683533, 479100571, 482549400, 482317276]
464.8D82317276l196220r10111J063500Q72154m66232j681214j533279N253181J977081
473.5D83696136p84072j551476m756508J345482l30429k218246R81903R74350j6785
482.2D77340355l815193j784935J7509j256180Q93021Q44994J415329K514648P59621
490.9D76929169k368622o18172Q95195l875465k528382K136040j514435j601219N91049
499.6D68045158r92241L274041L649749k532615r08814j445884k289925j604691l13301
508.2D64881477L892289M348907J004944j694489m355926J80855R63478l979759j158867
516.9D64082909m10843o32324P8468q7967K188911k01759k197075k87247O19431o67534
526.6D62484970j134338p63283p48367R87053R29603L12882Q48999n07698k316552
$$ y = [482317276, 479121056, 478210945, 479274445, 480146599, 479680367, 477999153, 476465874, 481719055, 483696136, 482912064, 481360588, 476604080, 477949562, 477619133, 475400887, 476382790, 477357140, 477340355, 473525162, 471740227, 471757736, 470501556, 471394577, 472239571, 473654900, 476169548, 476929169, 474560547, 473942375, 474837570, 470962105, 468433723, 470569763, 469055328, 467454109, 468045158, 467052917, 470326958, 473976707, 471444092, 470535278, 469089394, 466799469, 465194778, 464881477, 468773766, 473122673, 474127617, 472433128, 468077202, 468258057, 469221535, 465241776, 464082909, 463672066, 463039742, 463118210, 463030243, 465219154, 465017395, 462820320, 462533073, 463152504, 462484970, 461350632, 460587349, 459838982, 460826035, 461755638, 462068520, 462917519, 462409821, 460093269]
535.2D60093269j598129l91807j515847j73378J397248L44276R50012J938019j664162
543.9D59379501l582878N21050M13246j530419m14047L205l06092J21384J259918J132279
553.6D56997147M04396j648255k633171j724853N31158K532425M17137J60027M38308
562.3D55474319m78935n79109n86967n75753k467766O36483L086624j98822j668167
570.9D52641907l93563K138253O17065j189728p33261j272239n30777O1912R34906
579.6D52274475L40462l67317R40361m31252j645660j33324R17931J540374Q30079
588.3D54266129K098O75773K16332N28450O62269r14001p86934J37749R79919Q82683
597.9D56650467M58984J085701j64413j105728n52063m97780l8300m85344o94313J111107
$$ y = [460093269, 458495140, 458103333, 456587486, 456414108, 457811356, 458155632, 459105644, 461043663, 459379501, 455796623, 456317673, 456730919, 455200500, 454786453, 454789658, 454483566, 454604950, 455864868, 456997147, 457401543, 455753288, 453120117, 451395264, 451926422, 454458847, 454875984, 455036011, 455474319, 454995384, 454416275, 453829308, 453253555, 450785789, 451422272, 454508896, 454310074, 452641907, 452248344, 454386597, 455003662, 453813934, 453080673, 451808434, 451277657, 451339569, 452274475, 452614937, 452247620, 453187981, 452756729, 451111069, 450977745, 451895676, 453436050, 454266129, 454268227, 454944000, 455160332, 455688782, 456351051, 455437050, 454650116, 454787865, 455767784, 456650467, 457109451, 458195152, 458030739, 456925011, 456372948, 455875168, 455836868, 455351524, 454657211, 455768318]
607.6D55768318R39789m53453L0136L6888q47206j008797j376762j861153J85395K206344
617.2D53619499J085434J98097j01280m10080P30019J472931j15509m76456K14767
625.9D56217422r5176J145363K149543K129937J417236N40008J449471J838951O86417
634.6D67479172l26386m42695L52249J562309J971512J582298J147499P21016N08728
643.3D74555702m6654j88980L79143J500588K545280J759338O30379k9907l87917o05011
652.9D80111961m94880L96156P44820J908989J432266j006012o33888M33426L98330
661.6D83291168l51715n55305j1330L17154J120987N88608m44947J124688p5989k82097
671.2D84721222N75066J252136R5062l19633R98420J290245R32350J378556K030716
$$ y = [455768318, 456708107, 456254654, 456284790, 456321678, 455474472, 454465675, 453088913, 451227760, 451413155, 453619499, 454704933, 454903030, 454801750, 454391670, 455121689, 456594620, 456479111, 456002655, 456217422, 456122246, 457267609, 459417152, 461547089, 462964325, 463504333, 464953804, 466792755, 467479172, 467152786, 466710091, 467062340, 468624649, 470596161, 472178459, 473325958, 474046974, 474555702, 474509048, 474320068, 474699211, 476199799, 478745079, 480504417, 481134796, 481104889, 480716972, 480111961, 479617081, 480013237, 480758057, 482667046, 484099312, 483093300, 482459412, 482892838, 483291168, 482939453, 482384148, 482372818, 482689972, 483810959, 484399567, 483954620, 485079308, 485003319, 484721222, 485296288, 486548424, 486643486, 486323853, 487322273, 488612518, 489544868, 490923424, 492954140]
679.9D92954140P09800m60167Q20961J001206p28340L19252J962471M16183j34697
688.6D96860809J66130J13335P66296O00586n33828o08864R42230J337395J379814
697.3E01023903J042442j47819R0408L20625K89917K34986m3907L65371Q28057K80761
706.9E04284744J002388J869545K5444J36376R15603Q5717R6817M1465N21584J246262
716.6E10225945J004486M03938R90944M90761o63720P0191j91803M76417J886750J834259
726.2E16528168P28225P91626J199608r4413J097679J375045N28412J107636N96008
734.9E23857994K07558k70386M48151J114578Q05931L2806k6321Q40454Q5678R42154
744.5E28038597J681137J165848P96089N4779L99208m0931k65007R03053J717644P30133
$$ y = [492954140, 493663940, 493203773, 494024734, 495025940, 494297600, 494616852, 496579323, 496995506, 496860809, 497026939, 497140274, 497906570, 498507156, 497973328, 497364464, 498306694, 499644089, 501023903, 502066345, 501918526, 502008934, 502329559, 502619476, 502854462, 502810555, 503175926, 504003983, 504284744, 505287132, 507156677, 507182121, 507318497, 508234100, 508319817, 508416634, 508458099, 508979683, 510225945, 511230431, 511634369, 512625313, 513116074, 512452354, 512522545, 512330742, 512807159, 514693909, 516528168, 517256393, 518048019, 519247627, 519153214, 520250893, 521625938, 522154350, 523261986, 523857994, 524065552, 523795166, 524243317, 525357895, 526163826, 526196632, 526170311, 527010765, 527096443, 528038597, 529719734, 530885582, 531681671, 531736450, 532135658, 532094727, 531829720, 532732773, 534450417, 535180550]
754.2E35180550j65444N06783J064987R32770N27992Q51631L78647O30035J198082
762.8E41106033Q19741N33104m01345n1384L83950J224746N55077j251907k63825K64168
772.5E42918358P27081R44977O35376N79300J564m37889P9155N54352J52854R51996
782.1E47107124M09241j1558O73370K78320N5886J220M90647q41599l57361R86634
791.8E48791924j25542J09367K37198Q8043o06384p84264n27572j7319l15437j627922
801.4E45222092m38958p68318j052513n4207k98347j124115k093582k225380k065621
810.1E35101051j057243r70230o99654m20837n62172n64537j402550n66101j254120
818.8E27603607j448479n7296l96767K25525J410675K450829J829147P08694Q64869
$$ y = [535180550, 535015106, 535521889, 536586876, 537519646, 538047638, 538899269, 539277916, 539907951, 541106033, 541925774, 542458878, 542057533, 542006149, 542390099, 543614845, 544169922, 542918015, 542654190, 542918358, 543645439, 544590416, 545225792, 545805092, 545806656, 545368767, 545447922, 546002274, 546155128, 547107124, 547516365, 547504807, 548178177, 548456497, 548512383, 548513603, 549004250, 548162651, 547805290, 548791924, 548666382, 548775749, 549012947, 549100990, 548494606, 547710342, 547182770, 547165451, 546850014, 545222092, 544783134, 544014816, 542962303, 542908096, 542609749, 541485634, 539392052, 537166672, 535101051, 534043808, 533073578, 532373924, 531953087, 531390915, 530826378, 529423828, 528857727, 527603607, 526155128, 526097832, 525701065, 525926590, 527337265, 529788094, 531617241, 532325935, 533190804]
827.5E33190804J363449J461830Q53882J799087K543182J912194J124916J758728J813164
836.1E47821236J511383K317657P81174J170654J804047J289978J924743Q24891N60302
844.8E60006065J429215J622696J586571K390632J992989J541328J437836M16260J119651
853.5E73543243J010781R21173O91528J584473K246399J337890K236672R30824Q02040
862.2E85305023Q19130j00670k45094r63020R6244m3258p7973l90586j141892j668434
871.8E81589470j789780l75786j36108k32735j214294j107178j13945j41449m76265
880.5E76001930j90162N27496m04091J61209J0986n64918m23813q90770j32942k518
890.2E74092407L79753l83606q8844J049118n7411J18065M66308o1721m22249L84102
$$ y = [533190804, 534554253, 536016083, 536869965, 538669052, 541212234, 543124428, 544249344, 546008072, 547821236, 549332619, 551650276, 552431450, 553602104, 555406151, 556696129, 558620872, 559445763, 560006065, 561435280, 563057976, 564644547, 567035179, 569028168, 570569496, 572007332, 572423592, 573543243, 574554024, 575475197, 576166725, 577751198, 579997597, 581335487, 583572159, 584502983, 585305023, 586124153, 586023483, 585778389, 584815369, 584911613, 584868355, 584790382, 584399796, 583257904, 581589470, 579799690, 579423904, 579287796, 579055061, 577840767, 576733589, 576619644, 576478195, 576001930, 575811768, 576339264, 575935173, 576096382, 576107368, 575542450, 575118637, 574227867, 574094925, 574092407, 574472160, 574088554, 573999710, 575048828, 574991417, 575109482, 575575790, 575514069, 575091820, 575475922]
899.8E75475922j5335m99230P07169J259613J086044J01090N03921P62939O88897L47824
909.4E80418854P8926L21121o53458L12577J34277o59561j009598j405716j101684
918.1E76435738k531090k391243k067566j866036j549148j835365j948395k453423
925.8E59793472k378120k709656k186737j816482j862832j887436j617240q96569q49762
934.5E43588638J60828l77426n72167J1750q26989q40149j077232p47986o97479o15807
944.2E38005981k22168n88531J55220K48756j398964j637229l62854n14107o06270
952.8E33079834j076660j830635j334267j344490j622505k109566k502746k623330
960.6E18635635r78202r74007k250633j147232k000733j851959j138306j752166j466065
$$ y = [575475922, 575460587, 574961357, 575668526, 576928139, 578014183, 578115273, 578619194, 579382133, 580071030, 580418854, 580497780, 580818901, 580165443, 580478020, 580612297, 579952736, 578943138, 577537422, 576435738, 573904648, 571513405, 569445839, 567579803, 566030655, 564195290, 562246895, 559793472, 557415352, 554705696, 552518959, 550702477, 548839645, 546952209, 545334969, 544438400, 543588638, 543749466, 543372040, 542799873, 542811623, 541984634, 541144485, 540067253, 539319267, 538621788, 538005981, 537783813, 537195282, 537350502, 537599258, 536200294, 534563065, 534200211, 533686104, 533079834, 532003174, 530172539, 528838272, 527493782, 525871277, 523761711, 521258965, 518635635, 517657433, 516683426, 514432793, 513285561, 511284828, 509432869, 508294563, 506542397, 505076332]
969.2E05076332j467056j090698j659241k501297k231598j785202k238274j913261
976.9D90189705j630287l190460l328133l132134k935791k957916l409462l518562
984.7D66086960l705979l537483l449325l362236l756218l133278l130532l814125
992.4D38197784l652076l787384k841606k639924k781715k455254k749862k800637
1000.1D14489326k504158k340469k069282j603432j504212j230659j091995q47130
1007.8D01297989r53560q40950j159554k502365k104149j576843j645202j481095j185646
1016.5C87848625j713524k101211j708603k328682j960564j293754j320763k119446
1024.2C73302078j371040m61235j964150j974105j700974j158295j517143j029854
$$ y = [505076332, 503609276, 502518578, 500859337, 498358040, 496126442, 494341240, 492102966, 490189705, 488559418, 485368958, 482040825, 478908691, 475972900, 473014984, 469605522, 466086960, 462380981, 458843498, 455394173, 452031937, 448275719, 445142441, 442011909, 438197784, 434545708, 430758324, 427916718, 425276794, 422495079, 420039825, 417289963, 414489326, 411985168, 409644699, 407575417, 405971985, 404467773, 403237114, 402145119, 401297989, 400344429, 399503479, 398343925, 395841560, 393737411, 392160568, 390515366, 389034271, 387848625, 386135101, 384033890, 382325287, 379996605, 378036041, 376742287, 375421524, 373302078, 371931038, 371469803, 369505653, 367531548, 365830574, 364672279, 363155136, 362125282]
1031.9C62125282K72866l74489k30751j85395Q44994O7444m02603Q40225J032944J235733
1041.6C65226250j54076k09885J92070L33443m54368o24199L47023p23687q74824j220017
1051.2C61837730J88637k250j059723N65986K69928K86484o68373m58145M34913R85222
1060.9C62380409J795616R67217J157608J679954K327233J538086J700363J764717
1068.6C75311203J56899k43187L03840J635628L22380J6212R30100J101456N48248
1077.2C80082779q0643J885567J039047P90367J091614L05328R24988Q73795J364593
1085.9C88277435Q02079J410598J960488J371765J952171J898956R86672O5040J602669
1094.6D00327873K102547Q51593R87892J608276J856575J090966R52224J315766J467247
$$ y = [362125282, 362398148, 362023659, 361792908, 361607513, 362452507, 362519951, 362117348, 362957573, 363990517, 365226250, 365072174, 364862289, 365054359, 365387802, 364933434, 364309235, 364656258, 363932571, 363057747, 361837730, 362026367, 362024117, 360964394, 361530380, 361800308, 362086792, 361418419, 360960274, 361395187, 362380409, 364176025, 365143242, 366300850, 367980804, 370308037, 371846123, 373546486, 375311203, 375468102, 375224915, 375528755, 377164383, 377486763, 377502975, 378433075, 379534531, 380082779, 380002136, 381887703, 382926750, 383717117, 384808731, 385114059, 386039047, 386912842, 388277435, 389079514, 390490112, 392450600, 393822365, 395774536, 397673492, 398660164, 398725204, 400327873, 402430420, 403282013, 404269905, 405878181, 407734756, 408825722, 409777946, 411093712, 412560959]
1103.3D12560959J182747J300544J616784J211662J362991Q98133Q5754j06545J94207
1112D20307236O71920P77703R35669R84611Q40340J44119k47001q4382r3231l27186
1121.6D23909798o2523N99136Q12836J086082Q2283K87628J719132J026840O18134
1130.3D30079346J104431J520386J191902J162491J724510J641464K071762K185135
1138D42681427J065025O26870O74591N20553P72019K93235O79627J751747Q82530M38385
1147.6D50386009O18172K75574j2856J08376L36189j10703p3967P9842j65977j51673
1157.3D51288986j22528n16090j232605q59337k88849O3477L83491L10249P37191J200180
1166.9D50964165J722145J567879J023139R36432Q40073J089249J530952J853981K229805
$$ y = [412560959, 413743706, 415044250, 416661034, 417872696, 419235687, 420133820, 420219574, 420113029, 420307236, 420979156, 421756859, 422692528, 423677139, 424517479, 424661598, 424414597, 424330215, 424236984, 423909798, 423847275, 424446411, 425259247, 426345329, 426427612, 426715240, 428434372, 429461212, 430079346, 431183777, 432704163, 433896065, 435058556, 436783066, 438424530, 440496292, 442681427, 443746452, 444373322, 445047913, 445568466, 446340485, 446633720, 447313347, 449065094, 449947624, 450386009, 451004181, 451279755, 451266899, 451375275, 451711464, 451600761, 451526794, 451606636, 451440659, 451288986, 451166458, 450650368, 449417763, 448558426, 448269577, 448333054, 448716545, 449026794, 449763985, 450964165, 452686310, 454254189, 455277328, 456213760, 457053833, 458143082, 459674034, 461528015, 463757820]
1175.6D63757820K348480K083512K175369J852837R83696J216621J412659O19583P27997
1184.3D77178574J136207J097794Q28895M35486L66364J05972k99606o81420o76155
1193D79492111r68971o72226J83678l01705j043167j112671r35478j093826q82569
1201.6D72665176j095237j425209j054650n74722n0430p55921p91511k20642m57421
1210.3D66239433r04541j111488l55835m58565l85551J00822o3133J28365p4120j83182
1220D62932205o7177j71432n42336o12335p3662J71585M05274l15781j259765q46672
1229.6D59619904m57001m40025m11416n52940m67071p6905k06528m86450o1187L0555
1239.3D56490936m75769p25555o41785l19519j92680p3090r0103q2092Q3313l65029
$$ y = [463757820, 466106300, 468189812, 470365181, 472218018, 473201714, 474418335, 475830994, 476450577, 477178574, 478314781, 479412575, 480241470, 480676956, 481043320, 481149292, 480849686, 480168266, 479492111, 478523140, 477850914, 478034592, 477732887, 476689720, 475577049, 474641571, 473547745, 472665176, 471569939, 470144730, 469090080, 468515358, 468464928, 467709007, 466917496, 466696854, 466239433, 465334892, 464223404, 463867569, 463409004, 463023453, 463124275, 463061142, 463189507, 463115387, 462932205, 462865028, 462693596, 462151260, 461538925, 461465263, 461636848, 462042122, 461726341, 460466576, 459619904, 459162903, 458722878, 458311462, 457758522, 457291451, 457214546, 457008018, 456521568, 456460381, 456490936, 456015167, 455289612, 454647827, 454328308, 454135628, 454062538, 453972435, 453890343, 453973656, 453608627]
1248.9D53608627k36931m26521p37800O8817l5439j06163L18527L41072J06316j78947
1258.5D52721558l14675m02946P4920L22037L31955O70471J132584J023254M24309
1267.2D55983467M06761N72090M58718K90184O34689J192665J268502J160125J145325
1275.9D63112526J133385J079368J188927Q77304M19159P32994J151581J147690J448021
1284.6D72290955J848144J733780J359482J238632J084175P74040J143532P48673M41589
1293.3D82663002R77058J031685J114502Q57201L61099J97258M94537M43764L27950
1301.9D88468056J65329J0147L60451J91383N67093M04434l80821m31023j01242J16806
1311.6D89370613m77180l1052L66554K18659L07922J38931K58446K24533M19006L89786
$$ y = [453608627, 453371696, 452945175, 452207375, 452276192, 452240753, 452134590, 452453117, 452794189, 452900505, 452721558, 452406883, 452003937, 452078857, 452400894, 452732849, 453403320, 454535904, 455559158, 455983467, 456390228, 456962318, 457421036, 457711220, 458345909, 459538574, 460807076, 461967201, 463112526, 464245911, 465325279, 466514206, 467391510, 467810669, 468543663, 469695244, 470842934, 472290955, 474139099, 475872879, 477232361, 478470993, 479555168, 480329208, 481472740, 482221413, 482663002, 483640060, 484671745, 485786247, 486643448, 487004547, 487201805, 487696342, 488140106, 488468056, 488633385, 488643532, 489003983, 489195366, 489762459, 490166893, 489786072, 489355049, 489253807, 489370613, 488893433, 488862381, 489228935, 489447594, 489755516, 489894447, 490152893, 490377426, 490796432, 491186218]
1321.2D91186218M26560O38046R40285Q06198L15094O14281J20048r155q1902m61349
1330.9D94494324l60985m61540l64113k87514L43781K82516l58887n87158m39300L03497
1340.5D92564621o9923n9967J45759P87087Q58306M28963P11899J64223k18354m39682
1350.2D94872932j6937Q9722l26309n6382k69622k66228k7733K24724r8305l04031
1359.8D93821831o50597p58247j51482r68780l6202r6741p73010m49066p25174r21936
1369.4D88290596n73425l05786l33214K90069J47362m73823k20147k03056J1177o39572
1379.1D85990181o85577p02630o59561q73413q44612j75857m82521l78724j828460
1387.8D79358826j130715k88925r61952q28438p85904n2605q62922j911774j219368
$$ y = [491186218, 491612778, 492250824, 493191109, 493997307, 494312401, 494926682, 495046730, 495037575, 494955673, 494494324, 494133339, 493671799, 493307686, 493020172, 493363953, 493646469, 493287582, 492700424, 492261124, 492564621, 492494698, 492434731, 492580490, 493367577, 494225883, 494654846, 495366745, 495530968, 495312614, 494872932, 494855995, 494945717, 494619408, 494563026, 494293404, 494027176, 493999443, 494224167, 494125862, 493821831, 493171234, 492412987, 492261505, 491292725, 491256523, 491159782, 490386772, 489937706, 489212532, 488290596, 487717171, 487411385, 487078171, 487368240, 487515602, 487041779, 486821632, 486618576, 486629753, 485990181, 485304604, 484601974, 483942413, 483069000, 482224388, 482048531, 481566010, 481187286, 479358826, 478228111, 477939186, 476977234, 476148796, 475362892, 475310287, 474447365, 472535591, 471316223]
1396.4D71316223j047668o01731k699012k116394r77746j444473j405678p21969j219101
1405.1D59082451j947174n45960p74917j428490j564751j275444o41403n82886k01072
1413.8D50120354k68784j67389p8430l53584L16543j351471l9901J029396L62129N74913
1423.4D50143776m4899N00336J317978O02722M30526O06041L77884O58875J140709
1432.1D55733948N99632O15501J612206J863670n98106n20172J420517Q16154P41883
1440.8D62285233O73942L78342Q37898K99645J69525N00526R36356n5352J33133N34592
1450.5D66693840j2207O23894J04294J026763J789399P99408K32086l41492J574783
1459.1D72490768M28925J337929J264419R75495J562004M96750J393852J258697J363144
$$ y = [471316223, 470268555, 469666824, 466967812, 464851418, 463873672, 462429199, 461023521, 460301552, 459082451, 457135277, 456589317, 455814400, 454385910, 452821159, 451545715, 450904312, 450321426, 450120354, 449851570, 449684181, 449605751, 449252167, 449568710, 448217239, 448177338, 449206734, 449568863, 450143776, 450098877, 450599213, 451917191, 452519913, 452950439, 453556480, 453934364, 454593239, 455733948, 456333580, 456949081, 458561287, 460424957, 459826851, 459306679, 460727196, 461543350, 462285233, 462959175, 463337517, 464175415, 464475060, 464644585, 465145111, 466081467, 466026115, 466159248, 466693840, 466681633, 467305527, 467409821, 468436584, 470225983, 471025391, 471257477, 470915985, 472490768, 472919693, 474257622, 475522041, 476497536, 478059540, 478556290, 479950142, 481208839, 482571983]
1467.8D82571983J408196J947136K737388K596627L011398R35974K026672K694245
1475.5D99929619J704101J527558K298126K035637J733017J701698J202316J476822
1483.2E13608894J428872J027297J450806R28879l41110J188888n39245j507035L64685
1491.9E17610931k32772p77970p35397K1248m417610j125336j081848l529320p38602
1500.6E04993324j299972j632920j520729k34565k14348k149658l045159j250038J061134
1509.3D94707069o28624K96402p07206j006050J79824l20930j34392k318153l039742
1518D87028198Q99239K639198K304459k966652j623840L58657J948967K52991j13182
1526.6D90728035K20337L9139Q69407P39823Q84666J210861J455346j549149P82547
$$ y = [482571983, 483980179, 485927315, 488664703, 491261330, 494272728, 495208702, 497235374, 499929619, 501633720, 503161278, 505459404, 507495041, 509228058, 510929756, 512132072, 513608894, 515037766, 516065063, 517515869, 518444748, 518103638, 519292526, 518753281, 517246246, 517610931, 517378159, 516600189, 515864792, 515886040, 511468430, 510343094, 509261246, 505731926, 504993324, 503693352, 502060432, 500539703, 500305138, 500090790, 497941132, 494895973, 493645935, 494707069, 494078445, 494374847, 493667641, 492661591, 492841415, 492520485, 492386093, 490067940, 487028198, 487927437, 490566635, 492871094, 489904442, 488280602, 488639259, 490588226, 490841217, 490728035, 490948372, 490987511, 491856918, 492596741, 493481407, 494692268, 496147614, 494598465, 495381012]
1535.3D95381012P54394L42179J858368J253395J83449M90722J143608r08165Q19855
1544E01318817J164093j692467J167260P61222J053391P91168p68509J068688J244316
1552.7E06107979J830101p86629M22363K095414K188987M49791o761284J75019J35460
1561.4E05857201J049957j4038l26309j789780j726723n02548j178551L71476n155716
1570D96584969j719552r69009k299766j692315j438026L12500q910065j706199k298241
1578.7D75864296l087349k566109l548088j980743l553238j958008l615990l784256
1586.4D51770515l230857l708802k380104m501457k348518l831292k645835k997590
1594.1D26126060m255638k489242m119759k247162m234924k543755k856559k722130
$$ y = [495381012, 496135406, 496477585, 498335953, 499589348, 499772797, 500263519, 501407127, 500498962, 501318817, 502482910, 500790443, 501957703, 502718925, 503772316, 504563484, 503794975, 504863663, 506107979, 507938080, 507151451, 507573814, 509669228, 511858215, 512308006, 505546722, 505721741, 505857201, 506907158, 506893120, 506566811, 504777031, 503050308, 502547760, 501369209, 501740685, 496584969, 494865417, 493896408, 491596642, 489904327, 488466301, 488778801, 479868736, 478162537, 475864296, 472776947, 470210838, 466662750, 464682007, 461128769, 459170761, 455554771, 451770515, 448539658, 444830856, 442450752, 437949295, 435600777, 431769485, 429123650, 426126060, 421870422, 419381180, 415261421, 413014259, 408779335, 406235580, 403379021, 400656891]
1601.9D00656891j631508l438644j536026l315926j633759k952423j443672j843185
1609.6C82861748l149529j45263k426606k66952j901474M25911k7199p164536J285630
1618.2C69491730j218720P72286j399384Q93326N66292k471619P45506p18956J761361
1626.9C68421822j196442N3596J62850M67682J038170K35862K519303Q58955J685791
1635.6C74247589k087517J540261R22966J180915J907311q4076K190933Q6060K030601
1644.3C81935043K466507O99501J910401k213173K011604O19049L083725K688828j427880
1653C91773605j730880N5656L954468J390877K001152P64656J452675J594772J728363
1661.6D02985344L320999m97208K493554J760521K460060K680435K730026J957359
$$ y = [400656891, 399025383, 395586739, 394050713, 390734787, 389101028, 386148605, 384704933, 382861748, 379712219, 379566956, 377140350, 376873398, 374971924, 375397835, 375370636, 368206100, 369491730, 368273010, 369045296, 367645912, 368539238, 369105530, 366633911, 367379417, 366660461, 368421822, 367225380, 367278976, 367441826, 367909508, 368947678, 369183540, 371702843, 372561798, 374247589, 372160072, 373700333, 374623299, 375804214, 377711525, 377627449, 379818382, 379904442, 381935043, 384401550, 385101051, 387011452, 384798279, 386809883, 387428932, 390512657, 393201485, 391773605, 390042725, 390098381, 394052849, 395443726, 397444878, 398209534, 399662209, 401256981, 402985344, 406306343, 405809135, 408302689, 410063210, 412523270, 415203705, 417933731, 419891090]
1669.4D19891090L00904M367408J344491L856430M030609K774658J948662K338905
1677.1D40853157L934975K614708L920440K347756L703346N549774L540459L219566
1684.8D69684181O81458M840965M022980L571510L479195L310165M337158L875771
1692.5D97803383M386368M893570O392440J197815L025093N212098N905952O722794
1700.2E35539513l808136N219459M577027M198226K559586K581024L021431J810074
1707.9E55698204L046341K574959J918831K523956L382072L405610J468887J390190
1715.6E75409050L586159L232727m522896J580811L138427K140694J809425J285439
1723.4E87659836R58290J396179J330719P43446J124764J962471O38466P73086L577004
$$ y = [419891090, 420191994, 424559402, 425903893, 429760323, 433790932, 436565590, 438514252, 440853157, 444788132, 447402840, 451323280, 453671036, 457374382, 462924156, 466464615, 469684181, 470365639, 475206604, 479229584, 482801094, 486280289, 489590454, 493927612, 497803383, 502189751, 507083321, 513475761, 514673576, 517698669, 522910767, 528816719, 535539513, 531731377, 536950836, 541527863, 545726089, 548285675, 550866699, 553888130, 555698204, 558744545, 561319504, 563238335, 565762291, 569144363, 572549973, 574018860, 575409050, 578995209, 582227936, 577705040, 579285851, 582424278, 584564972, 586374397, 587659836, 588618126, 590014305, 591345024, 592088470, 593213234, 595175705, 595814171, 596587257, 600164261]
1732F00164261M016304j77460l456344K697181K809983J539878K623253J301194p70073
1740.7F10748177L651161L916893K288666J223030K620926K668304K134018K836647
1748.4F32087822J698151L828430K031746P37457L775940K649155K818374K910385
1756.2F52537460K06375J599427K756500K226105L598709O67419M349L245850J754684
1764.8F68596878J649780J870041J707688j539307J293716M341584J417160o71616
1772.5F78665924j630249L217850K590408r79614J530533J234283J627655Q44574n29251
1781.2F86572113Q03909J646424J873855m98199j31989J107712Q28323P96586J461181
1789.9F94459915J299362J393204o13327r61609K801438J084899l88412J366272K289963
$$ y = [600164261, 604180565, 604003105, 600546761, 603243942, 606053925, 607593803, 610217056, 611518250, 610748177, 614399338, 618316231, 620604897, 621827927, 624448853, 627117157, 629251175, 632087822, 633785973, 637614403, 639646149, 640383606, 644159546, 646808701, 649627075, 652537460, 652743835, 654343262, 657099762, 659325867, 662924576, 663591995, 663596344, 666842194, 668596878, 670246658, 672116699, 673824387, 672285080, 673578796, 677920380, 679337540, 678665924, 677035675, 680253525, 682843933, 681864319, 683394852, 684629135, 686256790, 687101364, 686572113, 687376022, 689022446, 690896301, 690398102, 690266113, 691373825, 692202148, 692998734, 694459915, 695759277, 697152481, 696539154, 695577545, 698378983, 699463882, 699075470, 700441742, 702731705]
1798.6G02731705L83987j333923K101288J3733K18048J486129M83857P78808L34244
1807.3G07197876K83661P27615J385880n26276M49753J350784K61154Q21381R155O73142
1816.9G12634125l1739K80610J105270L15323Q57773j00632J434250J874924j757279
1825.6G16612625o80008J617356K371521Q46481l484650j31988K449417N84564J61438
1834.3G20346756L93600L53165J52512p38068R06983M07409O86264P33643J526336
1842.9G24768600J777115m153061Q63572J219787j57928j95847M98123J079560J83410
1851.6G25883331R91288k5254J44425L44009J01700N68848l45688r8877r5673Q53958
1861.3G28322067K85492K46659N27267P6294P66983p6904J324081n08270j824036Q01087
$$ y = [702731705, 703115692, 701781769, 703883057, 703896790, 704114838, 705600967, 706084824, 706863632, 707197876, 707481537, 708209152, 709595032, 709068756, 709518509, 710869293, 711130447, 711951828, 711960983, 712634125, 712602386, 712882996, 713988266, 714303589, 715161362, 715060730, 716494980, 718369904, 716612625, 715932617, 717549973, 719921494, 720767975, 717283325, 717151337, 719600754, 720185318, 720346756, 720740356, 721093521, 721246033, 720507965, 721414948, 721822357, 722508621, 723242264, 724768600, 726545715, 722392654, 723256226, 724476013, 724318085, 724122238, 724620361, 725699921, 725883331, 726874619, 726849365, 726993790, 727337799, 727439499, 728008347, 727662659, 727563782, 727468109, 728322067, 728607559, 728854218, 729381485, 729457779, 730224762, 730147858, 731471939, 730963669, 729139633, 729940720]
1870.9G29940720O57959L91769l9749N99136m00009p8812M58756K3270L75366j79749
1880.6G31748657M27170J01776M47083J56326m17786J46942P0038J086579N3482j288224
1890.2G32532043J10932R36432K53906K89383K16370j326066J61362K52381L63159
1898.9G33789902L93905l6239M02145j19095L23258q1635J2665J87988M9210J16577
1908.5G35038681l8757k04621m19998J125717J51825k84576j51138M7302J623916j476211
1918.2G35412140j070099Q56628M67911N56030l99246n12008q0643M98657j57547j75781
1927.8G35396042J54190N7754J48316K594M05578k69317R6741p5074m96673k57111
1937.5G35163040n4245O45065j13830O38199J23596j712570l7308P30972L64151m28619
$$ y = [729940720, 730598679, 730990448, 730950699, 731549835, 731149826, 731071014, 731529770, 731553040, 731928406, 731748657, 732175827, 732277603, 732724686, 732881012, 732463226, 732610168, 732680206, 733766785, 733820267, 732532043, 732642975, 733579407, 733833313, 734122696, 734339066, 733013000, 733174362, 733426743, 733789902, 734183807, 734147568, 734549713, 734430618, 734753876, 734672241, 734684906, 734872894, 734922104, 735038681, 734999924, 734795303, 734375305, 735501022, 735652847, 735368271, 735217133, 735264435, 736888351, 735412140, 734342041, 735198669, 735666580, 736222610, 735823364, 735311356, 735230713, 735729370, 735571823, 735396042, 735550232, 735607986, 735756302, 735758896, 736164474, 735895157, 735991898, 735916824, 735420151, 735163040, 735108795, 735753860, 735640030, 736278229, 736401825, 734689255, 734651947, 735382919, 735747070, 735318451]
1947.1G35318451j36337k80304j86310r2392n8289J87989J6784M2954n82886K95868
1956.7G34525528M25949j37634k3422j20545O6300l35999l1509l15400L74299Q07266
1966.4G35234833n52216n48248k06070M71115R0027k56500l87116r2239O02112O4926
1976G34420624l2349j73187K88849j93329l78265K54364J0910J71661l78799k28119
1985.7G33762360J297M49524J47476n93720L52631M5700o90918o70013K38876L6926
1995.3G33080139l91769J56555O1798O72913L58886k26364p80105n94254J03836N6763
2005G32498398J60293l10058J07498o714j85547k02560p6752L18222o96640m04129
2014.6G31202011k24762j62582O6604O7826L61023K71835L49426o30264m57306l11356
$$ y = [735318451, 735182114, 734901810, 734715500, 734623108, 734564819, 734752808, 734769592, 734812546, 734229660, 734525528, 734951477, 734813843, 734790421, 734669876, 734736176, 734400177, 734368668, 734053268, 734427567, 735234833, 734682617, 734134369, 733928299, 734399414, 734489441, 734232941, 733845825, 733753586, 734355698, 734420624, 734388275, 734215088, 734503937, 734310608, 733932343, 734186707, 734197617, 734369278, 733990479, 733762360, 733763657, 734213181, 734360657, 733766937, 734119568, 734165268, 733474350, 732804337, 733043213, 733080139, 732688370, 732844925, 732906723, 733579636, 733938522, 733712158, 732932053, 732337799, 732441635, 732498398, 732658691, 732348633, 732456131, 732449417, 732263870, 732061310, 731984558, 732302780, 731606140, 731202011, 730977249, 730814667, 730881271, 730949097, 731310120, 731581955, 731931381, 731301117, 730843811, 730532455]
2024.2G30532455k32315J42823l40500k823j33209J52511O6681M88358J24435j115646
2033.9G29682770k66342j20926P019l82080j52436L43933P2480n4093n11322L59421
2043.5G28978424m8523l15323k46582j92337N20630P7820l7537o15768k69852j65405
2053.2G27685547j23520K21863m62494J91955J27030j62659j80588K4872k42386m17709
2062.8G26661911M75311j37329k5101n6686j40533K07443P2632J09329m63104k10419
2072.5G26493454o6223J0376m2801m8599J47247m883J00784k75268q3313m89807m81034
2083.1G25259933N0965N3940J11923r6512M72794J25351k213l73611n93949n6610l73993
2093.7G24578018j12915n40848l2119M85153K75039R5597k11106l2577p19299j13755
$$ y = [730532455, 730300140, 730442963, 730102463, 730099640, 729966431, 730118942, 730185623, 730673981, 730798416, 729682770, 729416428, 729295502, 729302521, 728920441, 728768005, 729111938, 729184418, 729130325, 728619003, 728978424, 728929901, 728614578, 728367996, 728175659, 728696289, 728774109, 728736572, 728120804, 727850952, 727685547, 727562027, 727783890, 727321396, 727513351, 727640381, 727477722, 727297134, 727322006, 727079620, 726661911, 727137222, 726999893, 726974792, 726918106, 726777573, 726985016, 727057648, 727166977, 726703873, 726493454, 726427231, 726437607, 726394806, 726346207, 726493454, 726488571, 726589355, 726314087, 726230774, 725740967, 725259933, 725310898, 725364838, 725476761, 725380249, 725853043, 725978394, 725976181, 725602570, 725008621, 724952011, 724578018, 724465103, 723924255, 723892136, 724377289, 724652328, 724747925, 724536819, 724504242, 723784943, 723671188]
2103.3G23671188j19323m9363K04545k81373L35999p8278K54441p9117l80478k66647
2113G23211594o04020k09426n93415L08380N52140M09469K20413p7438K05383n39321
2122.6G22883759k17438l94440k93045j92184j11618N09719Q1940J92413j33209J67084
2132.3G22492981j20239o8894N75943l68576l42102j52359L35770K47192R8648l0441
2141.9G22667923l70026K5406l40576j221J12000L12576j297m77753J3047q9722L42331
2152.5G22192688J56174J85775j66320m94080O8359j6784M1198j57470J92871p0725
2162.1G21931686n2032J77689j23215Q5602O0348M51584j66016o637m0665k44598L82919
2172.8G22456665l51257l3036J76316O50406L75518l37143O8818m26102r2926J13449
$$ y = [723671188, 723551865, 723502502, 723707047, 723425674, 723761673, 723683395, 723937836, 723858719, 723478241, 723211594, 722607574, 722398148, 721804733, 722113113, 722665253, 723074722, 723295135, 723217697, 723423080, 722883759, 722666321, 722271881, 721978836, 721786652, 721675034, 722184753, 722266693, 722459106, 722325897, 722492981, 722372742, 722303848, 722879791, 722511215, 722169113, 722016754, 722352524, 722599716, 722698364, 722667923, 722297897, 722323303, 721982727, 721981506, 722093506, 722406082, 722404785, 721927032, 721940079, 721850357, 722192688, 722348862, 722534637, 722368317, 721874237, 721942596, 721925812, 721967010, 721809540, 722002411, 721931686, 721879654, 722057343, 721934128, 722019730, 722080078, 722531662, 722365646, 722359009, 722318344, 722073746, 722456665, 722105408, 722072372, 722248688, 722899094, 723274612, 722937469, 723006287, 722580185, 722487259, 722600708]
2182.4G22600708J33057l01361j42289M16794j54953Q6212J74103J59226l49122K8840
2192G22651215Q1939n40466J82419J83258M58984L07999K21252k53982o90994k0371
2201.7G22581253p629L18603j61209L1738J11924j54114L49502L6545J70822P4158
2211.3G23351593j77994o05392j77078Q0871n7449O55594K87552Q8501k27280N1651
2221G23270569j93939l67508K98843r7656L62930m4937l052j42746k42691M39759k10572
2231.6G23069000L80097p2174m61502j27945l06L59574j15891J05744l61557l63999
2241.2G22411041j90887j03378N69915K80533j95770m24652l6927r4375K74505K75727
2250.9G22765732r2240j20163l80401J24130j61667L00141K31933j54266j09863o40336
$$ y = [722600708, 722733765, 722432404, 722290115, 722706909, 722551956, 722638168, 722812271, 722971497, 722622375, 722651215, 722733154, 722192688, 722375107, 722558365, 723017349, 723325348, 723546600, 723292618, 722601624, 722581253, 722573624, 722892227, 722731018, 722762756, 722874680, 722720566, 723070068, 723106613, 723277435, 723351593, 723173599, 722568207, 722391129, 722472000, 722414551, 723070145, 723357697, 723446198, 723218918, 723270569, 723076630, 722709122, 723007965, 722910309, 723273239, 723228302, 723225250, 723082504, 722839813, 723279572, 723069000, 723449097, 723376923, 722915421, 722787476, 722787170, 723146744, 723030853, 723136597, 722775040, 722411041, 722220154, 722116776, 722686691, 722967224, 722771454, 722346802, 722309875, 722215500, 722490005, 722765732, 722673492, 722553329, 722172928, 722297058, 722135391, 722435532, 722667465, 722513199, 722403336, 721763000]
2260.5G21763000J18256J46637N55496K35672l34396R6741r5902J14899j76010Q0719
2270.2G22505112l49884n23453k05612k7695N19333j32904K40249J75705l0899m60281
2279.8G21709671m77676L3722p93457P7438J05438K83737L01438k89917L70483o5308
2289.4G21255569J96457k31323j75781k12402p18689M30984N86319N30319k63138j40609
2299.1G21257706O7062n40390j37024k34375J48621J58233K62528K39258K64206N22155
2308.7G22007980N6382q1253p64008m16718N3177J98746N035n2185J008606L40042
2318.4G22355804k68936m49981P1182R67026k5559p35168Q1024M52957K4185Q50907
2328G23323441N57632j92108n38635l33634L43170q0185L98560K38800J41678m30679
$$ y = [721763000, 721881256, 722027893, 722583389, 722819061, 722484665, 722581406, 722485504, 722600403, 722424393, 722505112, 722155228, 721631775, 721426163, 721398468, 721917801, 721784897, 722025146, 722200851, 722169952, 721709671, 721231995, 721265717, 720472260, 720549698, 720655136, 720938873, 721240311, 720950394, 721320877, 721255569, 721452026, 721220703, 721044922, 720832520, 720113831, 720544815, 721131134, 721661453, 721398315, 721257706, 721324768, 720784378, 720647354, 720412979, 720561600, 720719833, 720982361, 721221619, 721485825, 722007980, 722064362, 721983109, 721219101, 720802383, 720855560, 721054306, 721059341, 721007156, 722015762, 722355804, 722086868, 721636887, 721708069, 722675095, 722649536, 721914368, 721995392, 722448349, 722472534, 723323441, 723881073, 723688965, 723150330, 722816696, 723159866, 723079681, 723478241, 723717041, 723858719, 723428040]
2337.7G23428040j145P22809n82123J40991L5477m90112m77066j020890r72366j211319
2347.3G19572296j437912L04108K191162O23093m80195l93371L76739J265030J21842
2356G22142792J739883m17404l53165M52652j733932L58505O06079j064834o44150
2364.7G21086426J495361n05295j155624r03778j293411M21066j023483j350098p55920
2373.3G16015244o73066m97055n61447m86526j053772q52967o27822n93415q74100
2382G09795074m71801J42517k75269l74145m02527k15531k43301j1825r2011m27017
2391.7G07424164k33612k56348K85721L8528L8071k62070p48672p8964l88260k43302
2401.3G05575256j31530j98517l41416l24936J50834l33100k40707R0866M1504n95474
$$ y = [723428040, 723426895, 724149704, 723567581, 723708572, 723744049, 723253937, 722776871, 721755981, 720783615, 719572296, 718134384, 718438492, 720629654, 721252747, 720772552, 720379181, 720755920, 722020950, 722142792, 723882675, 723465271, 723112106, 723564758, 721830826, 722189331, 722795410, 721730576, 721086426, 722581787, 722076492, 720920868, 720017090, 718723679, 719144745, 718121262, 716771164, 716015244, 715342178, 714845123, 714283676, 713797150, 712743378, 711890411, 711262589, 710669174, 709795074, 709323273, 709465790, 709190521, 708816376, 708413849, 708198318, 707955017, 707943192, 707851181, 707424164, 707190552, 706934204, 707219925, 707258453, 707296524, 707034454, 706285782, 706206818, 705818558, 705575256, 705443726, 705245209, 704903793, 704578857, 704729691, 704396591, 704155884, 704246750, 704288254, 703692780]
2410.9G03692780n57023N112k3575j7776n01023k58483k59552j50299j04676j58539
2420.6G01666946R613q16421l11203m42886m64173L08533N2795Q3237l79333p70646
2430.2F98936462q49456j75171n1346l8071M10538k80762n23071q10547j22757L18375
2439.9F96814194j50223l95355o97174j76163l85513J8921M3869q71582o53916j76926
2449.5F93370132j73416l78799N07736J61209m70657k80304n24063l70941o54526m14658
2459.2F90771713m43878o36368j80206k00272j75476L16162M22440l54309o55365q90884
2468.8F87973557m03061j92871p17164k83660k31553j37100l16696l891L6011n58548
2478.5F85165024m19464q55789n49546l08990k57035k0141p1411j36948l45459k31323
$$ y = [703692780, 703135757, 703140869, 703117294, 703099518, 702598495, 702340012, 702080460, 701930161, 701825485, 701666946, 701676559, 700860138, 700548935, 700106049, 699641876, 699950409, 700003204, 700086441, 699707108, 698936462, 698087006, 697911835, 697860489, 697822418, 698232956, 697952194, 697429123, 696618576, 696495819, 696814194, 696663971, 696268616, 695571442, 695395279, 695009766, 695028687, 695072556, 694200974, 693547058, 693370132, 693196716, 692817917, 693325653, 693486862, 693016205, 692735901, 692211838, 691840897, 691186371, 690771713, 690327835, 689691467, 689511261, 689310989, 689135513, 689451675, 689874115, 689519806, 688864441, 687973557, 687570496, 687377625, 686660461, 686376801, 686145248, 686008148, 685691452, 685687561, 685723572, 685165024, 684745560, 683889771, 683340225, 683031235, 682774200, 682754059, 682682648, 682545700, 682200241, 681968918]
2488.1F81968918r05686o78329n9204k02637k94876k59247j42669n81131j30463m63486
2497.7F78251190q05435m52347o11267l85132p49740k31476j9684m9973J75858l90320
2507.4F74731674k90069n12085m63944m11987o09970o02951j69144K60773m34494m57535
2517F71040268k14615l24707p11212m46472k7237m35791k82517k58331P4997J09177
2526.7F68523560j70212n68772q78219l24631l00674j49384l89862k63519j89057n77926
2536.3F64711304L7460k21939o03485o77796l07464K32696o8359m34799n16205l27988
2546F61823425m45785l42026o05392n22385q0261j67847J27792r6817j43203k06528
2555.6F59340973o64978p39136l22571l67202p10297R079J6785j09559k56423m96674
$$ y = [681968918, 681063232, 680384903, 680325699, 680123062, 679828186, 679568939, 679426270, 678845139, 678714676, 678251190, 677445755, 676993408, 676382141, 675997009, 675247269, 675015793, 674996109, 674946136, 675121994, 674731674, 674441605, 673929520, 673465576, 673053589, 672443619, 671840668, 671671524, 671932297, 671497803, 671040268, 670825653, 670500946, 669789734, 669343262, 669316025, 668880234, 668597717, 668339386, 668414383, 668523560, 668353348, 667784576, 666906357, 666581726, 666281052, 666131668, 665741806, 665478287, 665289230, 664711304, 664748764, 664526825, 663923340, 663245544, 662938080, 663170776, 663102417, 662667618, 662151413, 661823425, 661377640, 661035614, 660430222, 659907837, 659827576, 659659729, 659787521, 659690704, 659547501, 659340973, 658675995, 657936859, 657614288, 657247086, 656536789, 656545868, 656562653, 656453094, 656196671, 655699997]
2565.2F55699997l29742o09208l30886j88675k55509k48489j08109l92456k36664K56195
2574.9F53256454m53186j67236n10101p45621l96118p43332k15607k94800j31912O180
2584.5F49604721p0953k38648n26428m46701j042023k33230K75039j75705j55334l30124
2594.2F46660614l60184n75943k33001k29k53907q21075q31604l6545N2262j52436
2603.8F43447952l17917j24359l26004o60400o88858m16260l29208o84471r4262k14767
2613.5F39591446j85127L3836m70276n08919p79838n16396l76892m29878m02069l11508
2623.1F35644379j29776l12844j51367l91426l66783n29747q59795l91388N1270o981
2632.8F32555542n15556j48812j7509m61846r41124p96394j44081l12576k64702n41268
$$ y = [655699997, 655370255, 654761047, 654430161, 654241486, 653985977, 653737488, 653629379, 653236923, 653000259, 653256454, 652803268, 652636032, 652125931, 651380310, 650984192, 650240860, 650025253, 649730453, 649598541, 649604721, 649533768, 649295120, 648768692, 648321991, 647279968, 647046738, 647321777, 647146072, 646990738, 646660614, 646300430, 645724487, 645491486, 645491257, 645237350, 644416275, 643584671, 643548126, 643600388, 643447952, 643130035, 643005676, 642679672, 642019272, 641330414, 640914154, 640584946, 639900475, 639806213, 639591446, 639406319, 639440155, 638969879, 638460960, 637681122, 637164726, 636787834, 636357956, 635955887, 635644379, 635514603, 635201759, 635050392, 634658966, 634292183, 633762436, 632902641, 632511253, 632562523, 632555542, 632039986, 631891174, 631873665, 631411819, 630470695, 629674301, 629530220, 629217644, 628952942, 628411674]
2642.4F28411674j46369L4790o36063k18048k32239m79164p13921n94253l11051k02293
2652F24913063J18103o1111j92681n43022q92258p06329j79367l05634m17327N4245
2661.7F21787682j49537j05247j81694m19006m00696P6294j02043q08983l30849n76897
2671.3F18789024k17056J4381j09062O50902k87170r58405q41598m74167K8457R2011
2681F16687317K2545m32053k27623n5961j33210m42581p23877p28493p89070k95715
2690.6F12881279Q4076K67067J88026K27585j44043m97703j08643n05485o82183o75049
2700.3F11034927n67436o6261K29339L28904k2927m81910o11954j16997k35062o84585
2709.9F08806038o06079j47362M4899k48299L05176J8959n32417m98734m23927l4561
$$ y = [628411674, 628265305, 628300095, 627664032, 627445984, 627213745, 626734581, 626020660, 625426407, 625115356, 624913063, 625031166, 624970055, 624777374, 624234352, 623342094, 622635765, 622456398, 622150764, 621733437, 621787682, 621638145, 621532898, 621351204, 620932198, 620531502, 620607796, 620505753, 619696770, 619365921, 618789024, 618571968, 618586349, 618477287, 619128189, 618841019, 617882614, 617041016, 616566849, 616595306, 616687317, 616709862, 616277809, 616050186, 615994225, 615861015, 615418434, 614694557, 613966064, 613176994, 612881279, 612965355, 613232422, 613420448, 613648033, 613503990, 613006287, 612897644, 612392159, 611709976, 611034927, 610467491, 610401230, 610630569, 610959473, 610936546, 610454636, 609842682, 609725685, 609490623, 608806038, 608199959, 608052597, 608097496, 607849197, 608154373, 608173332, 607640915, 607142181, 606718254, 606683693]
2719.5F06683693n19295k40669J16272j95236K53639K59323n21507p99675l67127m56581
2729.2F04212837k00081J36834l28942l86085j74103k0790K05803N7449l46832k00081
2738.8F02956009m54140n01365k36931n17960L8567J18942k36664m9820J6899l25165
2748.5F00808372p07931l82156r1057j6022k25677n0278l43k89193j58271m09394l44085
2759.1E98133965l56942j11541J79214P4883m7341m21219j99699n26657m02374k26861
2768.7E96095428o84242k20680P9422J49498j54305j39350m45176q90274n01670n38178
2778.4E92750473l27797j13220P7057k03171l87993l40271o73714j88713j41487l86123
2788E90065041p66869o66962j72767m95034n90820o97594k95257m5357j17683j70212
$$ y = [606683693, 606164398, 605923729, 606040001, 605844765, 606098404, 606357727, 605836220, 605036545, 604669418, 604212837, 604012756, 604149590, 603820648, 603434563, 603260460, 603239670, 603445473, 603502922, 603156090, 602956009, 602501869, 602000504, 601763573, 601245613, 601284180, 601403122, 601166458, 601116638, 601133537, 600808372, 600100441, 599718285, 599627228, 599611206, 599385529, 599335251, 599334908, 599045715, 598887444, 598478050, 598133965, 597777023, 597665482, 597844696, 597919579, 597872238, 597451019, 597251320, 596724663, 596322289, 596095428, 595411186, 595190506, 595269928, 595419426, 595265121, 595125771, 594680595, 593790321, 593288651, 592750473, 592422676, 592309456, 592386513, 592183342, 591795349, 591455078, 590781364, 590592651, 590451164, 590065041, 589298172, 588631210, 588458443, 587963409, 587372589, 586674995, 586379738, 586334381, 586216698, 586046486]
2797.7E86046486o92597r18083q25920l30086j51748j93444n20057o52542l61290k90184
2807.3E81110535j73149p76062p27921m66003n75638o54145r64431n44243m57192k17475
2816.9E75554276j17302m65851q80165j316986n64461k96822o75583q34617p18270
2825.6E69684219p08809o19506j61744o22329q57659q50334n05066k11372j008186
2834.3E64139214j128846q11081p70073r31129r28383j171455j897621j792794j268539
2843E53439293j349907j692467j732864j894341j828956j760063j994439j729621r97239
2851.7E38459396m89463q59681n77049o2446k05498p3014p6522K23617L58467n2681
2861.3E36645126n42640m03862p7095n65606p95974j042977p95440j40038l40195p49321
$$ y = [586046486, 585353889, 584435806, 583609886, 583279800, 583128052, 582934608, 582414551, 581762009, 581400719, 581110535, 580937386, 580161324, 579433403, 578967400, 578391762, 577737617, 576773186, 576228943, 575771751, 575554276, 575436974, 574971123, 574090958, 572773972, 572209511, 571912689, 571237106, 570402489, 569684219, 568975410, 568355904, 568194160, 567571831, 566714172, 565863838, 565358772, 565147400, 564139214, 563010368, 562199287, 561429214, 560498085, 559569702, 558398247, 556500626, 554707832, 553439293, 552089386, 550396919, 548664055, 546769714, 544940758, 543180695, 541186256, 539456635, 538459396, 537969933, 537110252, 536533203, 536470757, 536265259, 536192245, 536115723, 536339340, 536697807, 536645126, 536102486, 535698624, 535621529, 535055923, 534259949, 533216972, 532421532, 532281494, 531941299, 531191978]
2870.9E31191978q55979k73667k21748r06067q40836p34138p31163l21579k52953l40500
2880.6E25713348m56085l09219o7749o39725p14455j051750j389007n20554m56047
2889.3E20108757p24297r34600p69692k48985o60248r55162p68700r10797j081810
2897.9E13054466o89163o20422n58853m81415o99501l74146o15387r64622j008644
2906.6E07042313q62008q04977j282959r36851p55654j094742j170425j234436j468582
2915.3D97431679j613960j399956j699066j916733j080818l04566r22622j241227k45781
2924D87006950J44463n78346q97026J71966O21720J48544l9520N23834Q67653J73225
2933.6D88143463M24652P61452R01375M21676j21269R73969Q45108L44085N23453M85153
$$ y = [531191978, 530335999, 530062332, 529840584, 528934517, 528093681, 527359543, 526628380, 526306801, 526053848, 525713348, 525257263, 524948044, 524880295, 524240570, 523526115, 522474365, 521085358, 520564804, 520108757, 519384460, 518449860, 517680168, 517431183, 516770935, 515815773, 515047073, 514136276, 513054466, 512365303, 511744881, 511186028, 510704613, 510005112, 509630966, 509015579, 508050957, 507042313, 506180305, 505375328, 504092369, 503155518, 502399864, 501305122, 500134697, 498900261, 497431679, 495817719, 494417763, 492718697, 490801964, 489721146, 489416580, 488493958, 487252731, 487006950, 487151413, 486573067, 485676041, 485848007, 486469727, 486618271, 486578751, 487102585, 487970238, 488143463, 488568115, 489329567, 490230942, 490652618, 490531349, 491505318, 492350426, 492694511, 493217964, 493703117]
2943.3D93703117O15120Q02269Q00515L71856K75650m5090K68364N93110J7318K03896
2952.9D97606125N10025M72336k36244k71569K39678J54800L90587O90155P40471K16255
2962.6E00512619L88756P16362K35634J74484P13997R97886O21453P32307O75888O99959
2972.2E06469345O92558K94571M54636N26123O83098K10686L82690Q37936J97182K72331
2981.8E11021156L37220L90052L53051M74662P55005K40135Q5488K64892P9613p3891
2991.5E13927383L21083n5351n51643j8540L33977J93520j77994r9258m21906n11398
3001.1E12939873j57318j56174j17874o69594n01709k06413k97432k19841n17273n70259
3010.8E09525986n55611j13640R6779m76646p54929l05176j80092p21626o97136p67746
$$ y = [493703117, 494318237, 495120506, 495921021, 496292877, 496568527, 496523437, 496791801, 497384911, 497402229, 497606125, 498116150, 498588486, 498352242, 498080673, 498320351, 498475151, 498865738, 499555893, 500296364, 500512619, 500901375, 501617737, 501853371, 502027855, 502741852, 503739738, 504361191, 505093498, 505769386, 506469345, 507161903, 507456474, 507911110, 508437233, 509120331, 509331017, 509713707, 510551643, 510748825, 511021156, 511358376, 511748428, 512101479, 512576141, 513331146, 513571281, 513656769, 513921661, 514001274, 513927383, 514248466, 514193115, 513641472, 513622932, 513956909, 514150429, 513972435, 513873177, 513451271, 512939873, 512782555, 512626381, 512508507, 511838913, 511337204, 511130791, 510833359, 510613518, 510096245, 509525986, 508970375, 508856735, 508953514, 508476868, 507721939, 507416763, 507236671, 506515045, 505817909, 505050163]
3020.4E05050163m94537M4594k39067o86188r58710p99980n77583n26886m41513k45400
3030.1E00124893l00712q63953j107063o49834o60095p04079k9182o25878q92677l55988
3039.7D93935432n91392m93965n40619o24771r17282j128044q55980m43001k81830
3048.4D88058548q92792q35876p49169p50694o80962p21244p05338j033668p29638
3057.1D80959167q06922p63512m02870j58463O714n33638m73213q46100p55043k14882
3066.7D76011238p65762p45087n04761m89769o50749m09508l55072j002273r95178
3075.4D70093079k99302j87873p53899n27573o03714m28695l2006o65054n91659l87726
3085D65615578n90439p22695l13606k78511o03714k61688m54903m72946m29153n24750
$$ y = [505050163, 504555626, 504600220, 504361153, 503674965, 502716255, 501916275, 501338692, 500811806, 500370293, 500124893, 499824181, 498960228, 497853165, 497203331, 496543236, 495839157, 495809975, 495184097, 494291420, 493935432, 493344040, 492850075, 492309456, 491684685, 490767403, 489639359, 488783379, 488340378, 488058548, 487165756, 486329880, 485580711, 484830017, 484149055, 483427811, 482722473, 481688805, 480959167, 480152245, 479388733, 478985863, 478827400, 478834114, 478300476, 477827263, 476981163, 476226120, 476011238, 475245476, 474500389, 473995628, 473505859, 472855110, 472445602, 472090530, 471088257, 470093079, 469793777, 469605904, 468852005, 468324432, 467720718, 467292023, 467260017, 466594963, 466003304, 465615578, 465025139, 464302444, 463988838, 463710327, 463106613, 462844925, 462390022, 461917076, 461487923, 460963173]
3094.7D60963173n53932p12662n92499n98106m56772o23550n77851m28581p42378o12107
3104.3D55064735l15017m13666p02896o92978p52869m02145m54750o62079k10609p01828
3114D49755898p94602n23491m27322l27721o30455o33697n42069n53360q66623n75447
3123.6D43881111m63562o58302l56369o38237o89697q95844r90906n08461m34875m80919
3133.3D37763939l33824n30739j140022q98056o47469n90019n45197o15501l59917
3141.9D32103195o07719m94690o03829j036300r27582n43900l3874l62091o66542n81207
3151.6D26245461n50232p47223r62029q89854r13010q43239o89392n39551o99195m53072
3161.2D18958664p07893j078377k97890n50918p50542k60086l22380q45375p36008
$$ y = [460963173, 460409241, 459696579, 459104080, 458505974, 458049202, 457425652, 456847801, 456419220, 455676842, 455064735, 454749718, 454336052, 453633156, 452940178, 452187309, 451785164, 451330414, 450668335, 450457726, 449755898, 448961296, 448437805, 448010483, 447682762, 447052307, 446418610, 445876541, 445323181, 444456558, 443881111, 443417549, 442759247, 442402878, 441764641, 441074944, 440179100, 439188194, 438679733, 438244858, 437763939, 437430115, 436899376, 435759354, 434861298, 434213829, 433623810, 433078613, 432463112, 432103195, 431495476, 431000786, 430396957, 429360657, 428433075, 427889175, 427855301, 427493210, 426826668, 426245461, 425695229, 424948006, 423985977, 423096123, 422183113, 421339874, 420650482, 420110931, 419411736, 418958664, 418250771, 417172394, 416874504, 416323586, 415573044, 415312958, 414990578, 414145203, 413409195]
3169.9D13409195n57060j201325n93071k49710p68890j052704n71022n9052r75647
3178.6D07380714o76307j32370n51987j201172j040268k02446p20939r88884q88672
3187.3D00977669k75002k90870r11560k94076o79397j068764p45354m51240o78520
3195.9C95582886p65610j56403o20155p16095m09355l62930n21736p18804o74820o90155
3205.6C89946823l97453o74782m22096j15509n85861p58210p13844l41148r43985j111603
3215.2C83882332l15628j00823L4562m05694j063079n32723J63765q39958j168976
3223.9C79653778j57280l41339j131821r93728r6741k53220k57568o9580q42705m08554
3233.5C75101242k17476q40225m79546o45103q06847k17361o16303n72090j63383m78325
$$ y = [413409195, 412852135, 411650810, 411057739, 410808029, 410039139, 408986435, 408415413, 408356361, 407380714, 406704407, 406572037, 406020050, 404818878, 403778610, 403576164, 402855225, 401866341, 400977669, 400702667, 400411797, 399500237, 399206161, 398526764, 397458000, 396712646, 396261406, 395582886, 394817276, 394660873, 394040718, 393324623, 392915268, 392552338, 392030602, 391311798, 390636978, 389946823, 389549370, 388874588, 388452492, 388336983, 387751122, 386992912, 386279068, 385937920, 384993935, 383882332, 383566704, 383465881, 383500443, 383094749, 382031670, 381498947, 381662712, 380822754, 379653778, 379496498, 379155159, 378023338, 377029610, 376932869, 376679649, 376422081, 376352501, 375509796, 375101242, 374883766, 374043541, 373563995, 372918892, 372112045, 371894684, 371278381, 370706291, 370542908, 370064583]
3243.2C70064583q2779r2049l80134l55645n81092q52852q82607l49769l31803j02844
3252.8C66053009j75362j068763q85277k46048j30043n78728o64139o47049k46391
3261.5C61411209K60773m19235o49758l56254m34761o31562j92527M959l65944k31476
3271.2C58395424o27174n16282k06375m01001l41186n23987k11487m87671r83543m08592
3280.8C53688126j1864l1815k75612n66787k41013K08969j84478m78211m93393k41127
3290.4C51372795R9411m68483n78155j38207k98881q70209p40433j20621k22015j92718
3300.1C47842484j19095j7472O6033n01251r00727p13234o6185J58539m34875q35686
3309.7C44478531l84064J02463j93253o10160m09203k0676l55797p13729o73294p00837
$$ y = [370064583, 369981804, 369889755, 369509621, 369153976, 368572884, 367720032, 366837425, 366487656, 366155853, 366053009, 365877647, 364808884, 363923607, 363677559, 363547516, 362968788, 362304649, 361657600, 361411209, 361671982, 361252747, 360602989, 360246735, 359811974, 359180412, 358987885, 358992844, 358626900, 358395424, 357768250, 357251968, 357045593, 356644592, 356303406, 355779419, 355567932, 355080261, 354096718, 353688126, 353676262, 353644447, 353368835, 352802048, 352561035, 352770004, 352585526, 352107315, 351613922, 351372795, 351472206, 351003723, 350425568, 350287361, 349988480, 349118271, 348377838, 348257217, 348035202, 347842484, 347723389, 347705917, 347771950, 347270699, 346369972, 345656738, 345590553, 345749092, 345314217, 344478531, 344094467, 344196930, 344003677, 343393517, 342984314, 342963638, 342607841, 341894112, 341220818, 340519981]
3319.4C40519981l24745j10130k54860l13721p36465r46045m11949l33405n59387k40440
3329C36288834m21257o74019l98445m91982n79071o35033n18722j2436m64020j054153
3338.7C31039696n07660j70517m42352o48537o72875p38945r27162k17361O33087j78337
3348.3C27169037o85005k69165p54357q60023m21829m89197l56484J5145l53356p80334
3357.9C22214432n2338k82936o37817r0599n59082m21677k88391l52860k1209j7701
3367.6C19489822J66626o88285r80835m30470m26407k58636k86637m11033l13645K1401
3377.2C15881901l48263n52711l95852l88565J11618l53012l49483k01798o76994k49157
3386.9C12477684M3640M69074J82553l68653r0007m80996q77704L5953P66640l9768
$$ y = [340519981, 340195236, 340085106, 339830246, 339516525, 338780060, 337834015, 337422066, 337088661, 336529274, 336288834, 335867577, 335193558, 334795113, 334303131, 333724060, 333089027, 332570305, 332557869, 332093849, 331039696, 330532036, 330361519, 329919167, 329270630, 328597755, 327858810, 326931648, 326714287, 327347374, 327169037, 326484032, 326214867, 325460510, 324600487, 324178658, 323689461, 323332977, 323348122, 322994766, 322214432, 322162094, 321879158, 321241341, 321150742, 320591660, 320169983, 319881592, 319528732, 319507523, 319489822, 319656448, 318968163, 317987328, 317556858, 317130451, 316871815, 316585178, 316174145, 315860500, 315881901, 315533638, 314980927, 314585075, 314196510, 314308128, 313955116, 313605633, 313403835, 312726841, 312477684, 312521324, 312990398, 313172951, 312804298, 312714291, 312233295, 311355591, 311391544, 312158184, 312118416]
3396.5C12118416p94659m48246K88983J28841m84943l9463Q2283k28234k85339j18504
3406.2C10219135K01016J04446k02904j14116J20125j29586j29127J7013n7850r841
3415.8C10018311L08666o2542p31735M42676R03702L223k35805k87380K09713J48716
3425.5C10717545o6014L78323P10964M21581k64702p7362N31502L45307K71110K99320
3435.1C13267574l75004J29262M65335Q0853K33917K18296J216889M97913m42715N72911
3444.7C15865231Q98342J054172m44698k34947Q16192J61209L57457P88631J231155
3453.4C20492744P01752K33002K73514L21579J044731P64045J23940J40724Q36373
3462.1C24932404Q57849N92498N34516J30386P81365O04744K24151Q89778J120110
$$ y = [312118416, 311323757, 310875511, 311164494, 311293335, 310808392, 310768929, 310851212, 310622978, 310337639, 310219135, 310420151, 310524597, 310321693, 310207577, 310327702, 310198116, 310068989, 310086002, 310028152, 310018311, 310326977, 310264435, 309532700, 309975376, 310879078, 310882301, 310646496, 310359116, 310568829, 310717545, 310651531, 311029854, 311740818, 312162399, 311897697, 311820335, 312351837, 312697144, 312968254, 313267574, 312892570, 313021832, 313487167, 313568020, 313801937, 314020233, 315237122, 315735035, 315292320, 315865231, 316763573, 317817745, 317373047, 317138100, 317954292, 318115501, 318472958, 319261589, 320492744, 321194496, 321427498, 321701012, 322022591, 323067322, 323831367, 323955307, 324096031, 324932404, 325790253, 326382751, 326917267, 327047653, 327829018, 328433762, 328657913, 329547691, 330667801]
3470.8C30667801P61566K14386P01141J048241N37186Q41064R90296L63731M57420
3479.5C36582832M90494O53992P37762K43264J337585J257210L85170O67991M25949
3488.1C42782249O25382J194572J139984M19007N71174J078797J146545Q93860L84064
3496.8C50235634R61647Q18252N47104P62253J649666J970825J19019k64893J52970
3505.5C56952477J227912J414147J106071R14994R8571J873932J707192P18536N73845
3514.2C66587677L6736P63397Q97484Q37669Q39424J013680J142959K121506J773643
3522.9C76014175q50753P73811K053528J368866N31158P88155J114197M72412J181488
3531.5C83447037J158371R26246Q41256J730918J168480j36566J909599J843644J151542
$$ y = [330667801, 331429367, 331643753, 332344894, 333393135, 333930321, 334771385, 335761681, 336125412, 336582832, 337073326, 337727318, 338465080, 338708344, 340045929, 341303139, 341688309, 342356300, 342782249, 343407631, 344602203, 345742187, 346161194, 346732368, 347811165, 348957710, 349851570, 350235634, 351197281, 352015533, 352562637, 353324890, 354974556, 356945381, 357064400, 356799507, 356952477, 358180389, 359594536, 360700607, 361615601, 361714172, 363588104, 365295296, 366013832, 366587677, 366624413, 367387810, 368285294, 369122963, 369962387, 370976067, 372119026, 374240532, 376014175, 375163422, 375937233, 377990761, 379359627, 379890785, 380678940, 381793137, 382265549, 383447037, 384605408, 385531654, 386372910, 388103828, 389272308, 389135742, 391045341, 392888985, 394040527]
3540.2C94040527Q49266R47876J189804J398812J256065K37694K267227N63278N21660
3548.9D03272209J919098J225891K037506K42958J542855K167587J511230J742859
3556.6D15662193L11928J486054J412887J359902J314392J837463J507797N23949L878555
3565.3D29295120J826401Q87489R73702j294785K134743J799240K177658K080918J454315
3574D41334801R68017J485329K368393Q41217K598953K063065Q27675K020836K128639
3582.6D56636925J341934M60701M174805K896194m51660K003670j293145K279206L778991
3591.3D71827621L272934J460419J214905L868523j019021J491967M010582J291923
3599D87419853K611542J028328J105308K097512J185493K384796M013977L345719p83386
$$ y = [394040527, 394889793, 395837669, 397027473, 398426285, 399682350, 399920044, 402187271, 402750549, 403272209, 405191307, 406417198, 408454704, 408697662, 410240517, 412408104, 413919334, 415662193, 415974121, 417460175, 418873062, 420232964, 421547356, 423384819, 424892616, 425416565, 429295120, 431121521, 432009010, 432982712, 431687927, 433822670, 435621910, 437799568, 439880486, 441334801, 442302818, 443788147, 446156540, 446997757, 449596710, 451659775, 452487450, 454508286, 456636925, 457978859, 458439560, 462614365, 465510559, 465058899, 467062569, 465769424, 468048630, 471827621, 475100555, 476560974, 477775879, 481644402, 480625381, 482117348, 486127930, 487419853, 490031395, 491059723, 492165031, 494262543, 495448036, 497832832, 501846809, 505192528, 504409142]
3607.7E04409142K894134J055374m15344O708031K197494j693039M097786L56751L600235
3616.4E23210564N258407J741791J829529j207009M14124L495598K681579K215004
3624.1E39639587L600235L202935K281608O660538K847710j0236397K906647M854354
3631.8E55757217N983010K926903j424370K085762L578300L152123J477470J671295
3639.5E75207710K455406L178521K765541P61299J927376L492469O209031L528289
3647.3E99525642j223449M887390J345672k496452j854591L475265L431969M529877
3655F11621323O704750o205254J221619N192871J101913J472473J490136K768020J820946
3663.6F27188797K292747J804085J057740N118598K922860N92804N29403o623382K263794
$$ y = [504409142, 507303276, 508358650, 507943306, 514651337, 516848831, 515155792, 519253578, 519610329, 523210564, 528468971, 530210762, 532040291, 530833282, 531247406, 534743004, 537424583, 539639587, 543239822, 546442757, 548724365, 555384903, 558232613, 547996216, 550902863, 555757217, 561740227, 564667130, 563242760, 565328522, 568906822, 572058945, 573536415, 575207710, 577663116, 580841637, 583607178, 584368477, 586295853, 589788322, 595997353, 599525642, 598302193, 603189583, 604535255, 602038803, 600184212, 603659477, 607091446, 611621323, 618326073, 612120819, 613342438, 618535309, 619637222, 621109695, 622599831, 625367851, 627188797, 629481544, 631285629, 632343369, 637461967, 640384827, 640977631, 641507034, 634883652, 637147446]
3672.3F37147446P952346J0534897L956070j7516403k61230O316909M675370k290802
3680F50514603l70636K906112K384110J656036J48773K33078M585877Q024292p871704
3688.7F62210541m099732R327469n805969k193146M953842J254273K017898N69458
3696.4F68234634q03604R94797N46341K315826L317719m277420k751694M350433K364655
3705.1F74291687J045685M52881J647873L992309o308975K883148N503998j3197327
3712.8F70311279L167725M865265P09076J00860J704941J976242l067932N78613O168976
3721.5F86515045j575012m432221L928299J160355j71814l003006p93381L341523J111297
3730.2F86081085O263581r60312q216858Q821335J455993j0444488M6234K559128Q77380
$$ y = [637147446, 645099792, 655634689, 659590759, 642074356, 641813126, 648130035, 652805405, 650514603, 650143967, 653050079, 655434189, 657090225, 657238998, 657472076, 662057953, 670082245, 662210541, 658110809, 667438278, 661632309, 659439163, 664393005, 665647278, 667665176, 668234634, 667431030, 668425827, 668972168, 671287994, 674605713, 670328293, 667576599, 671927032, 674291687, 675337372, 675790253, 677438126, 681430435, 675121460, 678004608, 683508606, 670311279, 673479004, 678344269, 679053345, 679154205, 680859146, 682835388, 679767456, 680346069, 686515045, 684940033, 680507812, 684436111, 685596466, 685424652, 682421646, 681628265, 684969788, 686081085, 692344666, 691384354, 683167496, 691988831, 693444824, 683000336, 683046570, 685605698, 686483078]
3738.9F86483078K124329K465973m225770L353043J2895126o698379j8386002P412110
3746.6F85423508N249252P068329j061249j0678787J1016693n201187j0426102N122986
3754.3F86513443M215927L524628l798065J816406N877838p074738k986831L623581
3762F91712189J644058J10474L037414j716003m691773L036118N369797J321716q329086
3770.7F91494904O10199K721786K12631P99561k19345M90646K65732L121261L01133
3779.4F99798508p894059J745377J480942J296997L067703k818756j896896Q16726
3787.1F95596542R07517M11835K3422L08761m97970Q16650j6098O64749L733139k555999
3796.7F99392548m915009Q76694L736648O586075l592987j0347671K379379K463150
$$ y = [686483078, 688607407, 691073380, 686847610, 690200653, 703095779, 696397400, 678011398, 685423508, 690672760, 697741089, 696679840, 686001053, 697017746, 691816559, 681390457, 686513443, 690729370, 694253998, 690455933, 692272339, 698150177, 691075439, 688088608, 691712189, 693356247, 693466721, 696504135, 694788132, 690096359, 693132477, 698502274, 699823990, 691494904, 692105103, 694826889, 695039520, 695839081, 695619736, 696110382, 696376114, 699497375, 699798508, 691904449, 693649826, 695130768, 696427765, 699495468, 696676712, 694779816, 695596542, 696504059, 696915894, 696939316, 697248077, 696750107, 697566757, 697550659, 698215408, 701948547, 699392548, 694477539, 695354233, 699090881, 705676956, 702083969, 691736298, 694115677, 696578827]
3804.4F96578827M584427O383285q557739o030273L821792J968460O56586N06668n16205
3813.1F99395828R78318O540679J349259j4357529L399506N006866M281616L754731
3820.8G10349274j7746888K95105N301514J567078K238846J02691l334427q4304J359252
3829.5G00048141L956147K389984r314194J069031O756515n197754j140594Q623810
3837.2G07191086n578461m526138P921295n211182k107772O036758k453461m968338
3844.9F96303787K598801K368545N2872J188736p70264K307969O500625m642639K996521
3853.6G08904953j3356323k759323R268875p55234k100754J637345J536254K554093
3861.3G04929886m879990J95542P662353n623932o269226L529587M959946O886596
$$ y = [696578827, 701163254, 707546539, 698988800, 692958527, 696780319, 698748779, 699405365, 699912033, 699395828, 700374146, 706914825, 708264084, 693906555, 697306061, 702312927, 706594543, 710349274, 692602386, 692897491, 698199005, 699766083, 702004929, 702107620, 698773193, 698688889, 700048141, 704004288, 706394272, 697080078, 698149109, 704905624, 699707870, 698567276, 707191086, 701612625, 697086487, 705007782, 699796600, 697688828, 703725586, 701272125, 696303787, 698902588, 701271133, 701324005, 702512741, 701742477, 704050446, 710551071, 705908432, 708904953, 695548630, 692789307, 702058182, 701302948, 699202194, 700839539, 702375793, 704929886, 700049896, 700245438, 707907791, 702283859, 696014633, 699544220, 704504166, 711390762]
3869.1G11390762o256408j0012131K345581N277328L843384r463424n29175L145981
3876.8F99741898L96652K723007M882355l302918p509384M715958J066055O45294M143906
3885.4G07502823j1931610N88226M066467J005402L772202q7662p915268L60718L307190
3894.1G00668488j151429J235886J429901K669144K785263r429245M339752K286377
3901.8G04834137o182175M162827k607346j729812L70636J33819J143723o02799N19486
3910.5G00042496J80740n8823N8747M2877J546555K141418l443680l958359M572907
3919.2G01124878J102142l733215J583633J711884J733246j489563l780823Q09860
3926.9F99062042J436615Q98056q15963j1979K142640k245560j554947J464004n78308
$$ y = [711390762, 705134354, 695122223, 697467804, 702745132, 706588516, 697125092, 696595917, 699741898, 700138550, 702861557, 707743912, 704440994, 696931610, 701647568, 702713623, 703358917, 707502823, 695571213, 696159439, 700225906, 701231308, 705003510, 704915848, 697000580, 697361298, 700668488, 699517059, 700752945, 702182846, 704851990, 707637253, 698208008, 702547760, 704834137, 698651962, 702814789, 700207443, 698477631, 698848267, 698982086, 700125809, 699523010, 700042496, 700223236, 700164413, 700223160, 700266037, 701812592, 703954010, 700510330, 696551971, 701124878, 702227020, 698493805, 700077438, 701789322, 703522568, 702033005, 698252182, 699062042, 700498657, 701396713, 700580750, 700568771, 702711411, 700465851, 698910904, 700374908, 699796600]
3935.6F99796600m41742M27323p04346m58145M05731J951676J331100l970642j293793
3944.3F97043762J056671J369553K428436j591339J44653O82755k203064J305161L27224
3953G00563812j076126n7907L86658K10418k59933M83627q20388K24380N09491j514587
3962.6F98649445K35443M20608p20367m73404K91443P57675J11465n56259O57044P47985
3972.2G00121078o96563Q8501M50058l29514j122284j19858J046601l07770l47595
3980.9F98782654P67898O23932k78549l15475q8425k6169m05655n08652Q14133L30200
3990.6F99695892l62625m61654N41076J050568j001892k22779L26615p8430j47629
3999.2F99339142k57340
$$ y = [699796600, 699354858, 699782181, 699077835, 698619690, 699025421, 700977097, 702308197, 698337555, 697043762, 698100433, 699469986, 701898422, 700307083, 700451736, 701134491, 698931427, 700236588, 700563812, 699487686, 699429779, 699816437, 700026855, 699766922, 700250549, 699430161, 699654541, 700164032, 698649445, 698884888, 699305496, 698585129, 698111725, 698403168, 699160843, 699272308, 698716049, 699373093, 700121078, 699424515, 699513016, 699963074, 699633560, 698511276, 698391418, 699438019, 699130249, 698782654, 699550552, 700174484, 699895935, 699580460, 699492035, 699465866, 699060211, 698551559, 699365692, 699695892, 699333267, 698871613, 699412689, 700463257, 699461365, 699238586, 699565201, 699486771, 699339142, 699081802]
4000.2F99081802
$$ y = [699081802]
##END=$$ End of the data block
