##TITLE=$$ Begin of the data block
##JCAMP-DX=5.00 $$ ACD/SpecManager v 10.08
##SPECTROMETER/DATA SYSTEM=Varian
##DATE=08 Jan 2013 16:10:02
##DATA TYPE=INFRARED SPECTRUM
##DATA CLASS=XYDATA
##ORIGIN=
##OWNER=
##NPOINTS=3735
##FIRSTX=399.26403809
##LASTX=4000.35498047
##MAXX=4000.35498047
##MINX=399.26403809
##MAXY=74.62046814
##MINY=30.50694656
##XFACTOR=1.0000000000
##YFACTOR=0.000000100000000
##FIRSTY=49.15117264
##DELTAX=0.96440572
##XUNITS=1/CM
##YUNITS=TRANSMITTANCE
##XYDATA=(X++(Y..Y))
399.3D91511726l11851J3447761Q043137p184410q423157J170159N713653r69543K127876
407.9E05125351Q997879j896896m640732k196655m976693k332954M550667N01632m776153
416.6D98355446J152687Q479652J2603836n066566m015617o00815q184777j052589
424.3E01671257J167717j771355O61774J284294R53140r16442n69878O13747L749618
433E06843872j252022q530845l01285L601265j333885j904831K030677N212708J390953
441.7E05756607l971901M98886N925675r1782m275169J889839J722755l453369j519470
450.4E02482071N66673k305527l547782J129226M377899J565896j804162m574699P52640
459.1D98642235K686233p70950J627769J465989j050682k264214o722260l795280l06244
$$ plain form
399.3 491511726 491199875 504647636 512690773 505506363 497083206 498253365 503967018 502997475 505125351
407.9 505125351 514123230 512226334 507585602 505388947 500412254 498079300 502629967 503131599 498355446
416.6 498355446 499508133 507987785 520591621 515525055 511509438 510908623 502723846 501671257
424.3 501671257 502838974 501067619 501729393 503013687 503966827 503050385 502480507 503094254 506843872
433 506843872 505591850 497061005 496759720 500360985 499027100 497122269 499152946 504365654 505756607
441.7 505756607 501784706 502283592 508209267 508117485 503842316 505732155 507454910 504001541 502482071
450.4 502482071 503048744 500743217 497195435 498324661 502702560 504268456 502464294 497889595 498642235
459.1 498642235 501328468 500557518 502185287 503651276 502600594 500336380 493614120 489818840 489512596
467.7D89512596P15790K660446K552414j757736j0295563P89757M614639R4910N239639
476.4D94126892L132820l612060j957856k526321j813316K062378N80215K862244L930473
485.1D96785469m507904m433937K552223K293968k378082m684982l511734q28133K173538
493.8D83460426L404885K023811J001892l23143j149521j32217O09054j947174l658142
502.5D83289871L6850L37792k25487r03854M1008J549758N43328q2665k107620l97034
512.1D82081947K672119K58141k730293j821976J330109J158485m71802j759071k060509
520.8D78657150k58903q3771o3744r65004k059707L59001J745453j353874k844963
529.5D73131638J27830J109085P57523O5803p71522r5024m20494k49253J061898K34375
$$ plain form
467.7 489512596 490228386 492888832 495441246 493683510 483387947 484177704 488792343 488887253 494126892
476.4 494126892 497259712 493647652 491689796 489163475 487350159 489412537 489992752 492854996 496785469
485.1 496785469 492277565 487843628 490395851 492689819 490311737 485626755 482115021 481286888 483460426
493.8 483460426 486865311 488889122 489891014 489567871 488418350 488286133 488895187 486948013 483289871
502.5 483289871 483326721 483664513 483439026 482535172 482576180 484125938 484669266 484586601 482478981 482081947
512.1 482081947 484754066 485012207 482281914 480459938 481790047 482948532 482476730 480717659 478657150
520.8 478657150 478398247 478314476 478250732 477285728 475226021 475585022 477330475 475976601 473131638
529.5 473131638 473259468 474368553 475126076 475191879 474420357 474325333 473904839 473655586 474717484 474951859
539.1D74951859j737175k073327j258010L79638J454811O07605j271591j463089Q38699
547.8D70429420q81843k007027R64470O80313l08761j432381j534386P14836R43528
556.5D67568169n35546j346626j07002O99615l10287o21758q4038k42309l62854l40576
566.1D64316788k35176J210937J849060J387444j47705k449684k018395k00691n9776
574.8D63652802p55196j11237M07906M11224L00904M57649J382522m17137j741333
583.5D63588104r3841M03824p4883K98080J226426Q56781k01264N08843O81228o02340
593.1D66590958p84912N02166J306954K29759n50499n35278o562R27277J540413N38330
602.8D69758606j615448j053276p96204j238022P01981O5575j133461M24194N40962
$$ plain form
539.1 474951859 473214684 471141357 469883347 470262985 471717796 472325401 471053810 469590721 470429420
547.8 470429420 469547577 467540550 468505020 469185333 468876572 467444191 465909805 466624641 467568169
556.5 467568169 467032623 465685997 465578995 466278610 465968323 465346565 465262527 465020218 464657364 464316788
566.1 464316788 464081612 465292549 467141609 468529053 468381348 465931664 463913269 463712578 463652802
574.8 463652802 462897606 462786369 463194275 463605499 463906403 464364052 465746574 465329437 463588104
583.5 463588104 463494263 463898087 463823204 464121284 465347710 466204491 466003227 466512070 467193298 466590958
593.1 466590958 465806046 466308212 467615166 467844925 467294426 466759148 466752586 467679863 469220276 469758606
602.8 469758606 468143158 467089882 466293678 465055656 465757637 465823212 464689751 465113945 465654907
611.4D65654907l35388j440124j844101m15879J51787k96974p54662o6757J898422
620.1D62551231J784821J71966O18325J428566O16646o74668m78592N27726K089843
628.8D68635864K949791J577873K31438Q57735J562004Q35304J919975R01757j316262
637.5D78155479P89032J449852J158791J653328J622276R32579N28488J548653L28827
646.2D88167305M58794M03213j363563Q38050J730004Q76236J804123J642494N02968
654.8D95059624m17214j148224n36041n78461p13424K37465K22816K02561l78914n43976
664.5D91406212J328583K347984J629105m976807p28264J444283P05108R55315J078071
673.2D95189590J607895J935654J151810J76582l2387M95987M08898N43861J439629
$$ plain form
611.4 465654907 465319519 463879395 462035294 461619415 461771202 461474228 460719566 460652809 462551231
620.1 462551231 464336052 464508018 465126343 466554909 467171555 466496887 466018295 466546021 468635864
628.8 468635864 471585655 473163528 473394966 474252701 475814705 476650009 478569984 479471741 478155479
637.5 478155479 478944511 480394363 481553154 483206482 484828758 485761337 486289825 487838478 488167305
646.2 488167305 488626099 489029312 487665749 488503799 490233803 491110039 492914162 494556656 495059624
654.8 495059624 494642410 493494186 492958145 492379684 491666260 491903725 492126541 492329102 491950188 491406212
664.5 491406212 492734795 495082779 496711884 491735077 491006813 492451096 493156204 494111519 495189590
673.2 495189590 496797485 498733139 499884949 500061531 500029144 500525131 500934029 501477890 502917519
681.8E02917519J478805J184273K138824K575150L54843n28030P90443j97334l99475
690.5E10315018L38669O29539J409531O15501P59964J168594R74579M59748m56047
699.2E16215096N51452M59023n08881l67775J133843J658287J310463K085113N10368
707.9E23046989m1732L33480M3259L71628K82478Q21495L63922J008072J420784O21338
717.5E28271713K27242j086083o62765O97670J774978J359711L48053N78385P74078
726.2E32282982J312370J206894J640587R85451n4398N69801N03388K73209M91294
734.9E39211578J113129N91812M98886R20372m9553m59938J19553J167526J260147
743.6E44373512J88599m9553P20367M35791J001740J331673K47650J029320K58560
$$ plain form
681.8 502917519 504396324 505580597 507719421 510294571 510649414 510121384 510911827 510714493 510315018
690.5 510315018 510653687 511283226 512692757 513308258 514068222 515236816 516211395 516671143 516215096
699.2 516215096 516766548 517225571 516716690 516348915 517482758 519141045 520451508 522536621 523046989
707.9 523046989 523005257 523338737 523381996 523753624 524036102 524857597 525221519 526229591 527650375 528271713
717.5 528271713 528498955 527412872 526750107 527447777 529222755 530582466 530930519 531508904 532282982
726.2 532282982 533595352 534802246 536442833 537428284 537373886 537943687 538447075 538720284 539211578
734.9 539211578 540324707 540916519 541415405 542335777 542286224 541826286 541945839 543113365 544373512
743.6 544373512 544562111 544512558 545232925 545668716 546670456 548002129 548249779 549279099 549537659
752.2E49537659l31765N22347P05490R48677Q96607J424789J028099J125717R28383
760.9E56786003Q14057J299781l06663o50635M97398J609345J125793Q77915Q24966
769.6E62877960r6931J76811j39122k51656j181640l62053J215248P25784Q99849N7373
779.2E63921623k30026k43721N99327M38690r18884L85780R2545k91901O73065J090661
788.9E65517159Q78295J234894J449051o74324j215630j8272r0561j466102j158829
797.6E64455681R689M42543O12374j450j75552j052437j642914j787415j650734j418342
807.2E57791443j385651m99801l64647k61383q26569j221809j765900k099571r60045
815.9E48406067p91016m96673n99938J76621J031456J537170K087975J158905J483803
$$ plain form
752.2 549537659 549205894 549728241 550433731 551382408 552279015 553703804 554731903 555857620 556786003
760.9 556786003 557600060 558899841 558593178 557942543 558439941 560049286 561175079 562052994 562877960
769.6 562877960 562781029 562957840 562818718 562567062 561385422 561023369 562238617 562964401 563864250 563921623
779.2 563921623 563691597 563447876 564047203 564485893 563567009 563952789 564045334 563753433 564426498 565517159
788.9 565517159 566395454 567630348 569079399 568405075 567189445 567171173 567080612 565614510 564455681
797.6 564455681 564465370 564907913 565520287 565518837 565343285 564290848 562647934 560860519 559209785 557791443
807.2 557791443 556405792 555905991 555541344 555279961 554453392 553231583 551465683 549366112 548406067
815.9 548406067 547615051 547118378 546518440 546695061 547726517 549263687 551351662 552510567 553994370
824.6E53994370R86213J505089J791992M80232J304055K384758M221344M163971L271980
833.3E74104004K230644J300240J702461J397209J299858k91977R22699K109719J819305
841.9E86594162L337822K382507J389733J018333K37732k70233Q92677M15154r3422
850.6E95904465J031303L29704K010308K784958K639427J519356J83601J293793N45578
859.3F08242493L42445L05634R92164J236420J015434M39415M3297J099892r01070
868F12816124r21059r89265j976624k561111k677040j23177j38969k28424q8845P84607
877.6F03896217O87294j218605l54156p09534j283531r34944j47820L3646n04456q16002
887.3E98648109m39071N75256r6245p50694j702156m48761L98903J03454O72760m80766
$$ plain form
824.6 553994370 554980583 556485672 558277664 558757896 560061951 562446709 566668053 570832024 574104004
833.3 574104004 576334648 577634888 579337349 580734558 582034416 581742439 582665138 584774857 586594162
841.9 586594162 589931984 592314491 593704224 594722557 594960289 594690056 595582733 595997887 595904465
850.6 595904465 596935768 597265472 599275780 602060738 604700165 606219521 606403122 607696915 608242493
859.3 608242493 608584938 608890572 609882736 611119156 612134590 612574005 612617302 613717194 612816124
868 612816124 611895065 610905800 608929176 606368065 603691025 603567848 603428879 603200455 603111610 603896217
877.6 603896217 604583511 603364906 603010750 602301216 601017685 600082741 599934921 599968567 599464111 598648109
887.3 598648109 598209038 598784294 598688049 597937355 596235199 595786438 596185341 596288795 596961555 596480789
896.9E96480789M87175j99852q86268l31650o47049m56429j293907N01251J225586
905.6E94879646J431313K015304J166916J570320J392632J158104O62537R22355n84755
914.3F04614372k009964j393928j599198j182327j477432j376648k186089k208213
922E91180573j481247k273903k791901l151588k103615k571869l003616k667695k477951
930.7E68657188j760215j838036j063003j330986j510506r53179o84814p04880j012039
939.3E57799530l77808j126136j418763j213073r84268r2736r8915j26686k75536j73339
949E51912270n20554j84288P59277N89600p99637j986732r72786n88150j145707k607498
958.6E44455795k151336j001397k788314k628861j414413o14510j125069j993522j477165
$$ plain form
896.9 596480789 596967964 596768112 595881844 595550194 594903145 594446716 593152809 593654060 594879646
905.6 594879646 596310959 598326263 599493179 601063499 602456131 603614235 604276772 605199127 604614372
914.3 604614372 602604408 601210480 599611282 598428955 596951523 595574875 593388786 591180573
922 591180573 589699326 587425423 584633522 581481934 579378319 576806450 573802834 571135139 568657188
930.7 568657188 566896973 565058937 563995934 562664948 561154442 560201263 559516449 558811569 557799530
939.3 557799530 557421722 556295586 554876823 553663750 552679482 552586746 552487831 552361145 552085609 551912270
949 551912270 551391716 551207428 551966705 552556305 551756668 549769936 548797150 548209000 547063293 544455795
958.6 544455795 542304459 541303062 538514748 535885887 534471474 533856964 532731895 530738373 529261208
967.3E29261208j805993j632385j599541j745147j948662k084198k004089k940789
975E13500404l110695l007736l140106l325310l631630l369751l442230m110412m220620
983.7D82141914m218788m701385m156075l609085m230003l793984l062629k911530
991.4D51458435k835960l261338k677154k495270k879944k869186k713204k497825
999.1D29228554k813568k160149j875992j675072j831779j700630j417732k238160
1006.8D13515472q49800j208114k200432k111282j995621j700173k640533j053848
1014.6C99755669q44155j814613j889420j999931k186890l289566k006988k089462
1022.3C83634644k175408j543808j217727p61261k046509j737862j672935o97022n21126
$$ plain form
967.3 529261208 527455215 525822830 524223289 522478142 520529480 518445282 516441193 513500404
975 513500404 510389709 507381973 504241867 500916557 497284927 493915176 490472946 486362534 482141914
983.7 482141914 477923126 473221741 469065666 465456581 461226578 457432594 454369965 451458435
991.4 451458435 448622475 445361137 442683983 440188713 437308769 434439583 431726379 429228554
999.1 429228554 426414986 424254837 422378845 420703773 418871994 417171364 415753632 413515472
1006.8 413515472 412665672 411457558 409257126 407145844 405150223 403450050 400809517 399755669
1014.6 399755669 398911514 397096901 395207481 393207550 391020660 387731094 385724106 383634644
1022.3 383634644 381459236 379915428 378697701 377936440 375889931 374152069 372479134 371782112 371260986
1031C71260986j493568j182022r61151J14975M13246R97963R98153J985970K386513
1039.6C74521065J626243J191101L17345J171990K35557k41089l44963o28280q01964
1048.3C77047005j315308k66647j326218j133385j742172k271080j197624q52776m69818
1057C66471977k138672J28670R17740N90248K491150K914658L298568J719170J147537
1065.7C77541046R53369J951294K591667J801033J131020P07245J895561Q50983K90909
1074.4C89714127j98746k92435M44184R00039Q46825p90558J374664J966629J244927
1083C95209656R09920L51181R18121L33977J101722l81508M06495K405700J892090
1091.7D03147354K072716J156349J362457P41349J052398J025582O83365J349029M02184
$$ plain form
1031 371260986 369767418 368585396 367624245 367739220 368152466 369150429 370148582 372134552 374521065
1039.6 374521065 376147308 377338409 377655754 378827744 379063301 378822212 378477249 377848969 377047005
1048.3 377047005 375731697 375465050 374138832 373005447 371263275 368992195 367794571 366941795 366471977
1057 366471977 364333305 364461975 365379715 365969963 368461113 371375771 374674339 376393509 377541046
1065.7 377541046 378494415 380445709 383037376 384838409 385969429 386676674 388572235 389423218 389714127
1074.4 389714127 389515381 389222946 389667130 390567169 391413994 390623436 391998100 393964729 395209656
1083 395209656 396119576 396470757 397388878 397722855 398824577 398443069 398849564 401255264 403147354
1091.7 403147354 405220070 406376419 407738876 408480225 409532623 410558205 411241570 412590599 412992783
1100.4D12992783J016082J499138K172127J658707R56688J163520M95758L80745r1934
1109.1D22243614L38707K26784K51350M88243J523552K572480Q84170N84221L09601
1117.7D29422722M5967k71187j82991L1471m69665O57043j61857N417Q82530J311149
1127.4D31270599J824913J059952K017441J922226J600456J545983J662178K457504
1135.1D45361252K218742K632485K898826K422028J564445J134911Q20923M44717R71451
1143.8D60469780J138840Q29467Q43659R54246N66979K72827r5406k43949j81733n89447
1153.4D63965263o00586q02192n04608r6283j47362m79050j216354p95708m45900j30501
1163.1D58746719m07829K57645K028312J849709K135239K075576K680893L417015K485772
$$ plain form
1100.4 412992783 414008865 415508003 417680130 419338837 420295525 421459045 421954803 422335548 422243614
1109.1 422243614 422582321 422809105 423060455 423548698 425072250 427644730 428528900 429113121 429422722
1117.7 429422722 429468689 429197502 429014511 429045982 428576317 429233360 429071503 429076920 429959450 431270599
1127.4 431270599 433095512 434155464 436172905 438095131 439695587 441241570 442903748 445361252
1135.1 445361252 447579994 450212479 453111305 455533333 457097778 458232689 459053612 459498329 460469780
1143.8 460469780 461608620 462438087 463281746 464235992 464802971 465075798 464980392 464736443 464554710 463965263
1153.4 463965263 463364677 462562485 462057877 461961594 461814232 461335182 460118828 459323120 458877220 458746719
1163.1 458746719 458338890 458596535 460624847 462474556 464609795 466685371 469366264 472783279 475269051
1171.8D75269051K608223K885360K260704J779175K140732K737045K526512K152977
1179.5D94359779K385865K350692K080651K290268J960868Q01201R75609J293984Q90312
1188.1E09389229J161384O81229O02379M37965J97411K86026n07393n76210j024056
1196.8E10647964j339988r13925o36254m31900n16662m87290o74667r11789q99429
1205.5E03836060p91626p84378n23606k97737k70309k79961n35011L7765J21422n80902
1215.1D99931717o96869n38864l17421o65894r05571r07478o67877k17095l61709o09703
1224.8D94043236p67670o88209n15442p76215j196937q65059n89981j060524q92334
1233.5D86690865l67432n9776O5956k00424l90091l23487k27508m83895m11949j6403
$$ plain form
1171.8 475269051 477877274 480762634 483023338 484802513 486943245 489680290 492206802 494359779
1179.5 494359779 496745644 499096336 501176987 503467255 505428123 506229324 507204933 508498917 509389229
1188.1 509389229 510550613 511231842 511834221 512272186 512469597 512755623 512248230 511672020 510647964
1196.8 510647964 509307976 508394051 507757797 507325897 506809235 506321945 505647278 504735489 503836060
1205.5 503836060 503044434 502260056 501736450 501438713 501168404 500888443 500353432 500391197 500512619 499931717
1215.1 499931717 499234848 498695984 498378563 497712669 496807098 495899620 495231743 495014648 494652939 494043236
1224.8 494043236 493275566 492587357 492071915 491295700 490098763 489233704 488643723 487583199 486690865
1233.5 486690865 486323433 486263657 486329613 486129189 485739098 485415611 485188103 484704208 484292259 484275856
1243.1D84275856j95885l09791k98081j43928L1624k27662m79354o06308k34566J46866
1252.8D81958771j78833l44010N2681J67771n7640m1886j69525n8861K46811N52559
1262.4D82127838O01959J57891M63524O25686O77529P56645L21388N74684Q42285L76664
1272D87526093M99343J348381J585427J187324N67398R56154J354218O35032P51877
1280.7D96411247J085663J159744Q37288R82743J501197J335564J364746J307869J473847
1289.4E07459908R99221O79055N85136m5891L38898J106110Q71047L28179Q35266P94754
1299E13951683L89366O2752M3640K87476n03197o16570l51486K68402R9182n77659
1308.7E13053589j18256l13225l76129m45747p63741j124191o67686K06566J4572K3384
$$ plain form
1243.1 484275856 484079971 483770180 483472099 483328171 483359795 483132133 482652779 482046471 481811905 481958771
1252.8 481958771 481779938 481435928 481488609 481656380 481598740 481556854 481387329 481328468 481575279 482127838
1262.4 482127838 482729797 482887688 483351212 483976898 484654427 485411072 485732460 486307144 487149429 487526093
1272 487526093 488025436 489373817 490959244 492146568 492713966 493670120 495024338 495659370 496411247
1280.7 496411247 497496910 498656654 499493942 500476685 501977882 503313446 504678192 505986061 507459908
1289.4 507459908 508459129 509138184 509723320 509677429 510016327 511122437 511993484 512321663 513156929 513951683
1299 513951683 514341049 514403801 514447441 514734917 514231720 513615150 513263664 513532066 513631248 513053589
1308.7 513053589 512935333 512622108 512245979 511800232 511036491 509912300 509244614 509451180 509465752 509489136
1318.3E09489136R4490Q24508J259728R33723Q79593O65016M10843Q6708M00887K36397
1328E15281029p25J0033k90070k42500k60201k29873o03791m37851o1493p0800l44
1338.6E13093414n3329N72777Q92524J280823J228142P65800M52652M25187Q39958
1347.3E19497948K54974O2409r1553J10206j0643k09274K47154k51388k64168o88934
1356.9E18656731l51220o8206m82674o34880q02727J97792m90112J21994K93770m71344
1366.6E15969124l03879r40018p47795l96385L0251j83907m85229l21770j54190J028290
1376.2E13494492J08451j85356J02501k69584o40717p13959o57730j203766n20820
1384.9E09513512m34609q59260k073365q54530j5755j593895j319732j459503j674271
$$ plain form
1318.3 509489136 509583626 510408134 511667862 512601585 513481178 514146194 514557037 514643745 515044632 515281029
1328 515281029 515280304 515290337 515000267 514757767 514497566 514267693 513663902 513226051 513164558 513093758 513093414
1338.6 513093414 513040085 513612862 514505386 515786209 517014351 517780151 518232803 518657990 519497948
1347.3 519497948 519752922 519815331 519723778 519833984 519823341 519614067 519861221 519609833 519345665 518656731
1356.9 518656731 518305511 518237305 517754631 517119751 516317024 516514816 516024704 516146698 516440468 515969124
1366.6 515969124 515665245 514725227 513977432 513581047 513611298 513427391 512942162 512620392 512466202 513494492
1376.2 513494492 513602943 513417587 513520088 513250504 512609787 511895828 511238098 510034332 509513512
1384.9 509513512 509078903 508219643 506146278 505291748 505275993 503682098 502362366 500902863 499228592
1393.6D99228592k635803l352928r38378r76677j354370l620796k404747q88634j982002
1402.2D81074257j714211j456375k467537k389526j422195j462098j641731j617622
1409.9D66902962j660958j263313j548271j344452p68204p54051j236610j336480j21574
1418.6D56869049l489990l58086J993485M47693m42315j447868J233482J597214J5907
1427.3D56418571N67284J38931K90909J225472J918182J310425P83996J932488J751747
1436D66338005L43208Q08792K539559J565246J355401J727752R55658J527024P98683
1444.7D77959328J174812J386757P50427N11894J693535K179222R27163J337318J041145
1453.3D88961601J517487J432419N18264J283036k43035L083916K219925K634697J809387
$$ plain form
1393.6 499228592 496592789 493239861 492301483 491324806 489970436 486349640 483944893 483056259 481074257
1402.2 481074257 479360046 477903671 475436134 473046608 471624413 470162315 468520584 466902962
1409.9 466902962 465242004 463978691 462430420 461085968 460317764 459563713 458327103 456990623 456869049
1418.6 456869049 453379059 453020973 455014458 455462151 455019836 453571968 454805450 456402664 456418571
1427.3 456418571 456985855 457124786 457415695 458641167 460559349 461869774 462653770 464586258 466338005
1436 466338005 466681213 467490005 470029564 471594810 472950211 474677963 475633621 477160645 477959328
1444.7 477959328 479134140 480520897 481271324 481783218 483476753 485655975 486583138 487920456 488961601
1453.3 488961601 490479088 491911507 492429771 493712807 493469772 496553688 498773613 501408310 503217697
1462E03217697J297493J953926K35214K165680K278290K641411K204857K160950K864265
1470.7E21019783J715393J880722K437401L551865K473907J378517K354965K610283
1478.4E39422836K244034J480522J517487J476936J693382J606865J212349J219902
1486.1E51874313P1602J3809P94144j312790P69348J554146L93486o9008p4882j33705
1495.8E53880463l615494j58157j292420k571411K25143p77168q51936n88341N49278
1504.5E44799957J44005o670265m910851L181343K378006n45654O52390j471024k074394
1513.1E35483513M87785r62219r92279k486916j402931J663437R42574k464638k943230
1521.8E27325096J836929J866227J463890j441193N76935J132431k89154J038360J408120
$$ plain form
1462 503217697 504515190 506469116 506704330 508870010 511148300 513789711 515994568 518155518 521019783
1470.7 521019783 522735176 524615898 527053299 530605164 533079071 534457588 536812553 539422836
1478.4 539422836 541666870 543147392 544664879 546141815 547835197 549442062 550654411 551874313
1486.1 551874313 551945915 551959724 552753868 551441078 552210426 553764572 554158058 554089050 554014168 553880463
1495.8 553880463 550264969 550106812 548814392 546242981 546468124 545690956 544839020 544250679 544799957
1504.5 544799957 544943962 538273697 533362846 536544189 538922195 538376541 539028931 537557907 535483513
1513.1 535483513 535971298 535009079 534016800 531529884 530126953 531790390 532732964 530268326 527325096
1521.8 527325096 529162025 531028252 532492142 531050949 531627884 532760315 532471161 533509521 534917641
1530.5E34917641J219101N57937p8506k040711J076737R28650L64532Q79746m120751
1539.2E33704376k305450K634048J857491K47764J643258J212158j391182J246032
1546.9E38848495L09601O35262p29294r18503J958885R37844J079864k807274J40190
1555.6E39455070J931611R45777l436470j2250595O516457J727409J623459k53372
1563.3E36259346q76770k464523k092781k70386j742249j137886p170143j011467q37402
1572E18655739k637901k195778l033371j950455j0917969q47854k312584l367806k923240
1580.6D88468781m592286l284454n608864l525238m453392l869171l589096m936562
1588.4D54609718l730201n592003k644158m747505l530311l906670m463234k327042
$$ plain form
1530.5 534917641 536136742 536694679 536616173 534575462 535652199 536580849 536945381 537825127 533704376
1539.2 533704376 531398926 534032974 535890465 536138229 537781487 538993645 537602463 538848495
1546.9 538848495 539158096 539793358 539064064 538145561 540104446 541042290 542122154 539314880 539455070
1555.6 539455070 541386681 542332458 538895988 526645393 533161850 534889259 536512718 536259346
1563.3 536259346 535382576 532918053 530825272 530554886 528812637 527674751 520504608 519493141 518655739
1572 518655739 516017838 513822060 510788689 508838234 497920265 497072411 494759827 491392021 488468781
1580.6 488468781 483876495 480592041 474983177 471457939 467004547 463135376 459546280 454609718
1588.4 454609718 450879517 445287514 442643356 437895851 434365540 430458870 425995636 423668594
1596.1D23668594m536743k150078m212417k453003l445244l133926k179261m027595
1603.8C97530327q80203k977372j008377l060302j771241j449470k703018K6054k795830
1612.5C80910568P0915j800193j11733l10364n541687K169457r54437P56111j345482
1621.1C73843155J260414n71289l061066J893997Q6899K268410j832962M87747P86019
1629.8C75161324R00383J170272r4375K598152O78711o78368k380943L725777K258262
1638.5C83339195J115151K335510k4223K033386L58467K284508K255554M11796J894074
1647.2C96003418j703110L875809J676941L670807K713432l487358j621246J705207
1654.9D02833900N076256K005158K560882J303635K080269K195663J825142K626496
$$ plain form
1596.1 423668594 419131851 416981773 412769356 410316353 406871109 403737183 401557922 397530327
1603.8 397530327 396650124 393672752 392664375 389604073 387832832 386383362 383680344 383706398 380910568
1612.5 380910568 380981483 379181290 379069557 378759193 373217506 375386963 374432526 375188637 373843155
1621.1 373843155 375103569 374532280 371471214 373365211 373452110 375720520 373887558 374375305 375161324
1629.8 375161324 376061707 377231979 377137604 379735756 380414467 379736099 377355156 381080933 383339195
1638.5 383339195 384454346 386789856 386765633 388799019 389157486 391441994 393697548 394109344 396003418
1647.2 396003418 394300308 398176117 399853058 403523865 406237297 402749939 401128693 402833900
1654.9 402833900 407910156 409915314 412476196 413779831 415860100 418055763 419880905 422507401
1662.6D22507401L5018L554573K170525K953644K848740J839828K365341K257881M539605
1671.3D45072556J641387M031449L571167J326217K103158L936805M579087K755889
1679D69017715L574105K747154N225296N313683M28962J949616L177528O326218M352875
1687.7E02113152L890266L972244L588295M378281M002228M852981M693718M425926
1695.4E35917091K633N003204N927658N741730M365616l315354O888924N040283L627396
1704.1E69199181K767868K880630K146759K855683L705902J892357J788978K862930
1711.8E90100288L180123K325096m16145R41848L733101J395073m776039M134064L453941
1720.5F04071350J848564J705818R66378R84840J700630J859436J386910J433868J690865
$$ plain form
1662.6 422507401 422542419 426096992 428267517 431221161 434069901 435909729 438275070 440532951 445072556
1671.3 445072556 446713943 450745392 454316559 455642776 457745934 461682739 466261826 469017715
1679 469017715 472591820 475338974 480564270 485877953 486306915 488256531 491434059 497760277 502113152
1687.7 502113152 506003418 509975662 513563957 517942238 521944466 526797447 531491165 535917091
1695.4 535917091 535919724 540922928 546850586 552592316 556957932 553642578 560531502 565571785 569199181
1704.1 569199181 571967049 574847679 576994438 579850121 583556023 585448380 587237358 590100288
1711.8 590100288 593280411 595605507 595189362 596131210 599864311 601259384 596483345 600617409 604071350
1720.5 604071350 605919914 607625732 608592110 609576950 611277580 613137016 614523926 615957794 617648659
1729.1F17648659p99065j64833L300018L235894k162705l484154M941979M005012K179833
1737.8F28700638K612114l9597q72116L690720K157135Q35190K308807L491859K993851
1746.5F45878601K113113K087098J560135M307327J492157J253357M481888K551498
1754.2F65725174K669907K487335K00424K271347L266373K532196K327881j166993
1761.9F80313644O04783L295593J518402J590118K181092J839447j363831J882095
1769.7F91861343L833237k66800k018204l64151L881760J756592p02362K017822Q20847
1778.3G00820084J583557L83987r82666J455155J962204J543884o27747J47553J286468
1787G07572479Q85010P35931J239472N56259L24783k064361k84958L994675J037979
$$ plain form
1729.1 617648659 616849594 616684761 619984779 623220673 621057968 617573814 622515793 626520805 628700638
1737.8 628700638 631312752 631273155 630401039 634091759 636248894 637084084 639392891 642884750 645878601
1746.5 645878601 647991714 650078812 651638947 655946274 657438431 658691788 663173676 665725174
1754.2 665725174 668395081 670882416 671082840 673354187 676620560 679152756 681480637 680313644
1761.9 680313644 680918427 684214020 685732422 687322540 689503632 691343079 689979248 691861343
1769.7 691861343 695694580 695427780 693409576 693045425 696927185 698683777 697981415 699999237 700820084
1778.3 700820084 702403641 702787628 701804962 703260117 705222321 706766205 706138458 706286011 707572479
1787 707572479 708457489 709193420 710432892 710989151 711313934 709249573 708964615 712959290 713997269
1795.7G13997269m50745J317215J659164N63965j393966J125488n7831J010132J844635
1804.4G19615326P33719R24225K04544N75561P65152O03867j277237J831J373825O36978
1814G24157791J002274L16925O12182k07214M32587P72476J57318J069183j62048R67712
1823.7G29119186M80881k777023K19269K490081K643280n7067l105240N90133J825333
1832.3G31428833J61285P7744K67715M54483M63639j63193J154175L59192M67224J27182
1842G34798279J111297R14689n146637J968383J834870k86179J47553Q28476J057891
1850.7G37228622J1368Q21839m9363l24630k29492r2545N08499j7548N05066K37656
1860.3G38599472O57196N493J77307L29438j60523P50580l02811k7008j688080p73544
$$ plain form
1795.7 713997269 713546524 714863739 716522903 717086868 715692902 716818390 716760559 717770691 719615326
1804.4 719615326 720349045 721273270 721477814 722053375 722818527 723422394 722145157 722146988 723520813 724157791
1814 724157791 725160065 725476990 726089172 725881958 726314545 727087021 727244339 728313522 728151474 729119186
1823.7 729119186 729600067 726823044 727042313 729532394 732175674 732118607 729013367 729603500 731428833
1832.3 731428833 731590118 731667862 731935577 732390060 732853699 732690506 733844681 734203873 734671097 734798279
1842 734798279 735909576 736824265 731677628 733646011 735480881 735194702 735342255 736170731 737228622
1850.7 737228622 737239990 738061829 738012466 737687836 737458344 737365799 737874298 737856750 738361816 738599472
1860.3 738599472 739256668 739262161 739439468 739768906 739608383 740358963 740056152 740029144 738341064 737567520
1869.9G37567520J881027J206131P35932K8381M77066q2626r8419l83149j59378L20206
1879.6G41492691n68008M17404M22439Q55484J75095l48282J91422m3106R31091j092224
1889.2G42434006j928482P03277J122971O76880P49969L08380o46362Q92410M2115
1897.9G44355164k72828j04751m36249J89133k51618L00980P5836L08228L87802K4109
1907.6G44575806K51388j67694o31180o51016M40826k02178L70788Q35724M94003Q88214
1917.2G46204681j665649n08041P96890L65753k08816j184922k59475L13491O94428
1925.9G44548340J96533N60761K04162j33743J3809n12695q7052o87103J09634L23716
1935.5G44536362K76184L38669l02735L5019k26211R65499m02908j671753N40314K46353
$$ plain form
1869.9 737567520 739448547 740654678 741390610 741418991 741896057 741813431 741715012 741331863 741172485 741492691
1879.6 741492691 740924683 741342087 741764526 742620010 742795105 742446823 742638245 742595139 743526230 742434006
1889.2 742434006 740505524 741208801 742331772 743008652 743758621 744067001 743420639 744313049 744355164
1897.9 744355164 744082336 743977585 743541336 743730469 743478851 743779831 743855667 744163895 744551697 744575806
1907.6 744575806 744827194 744659500 744028320 743377304 743818130 743615952 743986740 744822464 745316467 746204681
1917.2 746204681 744539032 744030991 744827881 745193634 744984818 743799896 743540421 743853912 744548340
1925.9 744548340 744744873 745305634 745509796 745376053 745389862 744877167 744790115 744103012 744212646 744536362
1935.5 744536362 744812546 745151215 744848480 744883499 744657288 745622787 745219879 743548126 744088440 744334793
1945.2G44334793J06430q4839L04947r537q2702k442P3548J76697n26429j62277o03180
1955.8G43525009O7902L60794j99051R0027J01623M47007k32697M0207M2114k90375
1965.4G43952560n07507j001434J18866N58777N07660k60849O8283J72958k43835J33972
1975.1G43499451j29700K92892j55334k22473k35901k90909l6087k05231M44870j54266
1984.7G42807312r6436R8801j61896j97296m52804J23748r1476l51334P401M01382
1994.3G42087402k58712k27662K81144k76032Q087k58941J31454m8370l77426P9574
2004G41140518q316J67771m81949p2098J8921p8888R6969l37066j49536l30124M5700
2014.6G40011902J29089P3853m69055l61786k213k12478L76815n12237j36261J76010
$$ plain form
1945.2 744334793 744441223 744356384 744661331 744651794 744569092 744566650 744640198 744816895 744290466 744128189 743525009
1955.8 743525009 743592911 743953705 743754654 743844681 743946304 744393311 744160614 744200821 744242935 743952560
1965.4 743952560 743445053 742443619 742562485 743121262 743628922 743368073 743436356 743609314 743365479 743499451
1975.1 743499451 743369751 743662643 743507309 743284836 743048935 742758026 742721939 742516708 742961578 742807312
1984.7 742807312 742710876 742809677 742647781 742450485 741997681 742121429 742029953 741678619 741686020 742087402
1994.3 742087402 741828690 741601028 741882172 741606140 741614227 741355286 741486740 741438370 741060944 741140518
2004 741140518 741132202 741299973 740818024 740745926 740764847 740685959 740782928 740445862 740296326 739966202 740011902
2014.6 740011902 740140991 740214844 739745789 739384003 739381790 739169312 739546127 739033890 738897629 739073639
2024.2G39073639O5308O0730p66526R7656j31683J07041K6245l61023j79367n14984
2033.9G37477036K28805j41525l3570k21481l78723J79977M1428j36337n52979L91541
2043.5G36854172L18527J59836l1510l89556N035o19202j63650j72196j54342j44196
2053.2G35662918k7618L60412k00119K54975n112j68457m74854k91442K24838k44904
2062.8G35090637R7809l17612j98059j10016n1269K93732L66439L93601m65546k13241
2072.5G34886475k61689k81219k67258o7138N62210j22910r6512n9433L052j78833
2082.1G34116745k17361j17798l90091p4616j84478K55737J08795J75171P4692k47040
2091.7G33499756K22854l19747q5450j10473N4321k06223m97055K09122k07825J5030
$$ plain form
2024.2 739073639 739138947 739199677 738433151 738530807 738399124 738506165 738532410 738171387 737992020 737477036
2033.9 737477036 737705841 737564316 737530746 737309265 736930542 737110519 737151947 737015610 736462631 736854172
2043.5 736854172 737172699 737332535 737301025 736911469 736916504 736297302 736133652 735961456 735807114 735662918
2053.2 735662918 735635300 735995712 735795593 736050568 736045456 735876999 735402145 735110703 735335541 735090637
2062.8 735090637 735188446 734870834 734672775 734562759 734511490 734805222 735171661 735565262 735099716 734886475
2072.5 734886475 734624786 734343567 734076309 734009171 734571381 734448471 734351959 734292526 734295578 734116745
2082.1 734116745 733899384 733781586 733391495 733316879 733132401 733388138 733496933 733672104 733746796 733499756
2091.7 733499756 733722610 733402863 733317413 733206940 733261261 733055038 732557983 732767105 732559280 732574310
2101.4G32574310k44140j37253r16l87115j82495k94571j7777n0659K74658m3335O7063
2112G31557770L07693m20761j87225m91104l70407k07138L2119M7608n8976M21372
2121.6G30630951R3155J58691j86920k6474r8038k90069m2420o33316o5841K87246
2131.3G29826965M36783m0893k69165J67312k23312L4790Q8119J91880m07868m50439
2140.9G29354172L98178M47845J98441l67890M3564L4638k46048j81732K41470K92053
2150.6G30214691m1275K35291l78723J04522Q0185l6087L01666k30026K94495k38037
2160.2G30306702l01438m8904j3580J94549o8893K64129N9433R7885m35562k99988
2169.9G29754333K55356J19400L59497K0676K05841j89133o8740K95791J51673J07498
$$ plain form
2101.4 732574310 732330170 732192917 732192001 731804886 731622391 731327820 731310043 731259384 731534042 731490707 731557770
2112 731557770 731865463 731444702 731257477 730766373 730395966 730188828 730220947 730268555 730209579 730630951
2121.6 730630951 730724106 730882797 730695877 730669403 730571365 730281296 730238876 729605560 729539719 729826965
2131.3 729826965 730263748 730222855 729953690 730121002 729897690 729932480 730020599 730212479 729804611 729354172
2140.9 729354172 729752350 730200195 730398636 730030746 730074310 730108948 729862900 729681168 729922638 730214691
2150.6 730214691 730173416 730408707 730029984 730134506 730214691 730178604 730480270 730250244 730544739 730306702
2160.2 730306702 730005264 729956360 729942780 730137329 730068436 730332565 730391998 730489883 730054321 729754333
2169.9 729754333 730009689 730129089 730488586 730509262 730715103 730525970 730457230 730753021 730904694 731012192
2179.5G31012192j85547M94003j63650m57688J6022n4703m9820j17569L69416J32751
2189.1G30995407J55029k07138l31268J33820K45971O07682q240J40762J13754m39300
2198.8G31406479k82669m7074J68686O8512N7679q4916K78092J47781l3264n7373j97830
2209.4G31424103K12402J11008K20260k30331m7989P4234k00882L4638m25034L37982
2219G31510391L65372J51520P1640l14026R9792j01242j20086n45807l662M49447P8125
2229.7G31641464K75345R4681J23443k79464q2627j831R6054L9368n32913k46506l49731
2240.3G30777283L07922M40369J49154k62832l97721N00107k0981j28173N6228M7074
2249.9G31468430o2943J23138J60981l55988K44522K78855K77328m76074l75671J75628
$$ plain form
2179.5 731012192 730826645 731320648 731156998 730699310 730715332 730660629 730610809 730493240 730862656 730995407
2189.1 730995407 731150436 730943298 730612030 730745850 730991821 731599503 731591263 731732025 731845779 731406479
2198.8 731406479 731123810 731076736 731245422 731313934 731371613 731286697 731564789 731712570 731679306 731621933 731424103
2209.4 731424103 731636505 731747513 731967773 731737442 731689453 731763687 731562805 731597443 731172409 731510391
2219 731510391 731875763 732027283 732098923 731784897 731884689 731783447 731663361 731117554 731113892 731563339 731641464
2229.7 731641464 731916809 732011490 732134933 731855469 731772842 731771011 731867065 731906433 731373520 731127014 730777283
2240.3 730777283 731085205 731525574 731674728 731411896 731014175 731514282 731493301 731365128 731421356 731468430
2249.9 731468430 731405487 731528625 731689606 731333618 731578140 731856995 732134323 731658249 731282578 731458206
2259.5G31458206n07507J08642l585K39715J60446O4240M58374m6005l05100p18841
2269.2G30908585M10385J43738m11301J30310k53067J32675K9450J22070m6692k1439
2278.8G31144714j90200l76206L44162j16959j60980k35061K69851M54712j05438L662
2288.5G31032257j36337N4626n73806k30485J3733m66079j44348l3951N66025L60565
2298.1G30442200j70288m52881K19116M48151l45688m06037n59082Q8425j37176r8343
2307.8G29028397K96936L97186N17120n90286q9111J05667j45416k49634j98441k04925
2317.4G28867493o60935N15747j35956m03442k6092K03628L41721m28925O15158L9826
2327.1G28928223j68915K2125J66473K92588o85272k18125p8811P58438m4403j326523
$$ plain form
2259.5 731458206 730950699 731059341 731055756 731295471 731455917 731520157 731978531 731932526 731627426 730908585
2269.2 730908585 731318970 731462708 731051407 731181717 730928650 731061325 731090775 731212845 731166153 731144714
2278.8 731144714 730954514 730578308 730922470 730805511 730644531 730409470 730679321 731134033 731028595 731032257
2288.5 731032257 730895920 730950546 730376740 730146255 730159988 729693909 729549561 729515610 730081635 730442200
2298.1 730442200 730271912 729819031 730038147 730486298 730140610 729734573 729175491 729263916 729126740 729028397
2307.8 729028397 729325333 729722519 730239639 729649353 729560242 729665909 729520493 729270859 729072418 728867493
2317.4 728867493 728206558 728722305 728586349 728182907 728156815 728360443 728702164 728273239 728888397 728928223
2327.1 728928223 728759308 728781433 728947906 729240494 728555222 728337097 728258286 729016724 728972321 727645798
2336.7G27645798k76108Q83713O30188l96042o05011j284332j13678L30658O10656
2345.4G27425842P89032o96335n12161J23139K1972p19070K03399j90048q52279J003341
2355G26596832O59333M7073j005249N43823L27377n01709m83322j402359J85471q44498
2364.7G24122772O50482M73710m32435K65046m61808j48849p10983K37808M4098l75061
2374.3G23664780m83551k09046O31714p10220o57044l7307J10015l21197n43823m3564
2383.9G21400757k04392J70899l6774k13394k63443j39084M33807J18943k59018n35126
2393.6G20473175j98898k90604k03705O4545j80283j56250m88739p3394p8736j59988
2403.2G18707123j26114k60010k3346l74222O562q011l69187m31671l22723j98364
$$ plain form
2336.7 727645798 727369690 728253403 728883591 728487549 727882538 726598206 726484528 726815186 727425842
2345.4 727425842 728214874 727518539 727006378 727129517 727151489 726432419 726635818 726445770 725593491 726596832
2355 726596832 727256165 727303238 726297989 726841812 727169189 726667480 726184158 724781799 724967270 724122772
2364.7 724122772 724773254 725246964 724814529 725079575 724617767 724468918 723757935 723995743 724039841 723664780
2374.3 723664780 723181229 722972183 723603897 722893677 722236633 722199326 722309341 721988144 721444321 721400757
2383.9 721400757 721196365 721367264 721330490 721117096 720853653 720714569 721148376 721267319 721008301 720473175
2393.6 720473175 720274277 719983673 719779968 719844513 719664230 719507980 719019241 718945847 718867111 718707123
2403.2 718707123 718581009 718320999 718297653 717923431 717929993 717921982 717552795 717121124 716798401 716600037
2412.9G16600037l00751J0681k25296j8234k56577l76358K56043M0588n10330q38471
2422.5G14381332j60980k54059k45361p1487j33362J93939l43399j71890l46909j12533
2432.2G12735291Q2397o75354n03311k58560K67257j74942n19180l9520M1961l72924
2441.8G10583115n16510J46637l80784n53436m37317j72882J71280m0665L44162l02200
2451.5G08841400n16052o04706q77762k25601j56326j38245J83945J67694l92685l7384
2461.1G06244278l5629n95475o83136q16497j70975p5607l4714r3994r1858m1657o58035
2471.7G02946701k87781j46866k50549o97174p91702L1128L9978k41623l14026r0866
2481.3G00197220j82800k87629o67419p59659k41852o2637l2959m82254k21634n70755
$$ plain form
2412.9 716600037 716299286 716309967 716084671 716066437 715809860 715433502 715689545 715730133 715219803 714381332
2422.5 714381332 714220352 713966293 713720932 713649445 713516083 713710022 713366623 713194733 712847824 712735291
2432.2 712735291 712817688 712142334 711639023 711380463 711647720 711472778 710953598 710914078 710956039 710583115
2441.8 710583115 710066605 710213242 709832458 709279022 708841705 708668823 708840103 708799438 709143600 708841400
2451.5 708841400 708325348 707720642 706842880 706617279 706460953 706322708 706506653 706674347 706281662 706244278
2461.1 706244278 706208649 705613174 704930038 704113541 703942566 703866959 703832245 703738251 703646393 703604736 702946701
2471.7 702946701 702658920 702512054 702261505 701564331 700772629 700803757 700843735 700602112 700288086 700197220
2481.3 700197220 700014420 699726791 699059372 698299713 698057861 697995224 697962265 697480011 697258377 696687622
2491F96687622o01501J76773k73590k41623l63007n38788o16836l27454K8839j55639
2500.6F93774796k13776o09818p8277j86844m31519o4010l19977n56793j002732n55267
2510.3F89755783l45077j42594J46713q4762Q468k71987k39487k42386k07596p27005
2519.9F87650070p51724O3095j97067q9722k23007l54996l19977l28064j12381n18035
2529.6F84818192o53687l46298O1493j35117l9444J8616n50003o33011o16226l05176
2539.2F81619339j48544L1967k37732m55704j54724k66952R8190Q7585m33349q08564
2548.9F79331512n72052n23300o85196n4245K28730J07727n16434k98233J9531m85687
2558.5F76552353p03278o70318r1095m18854l55911j37558k97470J62658l81698o10428
$$ plain form
2491 696687622 696086121 696262894 695989304 695747681 695384674 694845886 694229050 693901596 693930435 693774796
2500.6 693774796 693561020 692951202 692872925 692686081 692254562 692190552 691870575 691313782 690311050 689755783
2510.3 689755783 689410706 689268112 689414825 689330063 689338531 689066544 688827057 688584671 688377075 687650070
2519.9 687650070 686898346 686961441 686764374 686674652 686451645 686096649 685776672 685448608 685336227 684818192
2529.6 684818192 684164505 683818207 683879700 683744583 683705139 683723755 683173752 682540741 681924515 681619339
2539.2 681619339 681470795 681502762 681265030 680809326 680654602 680387650 680485840 680573425 680140076 679331512
2548.9 679331512 678759460 678236160 677550964 677496719 677725449 677833176 677316742 677018509 677038040 676552353
2558.5 676552353 675849075 675178757 675087662 674668808 674312897 674175339 673877869 674040527 673658829 673048401
2568.1F73048401k50092j65939m86450n84946l16620j47171k36358n15366K34146k1744
2577.8F70557861l84292j91040n01404k50855n35888n05142l99552l40958k13851j01243
2587.4F67133636J59760k48184j29471k17285j12229m93087j284333p00225l50419
2596.1F63758163r7732J69830K74353j16653k75498l29437l16086L6087j066055r89456
2605.7F61047516l16620l06931N4551r1172l08914m81720J50452j6632o98853q75625
2615.4F58156052r49707k63825l55759k96402m959q3770O9427j59531o99539p95746
2625F54616241l65982m67071m83170n82199m08630m2877j92032Q6441j91574o30265
2634.7F51338882o43920m11072n47943o08445k78396p42417k49633J95236j64108k17820
$$ plain form
2568.1 673048401 672798309 672632370 672145920 671560974 671244354 671097183 670860825 670345459 670579605 670557861
2577.8 670557861 670173569 669982529 669481125 669230270 668694382 668189240 667789688 667448730 667234879 667133636
2587.4 667133636 667293396 667045212 666915741 666698456 666586227 666093140 664808807 664108582 663758163
2596.1 663758163 663660431 663830261 664104614 663987961 663712463 663383026 663066940 663103027 662036972 661047516
2605.7 661047516 660730896 660423965 660478516 660387344 660078430 659596710 659747162 659730530 659031677 658156052
2615.4 658156052 657206345 656942520 656586761 656290359 656285400 656201630 656271057 656111526 655411987 654616241
2625 654616241 654250259 653783188 653300018 652717819 652309189 652266312 652074280 652160721 651969147 651338882
2634.7 651338882 650694962 650283890 649735947 649127502 648849106 648106689 647857056 648052292 647888184 647670364
2644.3F47670364m23889k77557l16086p92923o99463k96631o65207l94287k3117l79715
2654F43401489j77688l19062l14560k13394j53808k63138q33054r22775m17519J49765
2663.6F39936256k66418j99928o104l5400M4327o92482p34253n68123j79825j33209
2673.3F37164841k07596K23694k85073k71988J5145j63155p68356q46367l62816k75497
2682.9F34222832k1935m67605m29650k64396m09012J80244K39754m43497r48753l69530
2692.5F31288452J9303k46087p00798o48155j35841m29840j96266L19557K29912m30375
2702.2F29069862n77507k85492o15654k42195m2000q8539L357l18260m43916l04146
2711.8F26155510l00064m12865j94588m18128m78478k50092j53999k66685l47062M50402
$$ plain form
2644.3 647670364 647246475 646968918 646652832 645859909 645160446 644863815 644198608 643804321 643781204 643401489
2654 643401489 643223801 642904739 642590179 642376785 642222977 641959839 641126785 640204010 639786491 639936256
2663.6 639936256 639669838 639469910 639463806 639428406 639472733 638780251 638045998 637477875 637298050 637164841
2673.3 637164841 636957245 637180939 636895866 636623878 636639023 636475868 635707512 634861145 634498329 634222832
2682.9 634222832 634200897 633733292 633303642 633039246 632630234 632810478 633050232 632606735 631657982 631288452
2692.5 631288452 631307755 631061668 630360870 629712715 629576874 629147034 628950768 629270325 629500237 629069862
2702.2 629069862 628492355 628206863 627591209 627349014 627307014 627218475 627221832 626903572 626459656 626155510
2711.8 626155510 625855446 625442581 625247993 624829865 624351387 624101295 623947296 623680611 623333549 623783951
2721.5F23783951n6610o25763K3842j12000n33829m21486k25753m46472L2081J59912
2731.1F21577873m98008n43900r2926J20239l81622j35307k20490n83992j46866n3520
2740.8F19041481Q0452o2714k48108k73742M9667L38249k94952q15544o57387n2566
2750.4F17104836J16996k2964k83966m10118Q964m9248m06570j08452J17111m17366
2760F15649223m62722k81067p6332l3493k90642L8299l76548n31579k7084j30577m93698
2770.7F12983780n78957k28233l13568k39945l37333l15781n7335l39050m99840m27704
2780.3F09646034J7166l68156m76837l78189n23606L7117l19366j76621N341l07388
2789.9F07155495m26026r57184q97216l42179P1640m33578m19808l90052p23954j48506
$$ plain form
2721.5 623783951 623727341 623101578 623125420 623013420 622479591 622058105 621832352 621385880 621417961 621577873
2731.1 621577873 621079865 620535965 620443039 620563278 620181656 620046349 619825859 619241867 619095001 619041481
2740.8 619041481 619121933 619059219 618811111 618537369 618587036 618925285 618630333 617814789 617157402 617104836
2750.4 617104836 617221832 617198868 616914902 616504784 616513748 616464500 616057930 615949478 616066589 615649223
2760 615649223 615186501 614905434 614829102 614795609 614504967 614543266 614166718 613635139 613608055 613477478 612983780
2770.7 612983780 612404823 612176590 611863022 611623077 611285744 610969963 610912628 610573578 610073738 609646034
2780.3 609646034 609663200 609295044 608818207 608440018 607916412 607953529 607634163 607457542 607462883 607155495
2789.9 607155495 606729469 605772285 604875069 604532890 604604530 604170952 603751144 603361092 602637138 602488632
2799.6F02488632l19633m84505m72641n38444p02858p98150m65965m83055k27280m22172
2809.2E97573929n54314n48172r25903p47299o60553q20046p80716l69491k07596l31116
2818.9E91628723o41746n33181l96003r99527q78868q18024p42340n96695n93758l98903
2828.5E85029678o99272p67631q51021o50826o72378q65364p23152q30613r00879j523666
2838.2E76544876j310501r02557j128846j331558j721496j584130j812210j777153
2845.9E64976425j662063j708794j496773j735954j691704j411171m71039j69372q76122
2854.6E53753433r26590m19273Q9264k13394k04506p4997k22702K99263L69339l63045
2864.2E52086792o77490q01850j128425q20389p34253r07326o35833j50032j22109
$$ plain form
2799.6 602488632 602168999 601684494 601211853 600673409 599970551 599172401 598706436 598223381 597996101 597573929
2809.2 597573929 597019615 596471443 595545540 594798241 594137688 593317642 592536926 592167435 591959839 591628723
2818.9 591628723 590986977 590453796 590057793 589058266 588179398 587361374 586619034 586022339 585428581 585029678
2828.5 585029678 584330406 583562775 582711754 582060928 581388550 580523186 579800034 578969421 578068542 576544876
2838.2 576544876 575234375 574331818 573202972 571871414 570149918 568565788 566753578 564976425
2845.9 564976425 563314362 561605568 560108795 558372841 556681137 555269966 554798927 554629555 553753433
2854.6 553753433 552826843 552407570 552496834 552283440 552078934 552003937 551781235 552080498 552449837 552086792
2864.2 552086792 551409302 550607452 549479027 548658638 547924385 547017059 546381226 546231194 546109085
2872.9E46109085o78673m14390n8403k45400j014595j122207l84446p11135o25954
2881.6E40853882n63164o83403k59743n92880j004677r22508p70378j092987j123009
2890.2E33841133n97649o72111j108208q46901l26881m42352n21965n91355q24203
2898.9E27909508j079674p20863n89829r35402k88391m31709o86608p03468j145935
2907.6E21327629q11348p08961o56739p75070r59511j029625j379013j584625j361046
2916.3E12061691p38144r86251j405259j701011j396561l68919k43264l91960n83000
2925E04247322l18375j6975L35197P03278J60217k88963m43191n8899K14843P23725
2934.6E05258179J091385M73709L63197M98695Q22182Q55942O77299N15633K73628
$$ plain form
2872.9 546109085 545430412 545016022 544957619 544712219 543697624 542575417 542190971 541479836 540853882
2881.6 540853882 540290718 539607315 539347572 538754692 537750015 536827507 536057129 534964142 533841133
2890.2 533841133 533243484 532571373 531463165 530616264 530289383 529847031 529325066 528733711 527909508
2898.9 527909508 526829834 526108971 525519142 524583740 524295349 523863640 523177032 522473564 521327629
2907.6 521327629 520516281 519807320 519150581 518375511 517416000 516386375 515007362 513422737 512061691
2916.3 512061691 511323547 510337296 508932037 507231026 505834465 505465546 505222282 504830322 504247322
2925 504247322 503928947 503911972 504247169 504950447 505110664 504821701 504378510 504319611 504534454 505258179
2934.6 505258179 506349564 506823273 507186470 507685165 508507347 509363289 510040588 510556221 510829849
2943.3E10829849M28086L69682M34799M15421N78155O38123M64592P56454N56526K16484
2952.9E15688171J60408L78113K37274R0714M69398L35656J17378Q3504L74336P39021
2962.6E18673973M76494P9918N71556Q69865M77715O22139L37295M67492Q58993N91774
2972.2E24027214J026726J126480K14310k46659N00717R00460L40423j29623L41720
2980.9E28101768Q32177j2818M3793N83954N7907k10953P3776K72828Q1977J15777
2990.5E29940186K84957M40178J59760l59459k69775R613j12000o63490n77278l98407
3000.2E28454285l43705k03933j34774K11754l76663r83276j016999n52291K09655
3008.8E25264053j72348m96826n55038n20821k22511o00739o51054r4376k51693o18744
$$ plain form
2943.3 510829849 511257935 511627617 512062416 512477837 513055992 513694115 514158707 514915161 515471687 515688171
2952.9 515688171 515848579 516226692 516463966 516554680 517024078 517359734 517477112 517560616 517934952 518673973
2962.6 518673973 519150467 519230385 519801941 520671806 521149521 521771660 522108955 522576447 523435440 524027214
2972.2 524027214 525053940 526180420 526394730 526148071 526648788 527549248 527889671 527760048 528101768
2980.9 528101768 528933945 528921127 528964920 529548874 529606781 529395828 529469604 529742432 529824409 529940186
2990.5 529940186 530225143 530665321 530825081 530465622 530195847 530205460 530093460 529429970 528852692 528454285
3000.2 528454285 528110580 527906647 527771873 527983627 527606964 526623688 525606689 525054398 525264053
3008.8 525264053 525091705 524594879 524039841 523519020 523296509 522695770 522044716 521950340 521698647 521079903
3018.5E21079903p47300j152496r80530l05252K08855k0218j066894j193924n56412
3027.2E15265732l43857l35464l90778r27315j100616m29497n11551o80389k49520
3035.9E10296745l87344n72701n87120r94262q17299n37911p14607p78236r08814m46319
3045.5E03552132m11301o34232m97665r62906q55675p35778o61393n32188q42857q17147
3055.1D96600990q09135n61524l02848l44048p84035j040458n64652l57551o39191
3063.8D91197548q17680l9864j82610j224861j103134q05054l11775K4376n51796j177902
3073.5D85007248q28171k68326m25071n67665m99650m87709o81343q44001q16956j57394
3083.1D79430962j56556p32574n47752q84209m49867j29700p43599o06995n09567m52423
$$ plain form
3018.5 521079903 520332603 519180107 518199577 517894325 518103180 518082962 517016068 515822144 515265732
3027.2 515265732 514921875 514586411 514195633 513268318 512167702 511738205 511226654 510546265 510296745
3035.9 510296745 509909401 509336700 508749580 507755318 506938019 506400108 505685501 504907265 503998451 503552132
3045.5 503552132 503140831 502506599 502008934 501046028 500190353 499454575 498793182 498260994 497418137 496600990
3055.1 496600990 495791855 495230331 494927483 494583435 493799400 492758942 492194290 491836739 491197548
3063.8 491197548 490379868 490340004 490157394 488932533 487829399 487024345 486712570 486736946 486185150 485007248
3073.5 485007248 484179077 483910751 483485680 482918015 482418365 481930656 481249313 480405312 479588356 479430962
3083.1 479430962 479274406 478541832 477994080 477109871 476660004 476530304 475786705 475179710 474670143 474217720
3092.7D74217720p58934q71315j044960q56056J6670m04015p39135n99213m01268m77829
3102.4D68081665r19991r82933o00814J05133j83106m67224o03256j447601j407776
3111.1D61574097m12369l0785l54881l77655p04918p98073p23495q17719n97458p44438
3120.7D56012306n02815m59633p57751p02019o97403p07321p94678r31206q61740j63765
3130.4D49433975l27759j013641j151504q77343l06625n45807m55780l20816n91507
3139D43843193p09228o93856m67529j023064j064682p12890p95021p71485l81164j46065
3148.7D37078209o32744l52173l91769j064682j386566j264496q93250o96754j73035
3157.4D30222740o38580r02023p38297p88155l41987p61719p93762p60994q99353n81131
$$ plain form
3092.7 474217720 473458786 472587471 471542511 470686455 470703125 470299110 469559975 468960762 468559494 468081665
3102.4 468081665 467161674 466178741 465577927 465683060 465499954 465032730 464429474 462981873 461574097
3111.1 461574097 461161728 461130943 460776062 460398407 459693489 458895416 458171921 457354202 456756744 456012306
3120.7 456012306 455509491 455049858 454292107 453590088 452892685 452185364 451390686 450459480 449597740 449433975
3130.4 449433975 449106216 448092575 446941071 446063728 445757103 445211296 444755516 444434700 443843193
3139 443843193 443133965 442440109 441972580 440949516 439884834 439171944 438376923 437605438 437224274 437078209
3148.7 437078209 436445465 436093292 435701523 434636841 433250275 431985779 431092529 430395775 430222740
3157.4 430222740 429584160 428682137 427943840 427155685 426813698 426051979 425258217 424497223 423597870 423016739
3167D23016739o08597k64931l91998j030083j048011q81081j014099n52750j61819
3175.7D17063370p08123j079177j129837o15731k33612l52554o86379o60896o41517
3184.4D10955544j137543o84204p69539q57849p7057l31764p65343r51729j009102
3193D04371414q08525q12874q48541l17497m98925r76142n10788o50330n67055m63791
3202.7C97916946n71060n03120n49507l16277p75490q16726n93338n49241l51219n33065
3212.3C92357903n79033r80301r21631p13234o47278m38499p69005o89964n58701o57043
3222C85403214n68467n97305n51262l2043l55606j014977o36940m65012k39982n91354
3231.6C80350266p42684n56793q48656l72925m07257m39987n49545n32570j60484p77817
$$ plain form
3167 423016739 422408142 422143211 421751213 420721130 419673119 418792038 417777939 417225189 417063370
3175.7 417063370 416355247 415276070 414146233 413530502 413296890 412944336 412257957 411597061 410955544
3184.4 410955544 409818001 409133797 408364258 407506409 407429352 407097588 406332245 405380516 404371414
3193 404371414 403562889 402750015 401901474 401583977 401085052 400108910 399598122 398947792 398380737 397916946
3202.7 397916946 397345886 396842766 396293259 395976982 395201492 394384766 393791428 393242187 392890968 392357903
3212.3 392357903 391778870 390798569 389876938 389163704 388516426 388077927 387308922 386618958 386060257 385403214
3222 385403214 384834747 384237442 383686180 383654137 383298531 382283554 381646614 381181602 380941620 380350266
3231.6 380350266 379607582 379050789 378202133 377829208 377421951 376981964 376432419 375899849 375739365 374961548
3241.3C74961548q44269n14526j48888l16429q68569q71429m03061Q3389m75502n48668
3250.9C70053596p11059p01714l01399o33736j24092k41279r35974p13349k07176m66957
3260.5C65016861o94733J09635q4496n97343q90808q60062j92833m00009k65846R4680
3270.2C61235046m37812l23601j5755l17345l02200o88972p59926m00925o69823m18319
3279.8C56900368l72277k14729J5068j91459k94114p69996n70984l55225l65944k99797
3289.5C53480911m64248j51406j92260l14713k70576p27044q91533j80625k53907q40263
3299.1C49194336k72331O9389m4746o3248j15433o35986p98226m50820n87044l39585
3308.8C45956306n47866n34783j92146k26517k09617q92754o84776m17710n09643l10173
$$ plain form
3241.3 374961548 374117279 373602753 373453865 373137436 372268867 371397438 370994377 371077766 370602264 370053596
3250.9 370053596 369342537 368640823 368339424 367705688 367581596 367340317 366404343 365690994 365483818 365016861
3260.5 365016861 364322128 364431763 364347267 363749924 362859116 361999054 361806221 361406212 361140366 361235046
3270.2 361235046 360797234 360473633 360457878 360140533 359838333 359149361 358389435 357988510 357318687 356900368
3279.8 356900368 356528091 356313362 356328430 356136971 355842857 355072861 354501877 354146652 353780708 353480911
3289.5 353480911 353016663 352865257 352672997 352358284 352087708 351360664 350469131 350288506 350034599 349194336
3299.1 349194336 348922005 348991394 348946648 348883400 348767967 348131981 347333755 346882935 346295891 345956306
3308.8 345956306 345408440 344873657 344681511 344454994 344245377 343352623 342667847 342250137 341740494 341430321
3318.4C41430321q48465r95522o21338k65197j42060j63803m31938n10407m89883q52661
3328.1C36109047q30879r68247m68101l52478r82094n64690m15230k95524j39694n24826
3337.7C30567284j000519j174660o85348m84391p01179m50669m56848j169891q01239
3346.4C23642540k57454l99933l08342m45175m13094n20858o10504o04630l96786m4899
3356C19640865l50952k23007k64320o80371n86757k91233j98365k45819l89557o08864
3365.7C15801620k34870l16563m05789q7718k59037m82331o43139m55303m17576l63960
3375.3C12135334n26352n62630L1662P7820R8992l10803o03809o1188K59800l04108
3384.9C10234718o55689K04620O9828l94401m58469l57781K82402q4762n91431m20380
$$ plain form
3318.4 341430321 340581856 339586334 338964996 338699799 338557739 338393936 337961998 337451591 336961708 336109047
3328.1 336109047 335278168 334309921 333841820 333489342 332507248 331942558 331527328 331231804 331092110 330567284
3337.7 330567284 329566765 328392105 327706757 327222366 326521187 326070518 325613670 324443779 323642540
3346.4 323642540 323385086 322985153 322676811 322231636 321818542 321297684 320687180 320082550 319685764 319640865
3356 319640865 319289913 319066906 318802586 318122215 317535458 317244225 317045860 316800041 316410484 315801620
3365.7 315801620 315566750 315250187 314844398 314756680 314497643 314015312 313372173 312916870 312499294 312135334
3375.3 312135334 311608982 311046352 311078014 311155834 311254826 310944023 310340214 310279026 310538826 310234718
3384.9 310234718 309579029 309783649 309853477 309459076 309000607 308642826 308925228 308840466 308249035 307828655
3394.6C07828655l42521l35236j49555l758j96209k65998l0575L24173Q9607k01683
3404.2C06716900k32887j69735P5493K77290J50757n70832p18879k20070J01051k17838
3413.9C05191250j21784L09181M0874K34738l9330R6874P09858M04740o2752n59711
3423.5C06203938J66873M18416K49481K37484j14003K34604Q9684N9719j13716j27411
3433.2C07305069L54614K78359N08594N35889M80862M02679N01728P32365L1948o41136
3442.8C10490971K94723O99272K79179P07741k01264L97778J193180k71855L61691
3451.5C13951416Q63934J84345L51181O11725M65030O20690J092548N23281N86834
3460.2C19250984N57461K1038K61612O05507Q25462N40734N62210O14776P23076O56357
$$ plain form
3394.6 307828655 307486134 307150898 307001343 306997585 306801376 306535378 306504803 306828976 306918583 306716900
3404.2 306716900 306484013 306314278 306389771 306667061 306817818 306246986 305528107 305308037 305409088 305191250
3413.9 305191250 305069466 305378647 305419521 305654259 305614929 305711803 306421661 306826401 306763649 306203938
3423.5 306203938 306370811 306789227 307038708 307276192 307162189 307396793 307486477 307546196 307432480 307305069
3433.2 307305069 307659683 307938042 308446636 308982525 309463387 309866066 310367794 311100159 311132107 310490971
3442.8 310490971 310785694 311484966 311764145 312471886 312270622 312668400 313861580 313589725 313951416
3451.5 313951416 314815350 314999695 315350876 315962601 316427631 317048321 318140869 318664150 319250984
3460.2 319250984 319808445 319829483 320091095 320696602 321522064 322062798 322625008 323239784 323962860 324619217
3469.8C24619217O02798R91135M81720K88200M98886P52678J148110R25293L39393
3478.5C30647430M14086Q93211R22890P80373L03955R50584P61452J36947J467133
3487.2C37278061J002884k40669K79083J023941R73129Q36945R90791Q84666J333313
3495.8C44362144J004029M07104L36724Q85391J265220Q11081P77321o6299N50003
3504.5C50332718J281662P06444R62181J365280R11217N0583J219024J150818P39479
3513.2C58719406J490364R93500J103172Q48313O54945J455002J232185L81508P83157
3521.9C67661552J337967K72637O01158R99527J029281J278992P45239P60956J035576
3530.6C75722885R28192R33495J552391J445198J373863J022492P43980J683083J296157
$$ plain form
3469.8 324619217 325222015 326213150 326694870 326983070 327481956 328234634 329382744 330308037 330647430
3478.5 330647430 331061516 331954727 332877617 333657990 333961945 334912529 335673981 335810928 337278061
3487.2 337278061 338280945 338040276 338319359 339343300 340316429 341153374 342144165 343028831 344362144
3495.8 344362144 345366173 345773277 346110001 346995392 348260612 349071693 349849014 349782715 350332718
3504.5 350332718 351614380 352320824 353283005 354648285 355559502 355610085 356829109 357979927 358719406
3513.2 358719406 360209770 361203270 362306442 363154755 363809700 365264702 366496887 366878395 367661552
3521.9 367661552 368999519 369272156 369873314 370872841 371902122 373181114 373926353 374687309 375722885
3530.6 375722885 376651077 377584572 379136963 380582161 381956024 382978516 383722496 385405579 386701736
3539.2C86701736Q32787N80864J356811J694794Q62236L92685L47405K385902J332092
3547.9C96487312R83353J901550J926346K203446L09906J093521N83915P95098K428245
3556.6D08712692J293564J707153J427994Q17604R02672K347603K081299J317215L959388
3565.3D24567184J83297q38852J522751Q46214L625908J711044R22661K021179J842041
3574D36403427J313362J709671K059098J023407K094917J850281J933517K491264J747132
3582.6D52626076J101951R57032L555793J927681m40941J147957l1814L335228L204765
3591.3D67383728K781982J819916R69620L259926K71530J962585L657685J289673K161254
3600D85557899J065331J485176K811356K233963K495689L393974K622376o52504L063431
$$ plain form
3539.2 386701736 387534523 388115387 389472198 391166992 392029228 392421913 392769318 395155220 396487312
3547.9 396487312 397470665 399372215 401298561 403502007 403811913 404905434 405489349 406284447 408712692
3556.6 408712692 410006256 411713409 413141403 413959007 414861679 417209282 419290581 420607796 424567184
3565.3 424567184 424750481 423911629 425434380 426280594 429906502 431617546 432540207 434561386 436403427
3574 436403427 437716789 439426460 441485558 442508965 444603882 446454163 448387680 450878944 452626076
3582.6 452626076 453728027 454685059 458240852 460168533 459727592 460875549 460843735 464178963 467383728
3591.3 467383728 470165710 471985626 472955246 476215172 476486702 478449287 482106972 483396645 485557899
3600 485557899 486623230 488108406 490919762 493153725 495649414 499043388 501665764 501013260 504076691
3608.7E04076691J99623O5536O977921J704216r46388M126586Q12989M007644L605195
3617.4E24630013Q08944K773628k3345J063613L235817L450013L142166K708549K417984
3626E44207382L220062O321297o01272q808747N681305N598107M835205J835746n28411
3634.7E61760674K793846L943786L172188R76296J806564L279381K721214J277542
3642.4E81731491J481705L417816L651924N461159J241989l231506L582267j60141
3650.1E97176704k58598J215363N063400M226723L405380M176903n720482L109207
3657.9F12394600N368805J129532J452865Q58994K757835J895714K033920K226334
3665.6F30118599J090393M163017J867485J48316N26199n972099K825737P624016Q024444
$$ plain form
3608.7 504076691 504276314 504341850 511319771 513023987 512077599 516204185 517017174 521024818 524630013
3617.4 524630013 525438957 528212585 528189240 529252853 532488670 535938683 539080849 541789398 544207382
3626 544207382 547427444 553748741 553147469 544338722 550020027 555618134 560453339 562289085 561760674
3634.7 561760674 564554520 568498306 571670494 572646790 574453354 577732735 580453949 581731491
3642.4 581731491 583213196 586631012 590282936 595744095 596986084 593754578 597336845 597176704
3650.1 597176704 596918106 598133469 603196869 607423592 610828972 615005875 609285393 612394600
3657.9 612394600 617763405 618892937 620345802 621204796 623962631 625858345 627892265 630118599
3665.6 630118599 631208992 635372009 637239494 637387810 637914009 631941910 634767647 642391663 650416107
3674.3F50416107k597885j5451851M507256Q403244N272827k415390K40631K945175
3682F51320114J923523R05686j20240J126480M562912O158524q330307k912216P318954
3690.6F61953430m777069M36325M230423P75070K233963J60523p30972J870498J024857
3699.3F67177048J924896K896805l898163k304764L394623R86938M63334P28149K651825
3708F74020691L707657o727753L241654L403701j3200836M444580M984436J143036
3715.7F75017166J192932J760559O79322k335892J273575M715881k787475l605500
3723.4F75910568M430008L4714j725235j821213P36771L494262J306458N859985j613617
3732.1F86612701p728500P385101R6741q744659o58799J641160J056289L289414M085998
$$ plain form
3674.3 650416107 647818222 632366371 636873627 645276871 650549698 648134308 648374939 651320114
3682 651320114 653243637 654149323 654029083 655155563 659718475 665876999 657546692 654634476 661953430
3690.6 661953430 657176361 657612686 661843109 662618179 664852142 665012665 664281693 666152191 667177048
3699.3 667177048 669101944 671998749 668100586 665795822 669190445 670177383 670640717 671368866 674020691
3708 674020691 677728348 671000595 674242249 677645950 664445114 668889694 673874130 675017166
3715.7 675017166 676210098 677970657 678649979 676314087 677587662 682303543 679516068 675910568
3723.4 675910568 680340576 680375290 678650055 676828842 677565613 681059875 682366333 688226318 686612701
3732.1 686612701 678884201 686269302 686366043 677621384 676962585 678603745 679660034 682949448 687035446
3740.8F87035446l550110K631455J1284408j2748413j5137863J1135330N682221M740066
3748.5F91072540n191879j0027008R639358n579452l214035O955795M736405K572021
3756.2F90963745n661240J968308L685684q119583L43857M747467J597824M53873L368988
3764.9F93348923k953644m934235L909226M807052r54208q692398K128982L126145
3772.6F89785843Q1711O03485K8839J517944O13938J815414m34723o137924K218246
3781.3F90092773J229783K74200J951523j816559p53326J237487R88388P7973p89108
3790F92493134K3574p2174K57340L60183J609421K592926l890381l451156K703171
3798.7F92626038M373245N406341q115997r929428N028992K630767L553162L851242
$$ plain form
3740.8 687035446 683485336 686116791 697401199 684652786 669514923 680650253 686332474 691072540
3748.5 691072540 685880661 675853653 685493011 679913559 676699524 683655319 688391724 690963745
3756.2 690963745 685302505 687270813 690956497 682836914 683180771 687928238 689526062 689979935 693348923
3764.9 693348923 690395279 685461044 689370270 694177322 693223114 684530716 686659698 689785843
3772.6 689785843 689867554 690471039 690499878 692017822 692631760 694447174 694012451 687874527 690092773
3781.3 690092773 691322556 691596756 693548279 691731720 690978394 692215881 693204269 693282242 692493134
3790 692493134 692516708 692444534 692701874 693062057 694671478 697264404 693374023 689922867 692626038
3798.7 692626038 696999283 702405624 694289627 684360199 689389191 692019958 695573120 699424362
3806.4F99424362r305191k338409M874267J889572L06778K42539L47519J232376M323654
3815.1G00997467k724915j3002700N414505N640793M307708J730652j5377121K272720
3822.8F89259109M349747J511536K142181k99530l318558M59977J884460K173538N06363
3831.4F98668823p378311K784119P072448n168762q84018O191712r487458l778686
3839.2F88019867Q053131m078369q17108O314926j539230k369004K676468P14111K16294
3847.8F97191086J541672p92237J733780L730621r598693k229767q684769L823319
3855.6F86715012R803924q19778j658554K075653K297287K194824n593109q6746M720764
3864.2F99649277n746231k598954L988495M089279L979874q076782p734299M083023
$$ plain form
3806.4 699424362 690119171 687780762 692655029 694544601 694851379 695093918 695441437 696673813 700997467
3815.1 700997467 698272552 685269852 690684357 696325150 700632858 702363510 686986389 689259109
3822.8 689259109 693608856 695120392 697262573 696963043 693644485 694104462 695988922 698162460 698668823
3831.4 698668823 691290512 694074631 701147079 695978317 695094299 701286011 691798553 688019867
3839.2 688019867 696072998 691994629 691177521 697492447 695953217 693584213 696260681 696974792 697191086
3847.8 697191086 698732758 697940521 699674301 703404922 693806229 691576462 682891693 686715012
3855.6 686715012 696518936 695699158 694040604 696116257 698413544 700608368 695015259 694928513 699649277
3864.2 699649277 693903046 691304092 695292587 699381866 703361740 695284958 687550659 691633682
3871.9F91633682N672684K194290p978515J417541L818512L76129J511307K045746
3879.7G00691376o945572m557266O450653J214294J404801M336624j1585312J179733
3887.4F92189331M514465R60617L008500j424637p550736J110001L212585k87857J481247
3896.1F97213516N47333J408005J371841q532333M051513J590653m384689L683776
3903.8F96949615l311538o25687J74713O11K115783K17057L92532k53754j19095L10898
3913.4F95851135r1552J344375J681519l652420l213425L806000O2790k642670K309799
3922.1F95455551J421814O96793j656037k399826R98688J437149J242676j186218l12348
3930.8F95698242J571655k624588j077117J473388k02560J23443P48139k12479l04260
$$ plain form
3871.9 691633682 697306366 699500656 691522141 692939682 696758194 697134323 698645630 700691376
3879.7 700691376 693745804 689188538 695639191 696853485 698258286 702594910 691009598 692189331
3887.4 692189331 696703796 697664413 700672913 699248276 691697540 692807541 696020126 695732269 697213516
3896.1 697213516 697760849 699168854 700540695 692008362 696059875 697650528 693265839 696949615
3903.8 696949615 693638077 693012390 693187103 693187714 695303497 695520554 695913086 695659332 695540237 695851135
3913.4 695851135 695759583 697103958 698785477 695133057 691919632 695725632 695788422 693145752 695455551
3922.1 695455551 696877365 697574158 695918121 693518295 694516983 695954132 697196808 696010590 695698242
3930.8 695698242 697269897 694645309 693568192 695041580 694839020 694962463 695710602 695498123 695193863
3939.5F95193863j31683J101913R24606l698806l44315K128525R29947P72781k378006
3948.1F94498825n569j92490k252579J523438L33633N4016O69709N54351O17295n20554
3957.8F95280075Q3618r80987j6098O74896o63376K69775k64129l64151j68076K25754
3967.4F94077301P12357o61698k76565J044693l38745p72629J039276M16336p58972
3976.1F94481354o18286K41241O01044r766K21100m58755r78547K59018Q53501L02276
3985.7F94894180P0038k78244l64990L93448O9656J58539q5220m14277K69166q5984
3995.4F94626312l26767j72424M75998N95398k46658
4000.2F94951859
$$ plain form
3939.5 695193863 695062180 696164093 697088699 693389893 693045578 695174103 696104050 696876831 694498825
3948.1 694498825 694493256 694300766 692048187 693571625 693905258 693959274 694628983 695183334 695800629 695280075
3957.8 695280075 695363693 694382706 694366608 695041504 694378128 694647903 694383774 694019623 693851547 694077301
3967.4 694077301 694789658 694127960 693851395 694896088 694557343 693784714 694823990 695240326 694481354
3976.1 694481354 693863068 694104309 694705353 694695587 694916687 694457932 693479385 693738403 694591904 694894180
3985.7 694894180 694964218 694685974 694320984 694714432 694784088 694942627 694857407 694443130 694712296 694626312
3995.4 694626312 694299545 694127121 694603119 695198517 694951859
4000.2 694951859
##END=$$ End of the data block
