##TITLE=$$ Begin of the data block
##JCAMP-DX=5.00 $$ ACD/SpecManager v 10.08
##SPECTROMETER/DATA SYSTEM=Varian
##DATE=08 Jan 2013 16:09:58
##DATA TYPE=INFRARED SPECTRUM
##DATA CLASS=XYDATA
##ORIGIN=
##OWNER=
##NPOINTS=3735
##FIRSTX=399.26403809
##LASTX=4000.35498047
##MAXX=4000.35498047
##MINX=399.26403809
##MAXY=74.76398468
##MINY=30.53518486
##XFACTOR=1.0000000000
##YFACTOR=0.000000100000000
##FIRSTY=49.08654022
##DELTAX=0.96440572
##XUNITS=1/CM
##YUNITS=TRANSMITTANCE
##XYDATA=(X++(Y..Y))
399.3D90865402j488914O252060O926841K47879K602654J645470P008247j367416j1830368
407.9E00861855K263603K237701R89914K545281o43921n355759n698776M919662K630196
416.6E04749756o865845j3367462J3677750J2895050l8262J436157l815193k554817
424.3E06117134j693878j123772n50842j545181L018913J200638k169571p73888K631226
433E05110779m45290m699287k055702k69547L761253J911507l67889j309738l504525
441.7D98131561J903420R24225O87065L300400P8086l401794k181130p44400J941681
450.4E00639114M579735N31845j543884r10721q80318L10212l733712l868446J793137
459.1D96916962J711349K507477P67555R90944j484985n499192m124259k363549O88439
$$ plain form
399.3 490865402 489376488 495628548 502555389 502803268 505405922 507051392 514059639 512692223 500861855
407.9 500861855 503125458 505363159 506353073 508898354 508254433 502898674 497199898 502119560 504749756
416.6 504749756 497883911 484516449 498194199 511089249 511050987 512487144 508671951 506117134
424.3 506117134 504423256 503299484 502748642 501203461 504222374 505423012 503253441 502479553 505110779
433 505110779 504665489 499966202 497910500 497640953 501402206 503313713 502945824 501636086 498131561
441.7 498131561 500034981 500959206 501646271 504946671 505024757 501622963 499441833 498697433 500639114
450.4 500639114 505218849 505750694 504206810 503296089 502415771 502725983 498992271 495123825 496916962
459.1 496916962 498628311 501135788 501903343 502894287 501409302 495910110 491785851 489422302 490110741
467.7D90110741M809036J219711j52054J804963m088288k3079K568169l374634J713066
476.4D94587631L956146l432617k694435j579742j066056K102433m73061j406784J12305
485.1D90105820j904259j575546j288758P56188L61404j603775J610565j832542m42352
493.8D84186745K200660j295433J877404R82093L64685P02973l178024l20702k63672
502.5D85256729k018242j127090j678810k91100J376381K411499K32697j36681Q04024
511.1D84829407j319046j008683j710166j313286J683540J028900P74765k46811m520378
519.8D78198242j975860J922683K04773m78210j400070j945763J423149M57153j068649
528.5D75337448m11072O34880R86519j133957l76548N3634p03811J341056l02276m59366
$$ plain form
467.7 490110741 494919777 496139488 495987434 497792397 493704109 493681030 496249199 492874565 494587631
476.4 494587631 498543777 495111160 492416725 490836983 489770927 491873360 491400299 489993515 490105820
485.1 490105820 488201561 486626015 485337257 486093445 486454849 484851074 486461639 484629097 484186745
493.8 484186745 486387405 485091972 486969376 487951469 488316154 489019127 485841103 485520401 485256729
502.5 485256729 483238487 482111397 480432587 480141487 481517868 483929367 484162064 484025383 484829407
511.1 484829407 483510361 482501678 480791512 479478226 481161766 482190666 482965431 482718620 478198242
519.8 478198242 476222382 478145065 478349838 477871628 476471558 474525795 475948944 476406097 475337448
528.5 475337448 474926376 475561256 476547775 475413818 475037270 475090904 474387093 475728149 475425873 474966507
538.1D74966507J022453j239662j457710j279297j381149k00768j28593n59120N4130
546.8D69796791J294327K0065j243133k99454o22063j669998n81589K56577l18680
555.5D66632843l14140r58786j077195p44705P73545J106262o91185k95372n95932
564.2D63835335J593666J927681j743546J2436J672707P86400r59130l056411j657830
572.9D62411308J433907J336593j241874M45213J301231o79855j49155J425095O64826
581.5D66947289k421608k421532l57247Q10242J566544P39326M30680R51919M94347
590.2D66739960o99349j075172J056213R67865l31230O53305J25504l18528O85578
598.9D67804146O61201M51432l64724l73230m73365j360741j538124p70264Q61702
$$ plain form
538.1 474966507 475988960 474749298 473291588 472012291 470631142 470430374 470301781 469742661 469796791
546.8 469796791 471091118 471111183 469868050 469568596 468946533 467276535 466694946 466951523 466632843
555.5 466632843 466318703 465359917 464282722 463538017 464311562 465417824 464726639 464431267 463835335
564.2 463835335 465429001 467356682 465613136 465625572 467298279 468084679 467125549 464069138 462411308
572.9 462411308 463845215 465181808 463939934 464385147 465686378 465006523 464857368 466282463 466947289
581.5 466947289 464525681 462104149 461746902 462557144 464123688 464863014 465293694 466245613 466739960
590.2 466739960 466040611 464965439 466021652 466989517 466658287 467311592 467437096 467118568 467804146
598.9 467804146 468465347 468916779 468552055 468178825 467705460 466344719 464806595 464036331 464898033
607.6D64898033K9030Q316R84345n11818o78597p57866k50473j43280j611023j044426
617.2D60922241M6540K087821J935349l42217K08893M63829O43311J403427L03535
625.9D67672729l30276J35918J638679K546692J724281N17922J97525K600174J884346
634.6D78587990j027413j4114N80864J116409K814179K518806P08657M9362P20062
643.3D86054802J598892J122284k67181j69106L47328P92122Q36144M84962M21753
651.9D91222000K014885K933502J14632j98631Q0566j689758j520996j85471M50211
660.6D93220940l45726j050034q74176P56683J965065J103592k19154l227158J228180
669.3D92558212R34601J097183Q18520n12810Q70896K417182L023949J258392j29852
$$ plain form
607.6 464898033 464927063 464935379 465919724 465407906 464729309 463971443 463720970 463577690 461966667 460922241
617.2 460922241 460968781 463056602 464991951 464649734 464858627 465322456 465965767 467369194 467672729
625.9 467672729 467342453 467478371 469117050 471663742 473388023 473905945 474103470 476703644 478587990
634.6 478587990 477560577 477546463 478127327 479243736 482057915 484576721 485285378 485334740 486054802
643.3 486054802 487653694 488775978 488508797 488339691 488687019 489479141 490315285 490800247 491222000
651.9 491222000 493236885 496170387 496285019 496086388 496166954 494477196 492956200 492770729 493220940
660.6 493220940 492875214 491825180 490951004 491707687 493672752 494776344 494557190 491330032 492558212
669.3 492558212 493492813 494589996 495408516 494895706 495766602 498183784 501207733 502466125 502336273
678E02336273J77841r80682K85378K002220J882362M90532M96750L179588J581421
686.7E11451683m78973N71670M06532N30358o1951j52740J197471Q78563J101990R36737
696.3E16381340k59209K26632Q05816R0027l24669K95944N95551J164131J190872J457901
705.9E21624336J277542p52601N70183K010192R57909l94859p62253O37703O09894
714.6E25778046J439666J739884P21550L20015l86696j7815p8087O92368P82700K94723
724.3E31286354J043129J064415J644821J163292N04189N69191Q14743R03282j47247
733E38846169p0763J118812J695099N01709r9868J75857P03888J181641K00805R1744
742.6E44345093n8861L41415J053811Q04367O71348j6365N01099J063499Q15659J038246
$$ plain form
678 502336273 502514114 501533432 501818810 503821030 505703392 506193924 506690674 509870262 511451683
686.7 511451683 510972710 511544380 511950912 512481270 512419319 512266579 513464050 514342613 515444603 516381340
696.3 516381340 516122131 516348763 517154579 517244606 516919937 517215881 517811432 518975563 520166435 521624336
705.9 521624336 522901878 522149277 522719460 524729652 525687561 525292702 524530449 525168152 525778046
714.6 525778046 527217712 528957596 529679146 529999161 529612465 529594650 529516563 530208931 530991631 531286354
724.3 531286354 532329483 533393898 535038719 536202011 536706200 537275391 538090134 538993416 538846169
733 538846169 538775406 539894218 541589317 542091026 541991158 542167015 542870903 544052544 544253349 544345093
742.6 544345093 544286232 544627647 545681458 546485825 547157173 547140808 547641907 548705406 549521065 550559311
752.2E50559311L40385j116752m67224J620292J979904J128960Q96950J424942Q40340
760.9E57207108O09169N40542L22266J283493J240349R62944N5084N45120P84722r74007
770.6E62576790l25089P9804J1787K74506K96631k55242j03798R52988J35231N798
780.2E63649406N88341J228447J88866j255074l66935J04980P19719P68280P68204
788.9E66394234P39059O76804P52525k58903n71022m27437J94969m65775q65821L83110
798.5E66551743P13157l98369j462860k10647O1302j165276j991729j893425j638451
807.2E58565445j402969n86472l43704K11716j113434j652489j078415j630363q77648
815.9E50091667j457176j313477k2087N99861Q01354R54933K114792J586266J219863
$$ plain form
752.2 550559311 550899696 549782944 549315720 550936012 552915916 554044876 554941826 556366768 557207108
760.9 557207108 557816277 558356819 558679085 559962578 561202927 562165871 562220955 562766075 563550797 562576790
770.6 562576790 562251701 562331505 562343292 562617798 562914429 562659187 562555389 563508377 563643608 563649406
780.2 563649406 564237747 565466194 565655060 564399986 564033051 564138031 564857750 565626030 566394234
788.9 566394234 567133293 567810097 568562622 568303719 567732697 567305260 567500229 567034454 566168633 566551743
798.5 566551743 567264900 566866531 565403671 565193024 565254326 564089050 562097321 560203896 558565445
807.2 558565445 557162476 556576004 556232300 556444016 555330582 553678093 552599678 550969315 550091667
815.9 550091667 548634491 547321014 547298927 547898788 548700142 549655075 551769867 553356133 554575996
824.6E54575996J388245J438141J684112J187478J617507K462731L206634K961960
832.3E70522804L354645L519897J946450J246719J001663N96505P52754J686287J022186
841E85649910J456375K542877K727776K712936Q28972Q8921m22020P7171m1618M09622
850.6E96030922K157516J138993J874389J948891J358833J473008J389274R24072L9750
859.3F08335648P23228R3422J247749J571923K54898L36303O62957Q48045p64198k14424
868.9F13095551o60210k337799l316651k690048m18205n41916k45590r0981R95789
877.6F03789940J167602j16615p11136j267929o75888j434440m35181l26767p75108
886.3E99214478l14599l89976R84154j62506l00484o41976j226768n53398n04608M20685
$$ plain form
824.6 554575996 555964241 557402382 559086494 560273972 561891479 564354210 567560844 570522804
832.3 570522804 573877449 577397346 579343796 580590515 581592178 582188683 582941437 584627724 585649910
841 585649910 587106285 589649162 592376938 595089874 595918846 596007767 595585747 595662918 595621300 596030922
850.6 596030922 598188438 599327431 601201820 603150711 604509544 605982552 607371826 608295898 608335648
859.3 608335648 609058876 609152298 610400047 611971970 612226868 612563171 613226128 614074173 613309975 613095551
868.9 613095551 612435341 610097542 606780891 604090843 603672638 603130722 602885132 602794151 603789940
877.6 603789940 604957542 604840927 604129791 602861862 602185974 600751534 600316353 599989586 599214478
886.3 599214478 598899879 598509903 599494057 599331551 599031067 598389091 597162323 596608925 596104317 596525002
895.9E96525002m45710O4240N67055J55983k51465j200104j080895j233940K60659
904.6E93360825J645736K005921J237449J325074K229957J442757J251564k68936n92499
913.3F03637848o70548r01870n42374j573029j820335j679001q15849j529198k153167
922E91952477k519036k725448k262192l500214k098884j108399k624626l672943k638359
930.7E68802376j211586j993256j630745j246910j466560r78050o33240j209755j065941
939.3E57366333l50037j087455j286888j433335j62926L79372p62443n77164q46291
948E51239166k86903K63824N55191M66080O0349l67012j440621r68857q47129j137352
957.7E47536736k544671k463035j151657k536812k307701j471977j198235j716576
$$ plain form
895.9 596525002 596079292 596143532 596710587 596866570 596615105 595415001 594334106 593100166 593360825
904.6 593360825 595006561 597012482 598249931 599575005 601804962 603247719 604499283 604230347 603637848
913.3 603637848 602967300 602065430 601523056 599950027 598129692 596450691 595634842 594105644 591952477
922 591952477 589433441 586707993 584445801 580945587 578846703 577738304 575113678 571440735 568802376
930.7 568802376 567590790 565597534 563966789 562719879 561253319 560275269 559642029 558432274 557366333
939.3 557366333 557016296 555928841 554641953 553208618 553045692 553425064 552662621 552085457 551239166
948 551239166 550952263 551216087 551771278 552237358 552297707 551930695 550490074 549521217 548674088 547536736
957.7 547536736 544992065 542529030 541377373 538840561 536532860 535060883 533862648 532146072
965.4E32146072j925773j156426j703453j209793j310081k035714k133026k207412
973.1E18464394k110825k891083l376083l396149k921104k491036l224983m116783
980.8D93936348m092598l600388l631401m048690m730111m643020l795166m189759
988.5D61205215l899612l039436l486977l098106k769547k421417k191086k568779
996.2D37730255k702942k731552k327194k546616k383995k209778j901359j624108
1004D19302711j792755j725959k198906j744538k131118j745682j180496j831055j304245
1012.6D03647957j470032j149864j928787k458344j812935j727676j487160k482071
1020.3C89131088k891006k415428j469574k082253k360725j452637j046905o21834
$$ plain form
965.4 532146072 530220299 529063873 527360420 526150627 524840546 522804832 520671806 518464394
973.1 518464394 516353569 513462486 510086403 506690254 503769150 501278114 498053131 493936348
980.8 493936348 489843750 486243362 482611961 478563271 473833160 469190140 465394974 461205215
988.5 461205215 457305603 454266167 450779190 447681084 444911537 442490120 440299034 437730255
996.2 437730255 435027313 432295761 429968567 427421951 425037956 422828178 420926819 419302711
1004 419302711 417509956 415783997 413585091 411840553 409709435 407963753 406783257 404952202 403647957
1012.6 403647957 402177925 401028061 399099274 396640930 394827995 393100319 391613159 389131088
1020.3 389131088 386240082 383824654 382355080 380272827 377912102 376459465 375412560 374790726
1028.1C74790726j567307q10356j264877j411782q30497r01909N24673L30735J048126
1036.7C69907532O28242J416703K617950K084541J674118k76107p8812k42386L27377
1045.4C78059158J36109r79348j05438n37452q41141j625061p25327j438675k834816
1054.1C69108009k159691j283073M32892q08296o0349O92063R77706K044907K232056
1062.8C71176224K936325J832466J930656J532555J874199J823425J206169K048951
1070.5C86360970J231460J493721J110382r6092n59616L24020N47180N39704P26700
1079.2C91678429o79398Q52509J244049J556282J537437K23503P85523P45582J378708
1087.9C99322624Q23479J450157J180954M65012J588935J204148J845779J595612J422424
$$ plain form
1028.1 374790726 373223419 372413063 371148186 369736404 368905907 368003998 368528671 368859406 369907532
1036.7 369907532 370535774 371952477 374570427 376654968 378329086 378052979 377974167 377731781 378059158
1045.4 378059158 378195267 377215919 377110481 376573029 375731888 374106827 373381500 371942825 369108009
1054.1 369108009 366948318 365665245 366098137 365289841 365229492 365921555 366899261 368944168 371176224
1062.8 371176224 374112549 375945015 377875671 379408226 381282425 383105850 384312019 386360970
1070.5 386360970 387592430 389086151 390196533 390100441 389540825 389864845 390412025 390951729 391678429
1079.2 391678429 390999031 391851540 393095589 394651871 396189308 396412811 397198334 397943916 399322624
1087.9 399322624 400146103 401596260 402777214 403242226 404831161 406035309 407881088 409476700 410899124
1096.5D10899124L77770K87819J204071O81877J194038N03044J385575J775817J305237
1105.2D19614372R84192J047020K036934K16789m67338k24800O76651O65855O87675
1113.9D25237350K592774J116485R7962J35574j16234m07562k84538J7395j10054O21262
1123.5D28900414j30921R03130J617202R00765J224708J439934J754189O12831J421928
1132.2D38644180K404633K250709K554245K028084K163391K294426K035599J742592
1139.9D56117859J782722J334076O65627K98347M81720J303292J310501J340599M70123
1148.6D65104866N9395Q2397l71933K54937m67415p79190l69187o09360l70025o05850
1158.3D61928635q46367p20101O1264m2457q99544o46744N92499J177940J259957K720566
$$ plain form
1096.5 410899124 411276894 411564713 412768784 413450661 414644699 415147743 416533318 418309135 419614372
1105.2 419614372 420598564 421645584 423682518 423899307 423431969 423207169 423883820 424549675 425237350
1113.9 425237350 427830124 428946609 429044571 429180145 429063911 428656349 428371811 428389206 428279152 428900414
1123.5 428900414 428769493 429672623 431289825 432190590 433415298 434855232 436609421 437222252 438644180
1132.2 438644180 441048813 443299522 445853767 447881851 450045242 452339668 454375267 456117859
1139.9 456117859 457900581 459234657 459900284 460198631 460680351 461983643 463294144 464634743 465104866
1148.6 465104866 465164261 465246658 464874725 465129662 464662247 463883057 463513870 462904510 462534485 461928635
1158.3 461928635 461082268 460362167 460423431 460380974 459481430 458834686 459427185 460605125 461865082 464585648
1167.9D64585648K976646K799072K932434K393380K058029K287788K779694K567634
1175.6D85380325K208100K358665K629509K319794K236557K322845K158356K218971
1183.3E03833122J751786J008834J187554J131134N53055J020126R27505L38517K71644
1192E12023277J65329m2648l84407o75621q22601p21055o21795j24436l13949r96247
1201.6E07485847q82797p49130q80928j237488r24492k24991j88179q53958o63223
1210.3E00880661J23482l41988j69334j38283j124268o73256Q5984l20282p40700q34770
1220D96747246q16689k04277j50375n75867m53644n35354q57544j193199j083985p74536
1229.6D90101776o87675o39611p65495r81789r10034j12648N59616M3793o55899n72701
$$ plain form
1167.9 464585648 467562294 470361366 473293800 475687180 477745209 480032997 482812691 485380325
1175.6 485380325 487588425 489947090 492576599 494896393 497132950 499455795 501614151 503833122
1183.3 503833122 505584908 506593742 507781296 508912430 509465485 510485611 511413116 511751633 512023277
1192 512023277 512188606 512145958 511761551 511085930 510263329 509542274 508920479 508796043 508482094 507485847
1201.6 507485847 506603050 505853920 504972992 503735504 502811012 502586021 502397842 501543884 500880661
1210.3 500880661 501004143 500662155 500492821 500354538 499230270 498557014 498642998 498322716 497582016 496747246
1220 496747246 495930557 495726280 495575905 495000038 494546394 494011040 493153496 491960297 490876312 490101776
1229.6 490101776 489414101 488774490 488008995 487027206 486117172 486004524 486564140 486607933 485952034 485379333
1239.3D85379333k57606j53961r1057p7019k82669l85666j57470j15738n10331n62782
1248.9D82785034k31170l18985m04969j14059K94227K93885m0894k19154l20206K08740
1258.5D81932449J16005o26678j67351N97878Q58612N73387N52368P18155N82962M28848
1268.2D85566635M73061Q05397P80144N84564O70623R99680J372032J373558P00455
1276.9D93326149O63643J251488Q96797L69568O24504J319427J239434J253204J616096
1285.5E02560310J505661J242600Q36105J290474J344566R07860O70586L06206K16179
1294.2E10880547N08117N76363N61371J075248N36538K64816L67317O0120l1090m82407
1303.9E14316940p1792K09083j0605l99551m65736k52343l20396j87645r73244j108017
$$ plain form
1239.3 485379333 485121727 484967766 484876709 484799690 484517021 484131355 483973885 483858147 483347816 482785034
1248.9 482785034 482553864 482234879 481829910 481715851 482010078 482303963 482263069 482043915 481723709 481932449
1258.5 481932449 482048454 481421776 481254425 481852303 482710915 483284302 483836670 484554825 485137787 485566635
1268.2 485566635 486039696 486845093 487625237 488209801 488880424 489880104 491252136 492625694 493326149
1276.9 493326149 493989792 495241280 496138077 496507645 497132149 498451576 499691010 500944214 502560310
1285.5 502560310 504065971 505308571 506144676 507435150 508779716 509687576 510358162 510664368 510880547
1294.2 510880547 511388664 511965027 512526398 513601646 514138184 514403000 514770317 514830437 514799347 514316940
1303.9 514316940 514245148 514454231 514443626 514044075 513578339 513325996 513005600 512817955 511844711 510736694
1313.5E10736694p57064l78876J03874j64719J17836K89688Q57430J302757R51844
1322.2E13059464O46324M61349N57938L35617L79333L73497K88430j19095m36554k3384
1331.8E15522919K9335m22249q26607k63443r5939j5526K17781j97983N53894J233330
1341.5E15735512J030388L79638N20859P64465P20559Q23097q1253l5248J36070N40886
1351.1E20534973M77066j43814l32489q08639O4392p3929l80783m55742o54907p31240
1360.8E17494888p15904j69678p07130N66330J59263o36520k76832j008721o57120
1369.4E14048576L167M54101n7869l66707n80978l31230R19571j56136j49155J45722
1379.1E13929062J18980j37787n65757q80814j791420q33206k14005m22821k252159
$$ plain form
1313.5 510736694 509979630 509600754 509704628 509539909 509657745 509947433 510804863 512107620 513059464
1322.2 513059464 513705788 514167137 514725075 515060692 515440025 515813522 516101952 515982857 515546303 515522919
1331.8 515522919 515552254 515130005 514303398 514039955 513944016 513928490 514146271 513948288 514502182 515735512
1341.5 515735512 516765900 517145538 517666397 518430862 519151421 519974518 519893265 519858017 519994087 520534973
1351.1 520534973 521012039 520868225 520535736 519727097 519791489 519717560 519336777 518881035 518226128 517494888
1360.8 517494888 516778984 516609306 515902176 516468506 516627769 515991249 515714417 514705696 514048576
1369.4 514048576 514051743 514505844 514447975 514081268 513500290 513169060 514088631 513932495 513783340 513929062
1379.1 513929062 514048042 513910255 513344498 512463684 510672264 509839058 509625053 509202232 506950073
1387.8E06950073j076927j75819j791878j411667j580353j360779k648124l545838
1395.5D93358688p08427j090851j390381l187027j955261j113052j930237j578026
1403.2D80405426j804428k627754k638779j257553j437340j977234j644325j665649
1410.9D65352364q90885j105614j242904j169510j126976p86400r13620O0120l625222
1419.6D54551353q42437J556816J04484j4419l56064R79462P59277J61171J017036
1428.3D57916679L92685N94063N11398J201554J327934J280747J928329J272850N31273
1437D66957512J313019K619018J464386J146164J465836Q81614J390152Q05397J646386
1445.6D79689484J429519P70340Q55713J587906J832695N39932J424904J239548J434517
$$ plain form
1387.8 506950073 505873146 505697327 503905449 502493782 500913429 499552650 496904526 493358688
1395.5 493358688 492650261 491559410 490169029 486982002 485026741 483913689 481983452 480405426
1403.2 480405426 478600998 475973244 473334465 472076912 470639572 468662338 467018013 465352364
1410.9 465352364 464461479 463355865 462112961 460943451 459816475 459030075 458116455 458176575 454551353
1419.6 454551353 453708916 455265732 455370216 455355797 454999733 455979195 456738472 456899643 457916679
1428.3 457916679 458309364 458903427 459414825 460616379 461944313 463225060 465153389 466426239 466957512
1437 466957512 468270531 470889549 472353935 473500099 474965935 475847549 477237701 478043098 479689484
1445.6 479689484 481119003 481889343 482745056 484332962 486165657 486705589 488130493 489370041 490804558
1454.3D90804558J387634O03142l59421j46446M537544K201653K539215J740989J506730
1463E04815598K612495N35126J858711J814461K090149K297096K666015K888909J608353
1471.7E23186913K459754J740799L371544K975464J837158K325249K553787K160950
1479.4E42611618J268272J371575J520614J627388J536942J274071J244888M11987
1487.1E52867355K99607O35185j496964n1536J814575Q07495m37317k59971K00386
1495.8E54378815l731613l44124j064568k379227K15416o40754q96073m66880R46464
1504.5E46017456L35808p442856n615273L082696K409973l15209J081925p75071k222518
1513.1E36556931j52894j074600o41365k587585j826668J748886P75871k183990j564713
$$ plain form
1454.3 490804558 492192192 492795334 492435913 492289467 496827011 499028664 501567879 503308868 504815598
1463 504815598 507428093 507963219 509821930 511636391 513726540 516023636 518689651 521578560 523186913
1471.7 523186913 525646667 527387466 530759010 533734474 535571632 537896881 540450668 542611618
1479.4 542611618 543879890 545251465 546772079 548399467 549936409 551210480 552455368 552867355
1487.1 552867355 553166962 553802147 552305183 552253647 554068222 554875717 554438400 554178429 554378815
1495.8 554378815 550647202 550303078 549238510 546859283 547074699 546433945 545537872 545070992 546017456
1504.5 546017456 546353264 538910408 533295135 536377831 538787804 538472595 539554520 538779449 536556931
1513.1 536556931 536404037 535329437 534688072 532100487 530273819 532022705 532798576 530614586 529049873
1521.8E29049873J315918J602745J572152j121178O99577J026879J16996J161728Q23097
1530.5E36247787O54603K49099q40873j638718J656647J065597K63634L06854m407616
1539.2E33557014J70327L233986J275901q60481J666527P37724j831436J524048M00009
1547.9E39873619Q02269m27551j309967J712417R12819J488343j475029o74477J196022
1556.5E42098465J276321k031555j1209068M527626J360283J560249k64435q64601
1564.2E36453285k657013j996231l51791j976662j079903o964340j065025q44612k718964
1572.9E16798744k121467k606163k255440j1587563l67202k237511l624420l564110
1580.6D88434868m535484k683907n176392l209800m478646m156303m091187n019607
$$ plain form
1521.8 529049873 530365791 531968536 533540688 532419510 533119087 534145966 534262962 535424690 536247787
1530.5 536247787 536902390 537151489 536310616 534671898 536328545 537394142 537657776 537964630 533557014
1539.2 533557014 533727341 536961327 538237228 537376747 539043274 539780998 537949562 539473610 539873619
1547.9 539873619 540675888 540248337 538938370 540650787 541563606 543051949 541576920 540902443 542098465
1556.5 542098465 543374786 541343231 530134163 534661789 536022072 537582321 537317886 536453285
1564.2 536453285 533796272 531800041 531448250 529471588 528391685 521427345 520362320 519517708 516798744
1572.9 516798744 514677277 512071114 509815674 498228111 497860909 495623398 491998978 488434868
1580.6 488434868 483899384 481215477 476039085 472829285 468350639 464194336 460103149 455083542
1588.4D55083542l456612n536499k707596m758720l250656l853836m797173k794761
1596.1D23927689m877434k033959m196472k589569l410187k917518k110863m022484
1603.8C97769203r16099l352356j325188k594872j179657j768417l284721j94130k561875
1612.5C80591888L53241j816177J66855r20372o293335K720108q12454J238708j418571
1621.1C73809891Q93783n89561k605133J855736m55094K109413j409607J051407Q74176
1629.8C75535011O52275J029320O104K397766j35651M97627j181297K494774J307564
1638.5C82603493J314468K608719l7231K284050M64172K391281K266731n70450K121850
1647.2C95447083q51670L901749J434364L372803K407341l550224m66576J688423N173378
$$ plain form
1588.4 455083542 451626930 446090431 443382835 438624115 435373459 431519623 426722450 423927689
1596.1 423927689 419050255 417016296 412819824 410230255 406820068 403902550 401791687 397769203
1603.8 397769203 396853104 393500748 392175560 389580688 388401031 386632614 383347893 383153763 380591888
1612.5 380591888 380945129 379128952 379295807 378375435 372082100 374802208 373989754 375228462 373809891
1621.1 373809891 374703674 374114113 371508980 373364716 372909622 375019035 373609428 374660835 375535011
1629.8 375535011 376187286 377216606 377222710 379620476 379484825 379982452 378801155 381295929 382603493
1638.5 382603493 383917961 386526680 386489449 388773499 389237671 391628952 393895683 393325233 395447083
1647.2 395447083 394595413 398497162 399931526 403304329 405711670 402161446 401694870 403383293 408556671
1655.9D08556671K031670K723121J442986J933174J990357J793479K810059J98021
1663.6D23479538L476486J827965K491722K885475K723427K449265P75756M522591
1671.3D44632225K362824M237480L562088K029304J921845L274002M734039L279572
1679D70033379M420814K570343M108811M682579J183738L170281K076492O486893M195900
1687.7E02929230L531341M439011L656769M474640L981247M439849M743233M839134
1695.4E37034454j20353M480857O014557N964127L956985k629814O962471N011597
1703.1E66674881L770676K659073K767639K183265K539559L781280K277870J865273
1710.8E88519516K691421K572251K237816P55081J014862L151817J159897m826050
$$ plain form
1655.9 408556671 410588341 413311462 414754448 416687622 418677979 420471458 423281517 423479538
1663.6 423479538 426956024 428783989 431275711 434161186 436884613 439333878 440109634 444632225
1671.3 444632225 446995049 451232529 454794617 456823921 458745766 462019768 466753807 470033379
1679 470033379 474454193 477024536 481133347 485815926 486999664 490169945 492246437 498733330 502929230
1687.7 502929230 506460571 510899582 514556351 519030991 523012238 527452087 532195320 537034454
1695.4 537034454 536914101 541394958 547409515 553373642 557330627 554700813 561663284 566674881
1703.1 566674881 570445557 573104630 575872269 578055534 580595093 584376373 586654243 588519516
1710.8 588519516 591210937 593783188 596021004 596776085 597790947 600942764 602102661 597276611
1718.5E97276611L912545L758049K205276J636047J027222Q20923J679878K003632
1726.3F14320183R46235J159173J667556q20160N16739L824158L452301k233887m137878
1734.9F18694420N025978M072342J932030K502517k34985q22640M094620K396584Q88443
1743.6F38549309K214927L494950K979507J758805K028274K208557M394531Q12073
1751.3F58440933Q50373M665145L100892K934341K416000K32849J707306K892990K863312
1760F80104141K775192r87701M49448L220062J394348J437683K139893J819076j620330
1768.7F90731812J845932L903579j93939j696167j08948M127426J782990q11386J977081
1777.4G01558380M53339J496582O75812p76520J420593J709595J281509o66046K54440
$$ plain form
1718.5 597276611 601189156 604947205 607152481 608788528 609815750 610636673 612316551 614320183
1726.3 614320183 615266418 616425591 618093147 617272987 617789726 621613884 625066185 622832298 618694420
1734.9 618694420 623720398 627792740 629724770 632227287 631992302 631169662 635264282 637660866 638549309
1743.6 638549309 640764236 644259186 647238693 648997498 651025772 653234329 657628860 658440933
1751.3 658440933 659291306 663956451 667057343 669991684 672407684 672640533 674347839 677240829 680104141
1760 680104141 682879333 681891632 682341080 685561142 686955490 688393173 690533066 692352142 690731812
1768.7 690731812 692577744 696481323 696287384 694591217 694482269 698609695 700392685 699581299 701558380
1777.4 701558380 702011719 703508301 704184113 703407593 704828186 706537781 707819290 707153244 707407684
1786G07407684J167679Q63419P85141J299820N10406K3270j295090k66495L535767
1794.7G14031601J215286q1253J353913J243743K17667j095581J555557J13602O93130
1803.4G19247665J582642M90570R99451M13437N26809Q39615P65228j073913k5940
1812.1G23765564J060486N97763J307526M18701O98166k76413n9281P75528J06125
1820.8G28394165P21817j40610R41773Q03604j862106K02789J983490K043609j66854
1829.4G32921677k550583Q86841K013473j67770k50855N47943M77295K94113k68325
1838.1G33903809Q75625L96347O38733N3330Q48007P68661m417343K145539J855545
1846.8G37068253j6404J38474P11517J111679m120M53415m91333K9068K59476m16336
$$ plain form
1786 707407684 708575363 709438782 710223923 711523743 712034149 712057419 710762329 710495834 714031601
1794.7 714031601 715246887 715165634 716519547 717763290 717980957 716885376 718440933 718554535 719247665
1803.4 719247665 720830307 721320877 722320328 722733765 723260574 724100189 724865417 723791504 723765564
1812.1 723765564 724826050 725423813 726731339 727150040 727848206 727571793 727512512 728288040 728394165
1820.8 728394165 729115982 728975372 729917145 730720749 728858643 729061432 731044922 733088531 732921677
1829.4 732921677 730371094 731257935 733271408 733103638 732852783 733400726 733878021 734172134 733903809
1838.1 733903809 734779434 735175781 735814514 735867844 736715851 737484512 733067169 735212708 737068253
1846.8 737068253 737051849 737190323 737901840 739013519 739009399 739462814 738971481 739000549 739260025 738843689
1856.4G38843689L19748l9368L63007M03747O80466o5689J96915L61175k1210O39725
1866.1G41682205m98428L64380j220856j195450J417008J094055Q71429K23236N10331
1874.8G43247910k13547j35880l50189m07104L64303q8272N40161L32718P71408N1499
1884.4G44113007k67258L73611l92074M25720o41403j233750M85917Q69674N68695
1893.1G44302139O47431K92206o92750O09131p9269q0643J14975k08969L30429k14996
1902.7G45019684K70157M5089L28370L13720L433O3019n07049m74625l93906P69425
1912.4G45437317J14288J36948N06821L57894J086579j572495p42340P91931L75824
1921.1G46492767M3412j102677l96347L21655N51072L8452J20849J4420J80893J50604
$$ plain form
1856.4 738843689 739163437 739124069 739487076 739890823 740571289 740505600 740702515 741063690 741042480 741682205
1866.1 741682205 741183777 741548157 740327301 739131851 740548859 741642914 742514343 742737579 743247910
1874.8 743247910 743034363 742898483 742548294 742141190 742505493 742417221 742957382 743290100 744061508 744113007
1884.4 744113007 743845749 744219360 743827286 744253006 743611603 742377853 742863770 743733444 744302139
1893.1 744302139 744949570 745241776 744549026 745158157 745078888 744998245 745113220 744904251 745234680 745019684
1902.7 745019684 745289841 745334930 745663300 745977020 745980453 746043472 745536423 745061798 744667892 745437317
1912.4 745437317 745551605 745688553 746195374 746553268 747639847 746067352 745325012 746116943 746492767
1921.1 746492767 746536179 745433502 745037155 745358810 745909882 745948334 746069183 746083603 746264496 746415100
1930.7G46415100m48074K84881k77557o0425J07193R6283o9809j69525O87790M5395
1940.3G46611252O96106l66669j544571L20587K48642J7166l40576K28501L1204L3798
1950G45935440J50909K1210J70441n74112n16815l88718N86243L00216m43573L7003
1959.6G45278244j18408J73492k33688j50910j42211j80817O4621k76566k29K92817
1969.3G44706345K98233l26538L15628L34472k05307j64566k16064M41742l24936q8349
1978.9G44770660R3537m57993k98614k60697L02124R2545J91498l10059m76837j86462
1988.6G43459702k60926N19333O5689o30340k51770L88794l11966l09372M27856q3160
1998.2G43013840K6169k83509J56708r4910k98538K56424j84174M4632k34909M3488
$$ plain form
1930.7 746415100 745967026 746251907 745974350 745913925 746021118 746117401 746047592 745878067 746565857 746611252
1940.3 746611252 747307358 746940689 745396118 745716705 745965347 745982513 745641937 745870438 745901642 745935440
1950 745935440 746086349 746107559 746278000 745703888 745187073 744798355 745384598 745684814 745241241 745278244
1959.6 745278244 745159836 745333328 745099640 744948730 744806519 744625702 744690323 744413757 744413528 744706345
1969.3 744706345 745004578 744678040 744993668 745328140 745122833 744958267 744742203 745183945 744859009 744770660
1978.9 744770660 744864197 744406204 744107590 743846893 744149017 744241562 744433060 744123001 743646164 743459702
1988.6 743459702 743198776 743718109 743783798 743153458 742901688 743290482 742978516 742669144 743097000 743013840
1998.2 743013840 743040009 742756500 742913208 742818298 742519760 742776184 742592010 742636642 742401733 742445221
2007.8G42445221j49231m58298k16903k03400L04871j01853l02505k50092K87323j81045
2017.5G41174088n10941R7427K5940M15421m41971j27792K44369k75268l70636m23584
2027.1G39807053L54080n05219l36609J15662k33993l1815k91901q1863n9128J93710
2036.8G38929977k24609k37045m0207j56937p63l12958L65754J83029J1139k45133
2046.4G38272247l35083O2867k71149L2654m00772j75553k21481q1711L95355j62735
2056.1G37114639K6856r6665L17307j24130l35007k64816m05350L65524l72314j66397
2065.7G36059647N7830Q5221K66342L62396N61905m97131l65143m92783k76107m1962
2075.4G35720215l38898J76315K56882M78439j61972l36685k15683j52969k05002k58179
$$ plain form
2007.8 742445221 742295990 741837692 741620789 741417389 741722260 741620407 741317902 741067810 741355133 741174088
2017.5 741174088 740663147 740760574 740786514 741201935 740759964 740632172 740876541 740601273 740230637 739807053
2027.1 739807053 740161133 739655914 739319305 739434967 739200974 739169159 738877258 738795395 738736267 738929977
2036.8 738929977 738705368 738468323 738428116 738271179 738270416 737957458 738323212 738506241 738517380 738272247
2046.4 738272247 737937164 738000031 737728882 737761536 737360764 737185211 736963730 736882019 737277374 737114639
2056.1 737114639 737141495 737044830 737362137 737238007 736903000 736638184 736232834 736598358 736226044 736059647
2065.7 736059647 736117477 736202698 736469040 736831436 737393341 736896210 736531067 736038284 735762177 735720215
2075.4 735720215 735381317 735557632 735814514 736292953 736130981 735794296 735578613 735425644 735220642 734962463
2085G34962463K80304k80151o10J26266R6283j55487l37067K87323k82592j91803l33329
2095.6G34171600K2507K36282j27258J95465k77710M425l4408j39466j65329l20434
2105.2G33565674l64456k29721J84326l40653K09732L968j48850K68173k49710j00937
2114.9G32797546l02047p8583l97492l43322P9574n8822K38876j8692m1504j52130
2124.5G31723404K62451M2725k06299J831m42886o7978N4702O50559J70822m83322
2134.2G31706009j01471r9793K18506l0670J61820l44773m79507j06812o790M07639
2143.8G31324158k09580K16751K76032r308j7929p7591J31149j78451J1291k24151
2153.5G31242371O5612N9510K17666O02799j86386j77918l09219M8065L9597M2724
$$ plain form
2085 734962463 735242767 734962616 734962006 735088272 735184555 735029068 734692001 734979324 734696732 734504929 734171600
2095.6 734171600 734194107 734430389 734303131 734498596 734220886 734225311 734190903 734051437 733886108 733565674
2105.2 733565674 733201218 732971497 733155823 732815170 733024902 733028870 732880020 733148193 732898483 732797546
2114.9 732797546 732495499 732416916 732019424 731676102 731755676 731696854 731935730 731917038 731875534 731723404
2124.5 731723404 731985855 732028580 731822281 731824112 731381226 731313248 731367950 732018509 732189331 731706009
2134.2 731706009 731604538 731504745 731723251 731692581 731854401 731509628 731030121 730923309 730916519 731324158
2143.8 731324158 731114578 731331329 731607361 731598053 731580124 731502533 731633682 731455231 731466522 731242371
2153.5 731242371 731307983 731367493 731585159 732187958 732001572 731823654 731514435 731562500 731602097 731644821
2163.1G31644821L55530k8305P6523p4082k5787l39890J05133J17112l15781L04947
2172.8G31820221R3231J83334k04544L3951L10898P9956J89209l02200K78702q7433
2182.4G32395325l69416L57819J38245n02777k96708M54178R3766L29742J47705k75421
2192G32472458M5853L03726L52173k37656K1667k09655m02756O1417J01471J58309
2201.7G32667007K53144K49710j45798J30310J65787L21274J43203l12423l9521j88064
2211.3G33244629L22723l0212k63443J19095M2495j23138j99738M76914j3275K48565
2221G33824615J85700m87442j33667k09351M6616n22385j22223L04642Q4915M79660
2230.6G33451080L26004N2948n40390O3858J77460J98364J9837n88379K36130j76392
$$ plain form
2163.1 731644821 732000351 731972046 732048569 731974487 731948700 731608810 731713943 731831055 731515274 731820221
2172.8 731820221 731913452 732096786 731892242 731926193 732237091 732317047 732506256 732204056 732482758 732395325
2182.4 732395325 732025909 732383728 732521973 732019196 731722488 732176666 732270432 732600174 732747879 732472458
2192 732472458 732518311 732822037 733174210 732936554 732958221 732748566 732345810 732407227 732508698 732667007
2201.7 732667007 732920151 733169861 733024063 733154373 733320160 733641434 733784637 733472214 733432693 733244629
2211.3 733244629 733567352 733537140 733273697 733392792 733435287 733312149 733112411 733589325 733576050 733824615
2221 733824615 734010315 733522873 733389206 733179855 733226471 732704086 732581863 732886505 732971420 733451080
2230.6 733451080 733777084 733830032 733289642 733353500 733530960 733729324 733749161 733160782 733396912 733220520
2240.3G33220520k47040J7548M13894J49460o48346K56119M9210k54517p5302L5248
2249.9G32916794j90506j84708J18180J00784O35681o2256r0866l8757l88794j56021
2259.5G32659531l22419K35062L28598L47366j11236j32065L70407R3231l22113p17621
2269.2G32428741K16675m5624l55529K17590J83640J13754k5711L52173L891J80358
2278.8G33269958j19476m34265m6997m08020J2207Q011L17535k6550k91443P8888j25198
2289.4G32234650L45382k50091m86374m74396J62964L36304m86908K52380J06354j45493
2299.1G31594772k57263J22910J05209j63498K51999n21240j30387j31683k5940L98331
2308.7G31243210L10669L91159m19235j30158l43170k73972J4954j68304m02222n40390
$$ plain form
2240.3 733220520 732973480 732991028 733404922 733554382 732906036 733162155 733211365 732956848 732881546 732916794
2249.9 732916794 732726288 732541580 732659760 732760544 733396225 733333969 733243103 733204346 732815552 732659531
2259.5 732659531 732337112 732572174 732900772 733248138 733136902 733004837 733375244 733468475 733146362 732428741
2269.2 732428741 732645416 732599792 732244263 732461853 732645493 732759247 732733536 733085709 733089600 733269958
2278.8 733269958 733150482 732716217 732669220 732261200 732273407 732281418 732598953 732572403 732280960 732359848 732234650
2289.4 732234650 732580032 732329941 731843567 731369171 731532135 731868439 731381531 731633911 731740265 731594772
2299.1 731594772 731337509 731460419 731565628 731402130 731654129 731132889 731002502 730870819 730844879 731243210
2308.7 731243210 731553879 731945038 731525803 731395645 731052475 730778503 730793457 730625153 730222931 729682541
2318.4G29682541O62384N47714N76019k64740n68923J09863j79901j755k91214L40042
2328G30612030j13373J98593k33230r21860j79901l92685J542358P42340o19049l76129
2337.7G30259094j0681M2420k35978J71585j135101m09851j29166J00708j46560n14679
2347.3G27991791L78189J41449M45709n67703k94419J04828o16226J86844m2953J688385
2356.9G29415894L84521O97174j78375j091004Q77686m83780r54285k342224N14832
2365.6G26840439L06778m12979Q05053k93274M3412j340409K56653L58963o17599j75095
2375.3G25771942o16760r1629m75388j14975J20697p1640q21838r17053M94156K86102
2384.9G23563614k80762m64783m425L4028j49994o0730m60892j51138j15967N0964
$$ plain form
2318.4 729682541 730344925 730892639 731468658 731203918 730634995 730744858 730564957 730563202 730271988 730612030
2328 730612030 730498657 730697250 730464020 729542160 729362259 728969574 730511932 731254272 730635223 730259094
2337.7 730259094 730248413 730290833 730054855 730226440 729091339 728681488 728552322 728653030 728506470 727991791
2347.3 727991791 728369980 728511429 728957138 728389435 728095016 728199844 727583618 727770462 727727509 729415894
2356.9 729415894 729800415 730497589 730319214 729228210 730105896 729622116 728667831 726325607 726840439
2365.6 726840439 727147217 726734238 727539291 727246017 727289429 725949020 726205673 726564636 725947037 725771942
2375.3 725771942 725155182 725063553 724588165 724473190 724593887 724522247 723700409 722783356 723277512 723563614
2384.9 723563614 723282852 722818069 722813644 722847672 722697678 722636948 722176056 722024918 721908951 721959915
2394.6G21959915k79465l11660l5096k42691J00480k79084J0224J907l89252m22210
2404.2G20113068m56620L3188J17798L08762j03607l69111m91027l61481l46375n43594
2413.8G17901001M08859m9515l38745k64434l89023p4463q2779Q697o46743m45023
2423.5G16027832l58887k02865K91290k38037m34494l67661q926m93240j93177R8801
2433.1G14120636m77448k07138k39944K56958N0430j33209j40457o79398n97305m22058
2442.8G11531067N1193k40860m69742m68063k2965K40250j55182K08969p4691m30985
2452.4G10168991q90121l54004J2436p41196k79770j02844J99814P3318j92337l76434
2462.1G07517853o46057l47901n68084q0719j12000l07541K4796Q3999r3612p11441
$$ plain form
2394.6 721959915 721680450 721368790 721333694 721091003 721191483 720912399 720922623 720924530 720535278 720113068
2404.2 720113068 719656448 719689636 719807434 720116196 720012589 719643478 719152451 718790970 718444595 717901001
2413.8 717901001 718309860 718260345 717921600 717657166 717268143 717193680 717110901 717119598 716472855 716027832
2423.5 716027832 715668945 715466080 715757370 715519333 715084839 714717178 714708252 714215012 714021835 714120636
2433.1 714120636 713643188 713436050 713196106 713453064 713503494 713370285 713229828 712550430 711953125 711531067
2442.8 711531067 711582260 711341400 710871658 710403595 710380630 710620880 710465698 710674667 710599976 710168991
2452.4 710168991 709278870 708924866 708937302 708196106 707916336 707813492 708013306 708086624 707894287 707517853
2462.1 707517853 706871796 706523895 705955811 705875092 705763092 705455551 705480347 705564346 705470734 704759293
2471.7G04759293n43671l94821j94931m41361o45294r8267j2130k4262m11834m85077
2481.3G01507645l44696r8648r2392m80195o04934k82364L3646m75159r918k47727
2491F98905258p70035n50003p20062L34778K10419m91639n49697n60914j51672k13241
2500.6F95443192l02735m00238r4070j25733k35290l97263n40161l97263j058731o59408
2510.3F91232300j06278n5923K0447j11542j82724l48816k19498k90527j1139n57251
2519.9F89369049o52313K01950l39050m69818k81449p782p7667m90646n50690o73065
2529.6F86028519n79605k40250K38953j44349j44729k20261m47159l11966p86590j40305
2539.2F83252258J61896k37656l25470j41677k91672p16324m5929J678k36969n66864
$$ plain form
2471.7 704759293 704215622 703820801 703625870 703184509 702539215 702440948 702428818 702404556 701992722 701507645
2481.3 701507645 701162949 701064301 700971909 700491714 699886780 699604416 699638062 699162903 699152985 698905258
2491 698905258 698135223 697585220 696865158 697199936 697410355 696918716 696369019 695808105 695656433 695443192
2500.6 695443192 695140457 694740219 694646149 694520416 694285126 693887863 693347702 692950439 691891708 691232300
2510.3 691232300 691126022 691070099 691090546 690979004 690796280 690447464 690227966 689937439 689926300 689369049
2519.9 689369049 688716736 688918686 688579636 688109818 687828369 687820587 687742920 687252274 686701584 686028519
2529.6 686028519 685448914 685208664 685447617 685303268 685158539 684938278 684491119 684179153 683392563 683252258
2539.2 683252258 683414154 683176498 682851028 682709351 682417679 681701355 681655426 681657104 681420135 680853271
2548.9F80853271o83746m64706l20053R2392j85852P934k85721l34320n722m27551
2558.5F78245926l59802o07453n76324p16477n16128j71204r9869K89841P63j54114
2568.1F75335159o00052m96292m60968n88455r3231j30768j30310o40335m39148j46408
2577.8F71609192o3629Q2473m56237m35715n62668m22973m72641k1439J37100n55267
2587.4F68838196j14212j46027J31989m9973k66571k56271j117935p36313l75290k31552
2597.1F65676041j57624j10855M425R2163J09864o34079o43082p59430p68967m98504
2606.7F62309952k51923J37787l72009l54767j59760p4157k41471o09893o50712o47430
2616.4F59085617j61209l91769m42429p6141q8425L7689j45492l70865o88477q54797
$$ plain form
2548.9 680853271 680169525 679704819 679384766 679477158 679291306 679299240 679013519 678679199 678673477 678245926
2558.5 678245926 677886124 677278671 676702347 675985870 675469742 675298538 675198669 675488510 675489273 675335159
2568.1 675335159 674735107 674238815 673777847 673189392 673096161 672965393 672835083 672194748 671755600 671609192
2577.8 671609192 671545563 671628036 671171799 670736084 670173416 669750443 669277802 669256363 669393463 668838196
2587.4 668838196 668723984 668577957 668709946 668659973 668393402 668137131 667019196 666282883 665907593 665676041
2597.1 665676041 665518417 665407562 665411987 665504150 665614014 664979935 664336853 663577423 662808456 662309952
2606.7 662309952 662058029 662195816 661823807 661469040 661309280 661235123 660993652 660383759 659733047 659085617
2616.4 659085617 658924408 658532639 658090210 658014069 657925644 657963333 657817841 657446976 656758499 655903702
2626F55903702p40967o65970p27386k16751M86831J83106o9733m35944r88998o65894
2635.6F52061996k40097n16204m66309m94843o68487K44217J99127n11932l09525j90353
2645.3F49107590k16370k65427o80770j035691q01086o29196m6616K09198m09927m53797
2654.9F44777908j00403J81199k53983o34918o80390o67038m66766m73328j24969J22681
2664.6F41679993M9133j99509o0806m26331j026840l96385l54271k81257j11580j01242
2674.2F38770905p3548l35541l9177j6975j51634p17240p28988l73078m05845J32408
2683.9F36061287k32468m80118m38156l79791l2158k75726m31671l65906j74561l01246
2693.5F32949486j26038l01018p27691k09351j61705m24232k31400K36321j55411n26810
$$ plain form
2626 655903702 655162735 654496765 653769379 653552628 654039459 654222565 654152832 653716888 652727890 652061996
2635.6 652061996 651821899 651305695 650839386 650344543 649676056 649920273 650119400 649607468 649297943 649107590
2645.3 649107590 648891220 648625793 647945023 646909332 646108246 645479050 645432434 645641632 645231705 644777908
2654.9 644777908 644677505 644858704 644604721 643969803 643289413 642622375 642155609 641682281 641557312 641679993
2664.6 641679993 641729126 641529617 641468811 641042480 640015640 639619255 639264984 638983727 638872147 638770905
2674.2 638770905 638697357 638361816 638322639 638305664 638154030 637436790 636707802 636334724 635928879 636061287
2683.9 636061287 635828819 635348701 634910545 634530754 634498596 634222870 633791199 633425293 633250732 632949486
2693.5 632949486 632823448 632522430 631794739 631585388 631423683 630999451 630768051 631004372 630848961 630322151
2703.1F30322151n83305o51055N9205r4948k60086k77367l50609k24609m44641j65787
2712.8F27328949k14729j60675k24343l06320j831j28975k33116n47524k50396l7461
2722.4F25223579m25071l05672m4327k59170n57061j92222j28098J00937k098p16019
2732.1F22694778l81164j31912j68419n2986j08223l21923m78859j13830J01585j76582
2741.7F20862465j91650j72463p3204K17323k61993l78838l34663m41246N8975r1667
2751.4F19193039j78757j57738k88505j62354k42538m39072l65600j6365j98403l4904
2761F17108803O2294k46010m01268o68602m51012j51558K29683k23083m04511m7226
2770.7F14807510n08384k83470l47100j69983K1401m90875m65966l81775o6528j88675
$$ plain form
2703.1 630322151 629738846 629087791 629146996 629052048 628791962 628514595 628163986 627939377 627494736 627328949
2712.8 627328949 627114220 626953545 626729202 626422882 626421051 626292076 626058960 625511436 625261040 625223579
2722.4 625223579 624798508 624492836 624448509 624189339 623632278 623440056 623311958 623412895 623410797 622694778
2732.1 622694778 622313614 622181702 622013283 621960297 621852074 621530151 621051292 620937462 621039047 620862465
2741.7 620862465 620670815 620498352 620425148 620642471 620380478 620001640 619666977 619225731 619284706 619193039
2751.4 619193039 619014282 618856544 618568039 618405685 618163147 617724075 617358475 617342110 617143707 617108803
2761 617108803 617171097 616925087 616523819 615855217 615404205 615252647 615482330 615259247 614854736 614807510
2770.7 614807510 614299126 614015656 613668556 613498573 613519974 613029099 612563133 612181358 612114830 611926155
2780.3F11926155l73688m47044n05905l75290l62434j93940n03082k34528Q2131l83568
2789.9F08628807m85191m10652o48423p64198l50723k70767j39046m18205q60939n10598
2799.6F03770065l97148m87671q17604o14776k47155m08020n10788m52003k28653l73917
2809.2E99232330m45594o87790p52755n72967o78864o57119r19152p00569l58429l40538
2818.9E93118553j69067k70920o85196r82284q72155o39305m43268o88209p76520q29201
2828.5E86762428q98170p96318q01697j32904n27000j325150j087914p38792o74438
2837.2E79780045j211701j147880j267510j435280j211090j461029j487427j549759
2844.9E69008369j631546j775627j890259j866111j660996j814117j862068q53463
$$ plain form
2780.3 611926155 611552467 611105423 610599518 610224228 609861794 609667854 609164772 608930244 609012375 608628807
2789.9 608628807 608143616 607732964 607084541 606320343 605969620 605698853 605559807 605141602 604280663 603770065
2799.6 603770065 603372917 602885246 602067642 601452866 601205711 600797691 600286903 599834900 599606247 599232330
2809.2 599232330 598786736 598098946 597346191 596773224 596094360 595437241 594518089 593817520 593459091 593118553
2818.9 593118553 592949486 592678566 591993370 591011086 590138931 589499626 589056358 588368149 587591629 586762428
2828.5 586762428 585864258 585067940 584266243 584133339 583606339 582281189 581193275 580454483 579780045
2837.2 579780045 578568344 577420464 576152954 574717674 573506584 572045555 570558128 569008369
2844.9 569008369 567376823 565601196 563710937 561844826 560183830 558369713 556507645 555654182
2852.6E55654182m96978k29149j90163o28776r2965K81296j72844l91082q2779j76354
2862.3E53474388K1515P4768l51677p16400j180267q46749j027488j071206m65507
2870.9E47911377m20380j93634k91595n95894n48325l71551m40025o16951r06067p04384
2880.6E42822571l07694p05948o12182n50804k94190l28026r23690o90003j052322
2889.3E37357712j361923j176110r44061r26704p20902N8746j19438p51457j343574
2897.9E30072289j213990p51190n79491m79698m95910l64953p35511m15230l44391
2906.6E24691925r46121j168709r21326n49011j416092j025009r27429j567879j041298
2915.3E15129051j517372j136169p75719j272087j063538j106109j027871p36312m20380
$$ plain form
2852.6 555654182 555157204 554928055 554737892 554109116 554016151 554297447 554124603 553733521 553650742 553474388
2862.3 553474388 553495903 553570671 553218994 552502594 551322327 550475578 549448090 548376884 547911377
2870.9 547911377 547490997 547297363 547005768 546409874 545861549 545489998 545049973 544433022 543526955 542822571
2880.6 542822571 542514877 541808929 541196747 540645943 540351753 540023727 539100037 538410034 537357712
2889.3 537357712 535995789 534819679 533875618 532948914 532228012 532286758 532167320 531415863 530072289
2897.9 530072289 528858299 528107109 527527618 527047920 526552010 526187057 525451546 525036316 524691925
2906.6 524691925 523745804 522577095 521655769 521106758 519690666 518665657 517738228 516170349 515129051
2915.3 515129051 513611679 512475510 511699791 510427704 509364166 508258057 507230186 506493874 506073494
2924E06073494j25351j78719k36854J87302L22494N28832J44271n28640K11639L36380
2933.6E06734848M31786M10156L17077P74689M81186O60286P34329Q39310M72641j05438
2943.3E11750870N12886P21245Q47816O07452L61367N06363M45137N63507O26487N53246
2952.9E17496376N1155J8234M02794K59133r1935J49384L95775N12237J210366P78312
2962.6E21181831O2333K16903N53246O05430M77372N59883L61862P28378P46422M82445
2972.2E25976105P00836Q40073N51948k38953M19312P48978K21023K75269L62358P18345
2981.8E30575294M96903L42483R9488k54784j64184O0310N22766L06358K7848r651
2991.5E32002831J26876K23732r6702k99568j46065R15l80172n62706o78406l66326
$$ plain form
2924 506073494 505948143 505769424 505532570 505719872 506042366 506571198 506715469 506186829 506398468 506734848
2933.6 506734848 507166634 507576790 507893867 508668556 509149742 509810028 510544357 511383667 511856308 511750870
2943.3 511750870 512263756 512985001 513832817 514440269 514801636 515307999 515753136 516316643 516943130 517496376
2952.9 517496376 517547531 517565765 517968559 518227692 518135757 518285141 518680916 519193153 520403519 521181831
2962.6 521181831 521244164 521461067 522014313 522619743 523097115 523656998 524018860 524747238 525493660 525976105
2972.2 525976105 526676941 527517014 528068962 527830009 528249321 528998299 529219322 529494591 529856949 530575294
2981.8 530575294 531072197 531414680 531514168 531259384 531095200 531155510 531678276 531984634 532012482 532002831
2991.5 532002831 532129707 532353439 532256737 531957169 531811104 531812019 531431847 530869141 530190735 529824409
3001.1E29824409j6746M9057J65672r12056r86862Q0147J449o80198q86650m75388
3010.8E26162834j64604j32408n30510n15022k53029l59803p82775q67539k57683m98008
3020.4E21801453p09458p18918o15539l07541o11420o00090o61010n34020n54886q54873
3030.1E15633698p19719q39158o81686n56526o68678n57404m98924m87213l98407q44651
3039.7E09381332q10012j6365m08783o86036q92829j122437p21359o79665k26326k31438
3049.4E03586082p85255j167374j137275l86925m28276q07839o92443p50428o46248
3058D96784019l38592p88269r59740o24695m59289l40195p09915o17981r05914r81903
3067.7D90057526n03998p45621j94435j96838o72837o92215p98759m78859m39415o53267
$$ plain form
3001.1 529824409 529807663 529856720 530022392 529110336 528123474 528203621 528205070 527524872 526638222 526162834
3010.8 526162834 525998230 525865822 525335312 524820290 524567261 524207458 523424683 522557144 522299461 521801453
3020.4 521801453 521091995 520373077 519757538 519449997 518838577 518238487 517577477 517043457 516488571 515633698
3030.1 515633698 514913979 514074821 513393135 512836609 512167931 511610527 511111603 510624390 510225983 509381332
3039.7 509381332 508571320 508554955 508146172 507460136 506567307 505444870 504723511 504043846 503817520 503586082
3049.4 503586082 502800827 501633453 500496178 500109253 499680977 498873138 498180695 497430267 496784019
3058 496784019 496445427 495657158 494697418 494072723 493613434 493273239 492563324 491945343 491039429 490057526
3067.7 490057526 489553528 488807907 488613472 488416634 487743797 487051582 486252823 485773964 485334549 484681282
3077.3D84681282o00853k03133l89289q46482o48041l38974o05697j012993p70149
3086D79265671r21631m46014M4326o36673o18515k67791n90210j056214m74701n45120
3095.6D73753128q16956j43966m20227m54979m89006o45218o57158q24699p64084o07224
3105.3D67929611k34413o13823m55475l83301j014938q28628p16095m68483n76020
3114D62638435o19621m62837p63054p92809p04422m93812p49092p88155n89905p54623
3123.6D55920105n63545m76952p53822q97522o92673p28683r10874r28001o85082p78350
3133.3D48504601j059494l01018j4611m25567p00989q22105o00014n41153n13802q51745
3142.9D42674103j337776r45969m36325n56603k52609j97296p63130o39229p25899
$$ plain form
3077.3 484681282 484080429 483877296 483488007 482641525 481993484 481654510 481048813 480035820 479265671
3086 479265671 478344040 477898026 477942352 477305679 476687164 476419373 475829163 474772949 474298248 473753128
3095.6 473753128 472936172 472792206 472371979 471917000 471427994 470782776 470125618 469300919 468536835 467929611
3105.3 467929611 467695198 467081375 466625900 466242599 465227661 464399033 463682938 463214455 462638435
3114 462638435 462018814 461555977 460792923 460000114 459295692 458801880 458052788 457264633 456674728 455920105
3123.6 455920105 455356560 454879608 454125786 453228264 452535591 451806908 450896034 449968033 449282951 448504601
3133.3 448504601 447445107 447144089 447129478 446703911 446002922 445180817 444580803 444039650 443525848 442674103
3142.9 442674103 441336327 440390358 439954033 439397430 439144821 438947525 438184395 437545166 436819267
3151.6D36819267q69674q79059q24929o85272r84077p82204m11987l44086q19359j102485
3161.2D29116135o74591o91300q89778q93211n06325n25894r75418p03888m46587p22084
3170.9D22087059n37148m95071j027527p77626r93156q21495j75820p85255q49877
3179.5D15624084p55691n64270n55077n84259m60472j064567p86858n27153n34401
3188.2D09791336p24754p71294l27530p97958r78279r02558q21685q47512p97233n18036
3197.9D02304497o59180n07088n02357k61307j99242p18956j095275m65203J25733
3206.5C98021622j218338j317749n96161o75698n97000o23665r9983l98826r94645
3215.2C91499557o99501o04629m49715j22337n36842j411972j136094k56500r3651
$$ plain form
3151.6 436819267 435949593 435070534 434245605 433560333 432576256 431794052 431382065 431037979 430218620 429116135
3161.2 429116135 428441544 427750244 426860466 425967255 425460930 424935036 423959618 423255730 422809143 422087059
3170.9 422087059 421549911 421054840 420027313 419249687 418256531 417435036 417259216 416473961 415624084
3179.5 415624084 414868393 414304123 413749046 413164787 412704315 411639748 410852890 410325737 409791336
3188.2 409791336 409066582 408295288 407967758 407169800 406191521 405288963 404467278 403619766 402822533 402304497
3197.9 402304497 401645317 401138229 400635872 400374565 400175323 399456367 398361092 397895889 398021622
3206.5 398021622 396803284 395485535 394889374 394213676 393616676 392993011 392893028 392494202 391499557
3215.2 391499557 390800056 390195427 389745712 389623375 389086533 387674561 386538467 386281967 386188316
3223.9C86188316o55250n38368k57416o85578p25708p74002o97708m75998j67351j05895
3233.5C81105042l46375p11517j301461o85615l46909q63609q94051k14462J30577
3242.2C75871620l66211m99077q12645l45382j96572p09190m82178p56569o62727m13437
3251.9C70627632k50587l61710l97453m12979o34804l0327o55136q38547n26466o91529
3261.5C65828094j64032l42216m66537o06041l05329k78015m18281j80054r55200n48935
3271.2C61563454m25568p77931k55089j79443j96762o25649o52428l59726j50909k44637
3280.8C57695312m82368k56233l37143k63291j36642j13983m79698p41234j67313k67219
3290.4C54450188m79966l7841l10936p89833l92533m50134p65572n60951k21596J33515
$$ plain form
3223.9 386188316 385533066 384994698 384737282 384051704 383325996 382551994 381854286 381378288 381210937 381105042
3233.5 381105042 380758667 380047150 378745689 378060074 377713165 376849556 375955505 375741043 375871620
3242.2 375871620 375505409 375006332 374193687 373848305 373651733 372942543 372460365 371703796 371041069 370627632
3251.9 370627632 370377045 370015335 369617882 369204903 368570099 368539772 367884636 367046089 366519623 365828094
3261.5 365828094 365664062 365321846 364855309 364249268 363943939 363665924 363247643 363067589 362112389 361563454
3271.2 361563454 361137886 360359955 360104866 359925423 359728661 359103012 358450584 358090858 357939949 357695312
3280.8 357695312 357212944 356956711 356619568 356356277 356219635 356105652 355625954 354884720 354717407 354450188
3290.4 354450188 353970222 353932381 353621445 352831612 352439079 351988945 351223373 350662422 350440826 350574341
3300.1C50574341l5629j30539m14849p98797p24068m69399r9487k72178n06669o89086
3309.7C46433640m15459j74980n23262m53377o67572q29125n84220k31247j56861o35032
3319.4C41762505r20792n42946j67999p07703l89290m1198p30744r69772j071053m18548
3329C35802460j62812p75642q52356p03239o23093m60167j44424p27997r25102l92724
3338.7C30034904r10949j062851o32248k12402O675p37800j087342n89294k07481j49270
3348.3C24451942p03620p84302o70471o86150q0452k80533m11148m37965q64029o19545
3357.9C18913727l29399l8529m60777o11439l81756m75654N1746j34067n91584k31266
3367.6C15711002J03207n77106r80416l84102L8O7978o55498o58894k10628j72768
$$ plain form
3300.1 350574341 350538712 350408173 349993324 349194527 348470459 348001060 347901573 347629395 347122726 346433640
3309.7 346433640 346018181 345843201 345319939 344866562 344198990 343369865 342785645 342554398 342397537 341762505
3319.4 341762505 340841713 340298767 340130768 339423065 339033775 338992577 338261833 337292061 336221008 335802460
3329 335802460 335639648 334864006 334011650 333308411 332685318 332225151 332080727 331352730 330427628 330034904
3338.7 330034904 329123955 328061104 327428856 327216454 327223129 326485329 325397987 324808693 324601212 324451942
3348.3 324451942 323748322 322964020 322293549 321607399 321526947 321246414 320835266 320397301 319533272 318913727
3357.9 318913727 318584328 318545799 318085022 317473583 317091827 316616173 316667919 316533852 315942268 315711002
3367.6 315711002 315814209 315237103 314256687 313872585 313872623 313940601 313285103 312626209 312415581 312242813
3377.2C12242813l77617j011371j74866J14002n67112k77881p592j28326j73378m1771
3386.9C09596901k76051r1533j50090m49085k85969l64437j04732j38722j31454o4163
3396.5C07540665q7166p8335n18608m96349l95375k83317J16729M62342n0202n39112
3406.2C05671272K50244L12119k38686k02312k9888j8730K50129J75286l71037j00822
3415.8C05697575N2852p0457L5648M54636l0594p87811L54156L40824j57165K60925
3425.5C06150589M92172O27156p2537K71816P60079m50821n68505L75481L81813k65121
3435.1C07702122p6790O33564M82597M49238K54479N0868Q25882P12529L53012j068
3444.7C11386433l9044P29218J2092L04814O57634L03479P71999P55901P69329J45894
$$ plain form
3377.2 312242813 311865196 310853825 310678959 310792961 310225849 309947968 309940376 309812050 309638672 309596901
3386.9 309596901 309320850 309229317 309079227 308630142 308344173 307979736 307875004 307736282 307604828 307540665
3396.5 307540665 307453499 307375164 306856556 306360207 305964832 305681515 305798244 306260586 306210384 305671272
3406.2 305671272 305921516 306233635 305994949 305792637 305762749 305744019 305994148 306169434 305798397 305697575
3415.8 305697575 305750427 305679970 305715618 306170254 306139660 305351849 305706005 306046829 305889664 306150589
3425.5 306150589 306642761 307269917 307197380 307469196 308229275 307778454 307209949 307585430 307967243 307702122
3435.1 307702122 307625332 308258896 308741493 309190731 309445210 309496078 310321960 311034489 311387501 311386433
3444.7 311386433 311347389 312076607 312088699 312393513 313051147 313354626 314126625 314882526 315651855 315797749
3454.4C15797749N9642M00486L69034J137066Q20408J04065K51770P18098N82695M87289
3464C20728302P53517O17142P42645N18570O72035N02930j6861M66118P41997R18960
3473.7C26645355P48520N32036Q07266P62520M29115R19915J307296Q28705M75464
3482.3C33456192J61629J291771J315117K54592N68772K00424O43997J404190R93805
3491C40290489M73290N76515J079483J296272J483536R59587L51219L14217P19719
3499.7C47544327N44319N41878J327552P19300L86467O60171R90143J134415J362571
3508.4C55211143R41430m6654J312752J503753R36089P91016R91134J044884M14543
3517.1C63100090J294022R78508N80864J183891J109199N06859L04032J494445R99527
$$ plain form
3454.4 315797749 315857391 316257877 316626911 317763977 318584385 318688450 318940220 319658318 320241013 320728302
3464 320728302 321481819 322098961 322841606 323360176 324032211 324535141 324518280 324984398 325726395 326645355
3473.7 326645355 327393875 327925911 328733177 329495697 329924812 330844727 332152023 332980728 333456192
3482.3 333456192 333617821 334909592 336224709 336479301 337048073 337248497 337892494 339296684 340290489
3491 340290489 340763779 341340294 342419777 343716049 345199585 346159172 346510391 346824608 347544327
3499.7 347544327 348088646 348630524 349958076 350677376 351063843 351724014 352714157 353848572 355211143
3508.4 355211143 356152573 356105919 357418671 358922424 359858513 360649529 361640663 362685547 363100090
3517.1 363100090 364394112 365372620 365953484 367137375 368246574 368753433 369057465 370551910 371551437
3525.7C71551437J190339J393547R51423J014061O88896R54705O56929J194420J256294
3534.4C80852051J644897J420594K55165J675491J532478J267510P96776J027984J418381
3543.1C91891327M42886J030464J160050J653137K06032J245232K540893J661835K129020
3551.8D03960876J67809J163864J528359J379356K172699R91478K090149J333427O64711
3560.5D15452728J098976J788102J612053J315917M008484M38195j92185J442261L65601
3569.1D27330132L548927J982384J503677J960525J758233J587448J643753K127685
3576.9D43442764J090431J879807J283722J744842K664032K138825J684532M71649
3584.6D56400604L080368J840592K6817L224678N15862K161064K620506L046265J711921
$$ plain form
3525.7 371551437 372741776 374135323 375086746 376100807 376789703 377744408 378401337 379595757 380852051
3534.4 380852051 382496948 383917542 384172707 385848198 387380676 388648186 389444962 390472946 391891327
3543.1 391891327 392334213 393364677 394524727 396177864 396383896 397629128 400170021 401831856 403960876
3551.8 403960876 404128685 405292549 406820908 408200264 410372963 411364441 413454590 414788017 415452728
3560.5 415452728 416551704 418339806 419951859 421267776 425276260 425714455 425522270 426964531 427330132
3569.1 427330132 430879059 432861443 434365120 436325645 438083878 439671326 441315079 443442764
3576.9 443442764 444533195 446413002 447696724 449441566 452105598 454244423 455928955 456400604
3584.6 456400604 459480972 461321564 461348381 464573059 465088921 467249985 469870491 472916756 474628677
3593.2D74628677J28708K581711K83279K835656L778648J332245L000107J028061R24759
3601.9D90521851K808342K491569K332230K738762K625541j50528L364373Q47282J72157
3610.6E07751579P405930K471046j050186M111939n54734K794037L539505L28369K725144
3619.3E29522629J496429J901703L181725K795677K659378L248100K980995K611733
3627E50398369N463486K53868q173790M996528N668679N329971K375259p21435K350082
3635.7E67941017L605004L412361J723785J824532K811966K182083J451378J844215
3643.4E86796341L066978L511506N198326P18040l413963M205131J221810j282540
3651.1F00021629J455002N654221M360351L649597M491196n818672K500114N300332
$$ plain form
3593.2 474628677 474757385 477339096 477622375 480458031 484236679 485568924 488569031 489597092 490521851
3601.9 490521851 493330193 495821762 498153992 500892754 503518295 503367767 506732140 507579422 507751579
3610.6 507751579 515157509 517628555 516578369 520690308 520135574 522929611 526469116 526797485 529522629
3619.3 529522629 531019058 532920761 536102486 538898163 541557541 544805641 547786636 550398369
3627 550398369 555861855 556115723 547941933 552938461 558607140 563937111 566312370 565590935 567941017
3635.7 567941017 571546021 574958382 576682167 578506699 581318665 583500748 584952126 586796341
3643.4 586796341 589863319 593374825 598573151 599291191 595877228 600082359 601304169 600021629
3651.1 600021629 601476631 607130852 611491203 615140800 619631996 613813324 616313438 621613770
3658.8F21613770J392593J499443Q28018K599716J510926J867714K470741J131286
3666.5F34914207M343300J832810q69141K59857n535392L609619P822685P845535j710586
3675.2F52512894j5100441M712715P793655M579087k113648k17590K480697J988907
3682.9F56636276J337738L02887Q39463M694137P088776p517319l393173O904297n600891
3691.6F61292191k89612L978119L07541K150955R92431N7907J837159J93863J820755
3700.3F72341309L285675m360810j942215L989258J287918N26428Q97370K636947K708970
3709F81370850q092118L305893N037308j1351776M558716M989471L70560O637J351395
3717.7F81546936J414108l018112N71442N364151l333130l749924M797745K38419j054535
$$ plain form
3658.8 621613770 623006363 624505806 625333824 627933540 629444466 631312180 633782921 634914207
3666.5 634914207 639257507 641090317 640221176 640481033 634945641 638555260 646377945 654223480 652512894
3675.2 652512894 637412453 642125168 649918823 654497910 652384262 652166672 654647369 656636276
3682.9 656636276 657974014 658276901 659116364 663810501 670899277 663381958 659988785 666893082 661292191
3691.6 661292191 661002579 664980698 665288239 667439194 668431625 668489532 670326691 670520554 672341309
3700.3 672341309 675626984 671266174 669323959 673313217 674601135 675127563 676024933 678661880 681370850
3709 681370850 673278732 676584625 681621933 670270157 674828873 679818344 680188904 680195541 681546936
3717.7 681546936 682961044 679942932 680514374 685878525 682545395 678795471 683593216 683831635 682777100
3726.3F82777100j696701M43344L310165J339798M975281l071900o828765P337646
3734F88585968r85641q515320J116180L260498J865769L078689L020172m326248J710358
3742.7F88810425R736862r436417j2821808R670792M875336M032364l417816r100800
3750.4F82348938R067535m964065m592667N935593L885574K823410m891662J748962
3758.2F91361618M872131p225036j133423L758926J442185P88879L563156k714843
3765.9F94713593n470810L330001M815903L59650q210526O75049K748337O14929R42612
3774.5F94518738k88620J076126J73187K349777J204682p054062J640701J798706J067887
3783.2F96487122J896591l344193o43463J206284R52377J014786m84314k07672m58
$$ plain form
3726.3 682777100 681080399 681523743 684833908 686173706 691148987 688077087 681248322 688585968
3734 688585968 687600327 679085007 680201187 683461685 685327454 688406143 691426315 687100067 688810425
3742.7 688810425 698547287 689110870 676289062 685959854 690835190 694867554 691449738 682348938
3750.4 682348938 691416473 686452408 681859741 687795334 691680908 694504318 689612656 691361618
3758.2 691361618 696233749 689008713 687875290 691634216 693076401 693865280 697428436 694713593
3765.9 694713593 689242783 692572784 697388687 697748337 689537811 690212860 692961197 693576126 694518738
3774.5 694518738 694230118 695306244 695479431 697829208 699033890 691979828 693620529 695419235 696487122
3783.2 696487122 698383713 695039520 694396057 695602341 696554718 697569504 697085190 696877518 696877060
3791.9F96877060N62591p74459O97174L396225k791901l461456J665115M221802N797195
3800.6G06189346p652893r730911M166870L256531M032974L652115r111862l255768
3808.3F91546402M633713J994171L60794O48117j67236N81588N094986n77240j2710189
3817F91405106L929596M630050L821259J372452j5637513K652817N167923J943283
3824.7F99284973K546463p03888m671631M10233J934051K863465J637192p302704K258682
3833.4F98256836O108246n237046q12835N331116q971711k357483P768784l451843
3841.1F96634064P58743O068420k731857l461380J915436O08978L72925J928177j171417
3849.8G00922089J522903N534744n395431r01566j3377304K729950R454727j023407
$$ plain form
3791.9 696877060 697439651 696665192 697362366 700758591 697966690 694505234 696170349 700392151 706189346
3800.6 706189346 698536453 688805542 692972412 696228943 700261917 703914032 694802170 691546402
3808.3 691546402 696180115 698174286 698535080 699183197 699015961 699597549 704692535 704115295 691405106
3817 691405106 695334702 699964752 703786011 705158463 689520950 692173767 697341690 699284973
3824.7 699284973 701831436 701127548 696455917 696866150 698800201 701663666 703300858 695998154 698256836
3833.4 698256836 704365082 699128036 698315201 703646317 694674606 692317123 700085907 696634064
3841.1 696634064 697392807 703461227 700729370 697267990 699183426 699792404 700165329 702093506 700922089
3849.8 700922089 702444992 707979736 702584305 701682739 688305435 691035385 700490112 699466705
3857.5F99466705j160659J955413K173386K424393n457459n06744N445633n528565
3865.2F98812103m204025M177170M660873M599915r707947q242645N309219N636978
3872.9G01041641K148361q192138J434784L879547P58896K420730K909546o120605
3880.6G00280762o412430N948791J864396R04769L635025j1691665J579056M313202
3888.3G00421906P73315L198547j414184p307205J022491L287811p90939N22079M71650
3897G00185471K023468K356414p632217M053268J285401l786392M970550l914642k907791
3905.7F96633530K670J145401K140655J03608L62930o07300L28598K17514o09283J440582
3915.3G01158905J704254l573379l272934L681411L89710k711334J563720J459351
$$ plain form
3857.5 699466705 698306046 700261459 702434845 704859238 699401779 698895035 704340668 698812103
3865.2 698812103 694608078 698785248 703446121 708046036 698338089 690095444 695404663 701041641
3872.9 701041641 703190002 694997864 696432648 700312195 701071091 703491821 706401367 700280762
3880.6 700280762 693868332 699817123 701681519 702586288 706221313 694529648 696108704 700421906
3888.3 700421906 701195221 704393768 702979584 695672379 696694870 699982681 699191742 699713821 700185471
3897 700185471 702208939 704565353 696933136 700986404 702271805 698485413 703455963 699541321 696633530
3905.7 696633530 696636200 697781601 699922256 700025864 700388794 699781494 700110092 700327606 699718323 701158905
3915.3 701158905 702863159 699289780 696016846 699698257 700087967 697376633 698940353 700399704
3923.1G00399704J361771j950226k715836J269684J698990J272049j560974p78809
3930.8F98996353J869049j906662q34884J644897k69394m69894O0577K08054Q1024
3939.5F99379120o46820J158523J152115l449554o92444J311569Q56629J120910j876678
3948.1F98313370K32010M36401j583252J546860O9275m69818R82208N63660k10343
3956.8F99880371r99985n1956m14276L38593J34964j296921Q9264J54800L06320N7373
3966.5F98198547k13623P22885k73132p52029Q47397M25949o33469K25067K40784l76206
3976.1F98412170n64117N38254O93817q13446K0141R77860k0752l74374M50668k22244
3985.7F99097977o80542l6927q8119N68771o8969n47028J2817K06223N44586j85623
$$ plain form
3923.1 700399704 701761475 699811249 697095413 698365097 700064087 701336136 699775162 698996353
3930.8 698996353 700865402 698958740 698123856 699768753 699499359 699029465 699090042 699298096 699379120
3939.5 699379120 698732300 699890823 701042938 697593384 696900940 698212509 699069138 700190048 698313370
3948.1 698313370 698545380 698981781 697398529 698945389 699014664 698544846 699527054 700090714 699880371
3956.8 699880371 698880386 698828430 698414154 698752747 698887711 697590790 697680054 697834854 698141174 698198547
3966.5 698198547 697984924 698707809 698434677 697682648 698530045 698955994 698322525 698547592 698788376 698412170
3976.1 698412170 697848053 698386307 699080124 698266678 698286819 699264679 699243927 698869553 699320221 699097977
3985.7 699097977 698417435 698380508 698292389 698861160 698792191 698245163 698257980 698464203 699008789 698823166
3995.4F98823166k21710K6016j48850j57165Q9188
4000.2F98410645
$$ plain form
3995.4 698823166 698601456 698627472 698478622 698321457 698410645
4000.2 698410645
##END=$$ End of the data block
