##TITLE=$$ Begin of the data block
##JCAMP-DX=5.00 $$ ACD/SpecManager v 10.08
##SPECTROMETER/DATA SYSTEM=Varian
##DATE=08 Jan 2013 16:09:54
##DATA TYPE=INFRARED SPECTRUM
##DATA CLASS=XYDATA
##ORIGIN=
##OWNER=
##NPOINTS=3735
##FIRSTX=399.26403809
##LASTX=4000.35498047
##MAXX=4000.35498047
##MINX=399.26403809
##MAXY=74.88572693
##MINY=30.49993324
##XFACTOR=1.0000000000
##YFACTOR=0.000000100000000
##FIRSTY=48.87686539
##DELTAX=0.96440572
##XUNITS=1/CM
##YUNITS=TRANSMITTANCE
##XYDATA=(X++(Y..Y))
399.3D88768654Q862228J3637352k644348j2352524M557038J2674408K460060o931114
407E09031754p715073k30103k728347o37284M989472L847351J396293l355827J247177
415.7E05845413K254105n844422j1689987J2762070Q329773n577774o493950o882973
423.4D92702255J458969N161744J278419L497200M433975Q08220k201118m450569k510300
432.1E00178795K372475R1400l670731q5983K745857J494446j347389j499405j058159
440.7D99221306J442756O893578K25792m646835j748123K061347J629525q91991j732178
449.4E02455177m941978J990013N299301n742721l210526K069130K37274k06451j399727
458.1D96549492N0659J640511j815186M0550L053551o61659m03748l785858l314514
$$ plain form
399.3 488768654 497630882 511268234 508623886 496271362 500828400 513502808 515962868 509031754
407 509031754 501316681 501086578 498358231 497720947 502710419 506557770 507954063 504598236 505845413
415.7 505845413 508099518 502255096 490565109 503327179 511656952 506079178 499585228 492702255
423.4 492702255 494161224 499322968 500601387 504098587 508532562 509340782 507139664 502689095 500178795
432.1 500178795 502551270 502642670 498971939 498885956 501631813 503126259 501778870 500279465 499221306
440.7 499221306 500664062 507557640 507783432 503136597 501388474 503449821 505079346 504187355 502455177
449.4 502455177 497513199 499503212 504802513 499059792 495849266 497918396 498155670 497949219 496549492
458.1 496549492 496600151 498240662 496425476 496466026 499519577 498857918 498454170 494668312 491353798
466.8D91353798L512154J400222k291145j529732j495933k994499N802841M163513
474.5D97921219j818810L193665K877808l106843m861221k868728P78617K96364p43332
483.2D91668739j354522l2044q01124k429505k709122l53317O124153L009262j916847
491.8D91205673j767578m034157k362022K856407L128471N3711R08165K570458k67792
500.5D92291336k524414j673470j553192p04231L71132r86214r06524q69103k79083
509.2D83166237o69365p65038K214089L23868o39305j901818k246055Q6059j816330
517.9D77752342K195015J243477m498215k199287l53127J505280J046753J13106J202545
526.6D78007889n50308j783829j651344j074524K80304J770401L14407j744347l59001
$$ plain form
466.8 491353798 494865952 496266174 493975029 492445297 490949364 487954865 493757706 497921219
474.5 497921219 496102409 499296074 502173882 499067039 494205818 491337090 492115707 492412071 491668739
483.2 491668739 490314217 490282173 489481049 487051544 484342422 483989105 490113258 493122520 491205673
491.8 491205673 489438095 485403938 483041916 485898323 489026794 489080505 489988670 492559128 492291336
500.5 492291336 489766922 488093452 486540260 485836029 486207161 485220947 484314423 483445320 483166237
509.2 483166237 482496872 481731834 483945923 484269791 483630486 481728668 479482613 479568672 477752342
517.9 477752342 479947357 481190834 476692619 474493332 474140205 475645485 476692238 476805344 478007889
526.6 478007889 477457581 475673752 474022408 472947884 473228188 474998589 475312996 473568649 473209648
535.2D73209648J001625n16739j438179m20723Q86269M05960j474228q13827k30866
543.9D70608940j593590j010055J313133P49474j435471n23796J11046n71785l1052
552.6D67616844O80809p44171j001930J597938j65786j920319j102600j282082j087722
561.3D62590981K13089K122802j97143l48206J830902J66550j66550J235924J530609
570D68978958l18985k049599k001457p88078L72200k47994J50452P51114m92134j421127
579.6D62933350N89485J279411j108322j653404o01387J451721J192627M64821J056099
588.3D65604401N88951P79457P29904m65469k20032L69606l17650j488L5553j79138
597.9D66924095N70450Q00133Q75435p36733j356277o74935k68898o86531j859588
$$ plain form
535.2 473209648 474211273 473694534 472256355 471835632 472721901 473127861 471653633 470839806 470608940
543.9 470608940 469015350 468005295 469318428 470067902 468632431 468108635 468219681 467647896 467616844
552.6 467616844 468297653 467553482 466551552 468149490 467983704 466063385 464960785 463678703 462590981
561.3 462590981 462804070 464926872 464729729 464381523 466212425 466378975 466212425 467448349 468978958
570 468978958 468659973 466610374 464608917 463820839 464193039 463945045 464095497 464846611 464354477 462933350
579.6 462933350 463522835 464802246 463693924 462040520 461439133 462890854 464083481 464548302 465604401
588.3 465604401 466193352 466972809 467702713 467237244 467017212 467386818 467069168 467067680 467103233 466924095
597.9 466924095 467494545 468294678 469170113 468433380 467077103 466402168 466133270 465446739 463587151
606.6D63587151n1423N22881l50647n15556l84026M76799m06265L1853K06451o78215
616.3D62439003j072617o34956J385536R85375K25372J108627J945153M4136j049843
624.9D65375786J637153J432457l3111J240845K560730J141243P19261J637649O44036
633.6D76356049Q95462J988296Q34847j228409j147232J176109L390732K556724N91469
642.3D85414047J775398J896859K41508l54042j81465O80962M33235J32599J208229
651D91247330J060562N64575J719551J330261j09214k42958r19228j669388p54433
659.7D92227058J12496j77956J0147Q36525N21889L03268R74617j34849n228081J650581
669.3D91095695K275429K052765O59256k13508K166061K023010N26047M32930L16505
$$ plain form
606.6 463587151 463535728 464058609 463707962 463192406 462808380 463285179 462878914 462910767 463117218 462439003
616.3 462439003 461366386 460731430 462116966 463102341 463327713 464436340 466381493 466425629 465375786
624.9 465375786 467012939 468445396 468412285 469653130 472213860 473355103 474074364 475712013 476356049
633.6 476356049 477251511 479239807 480074654 478846245 477699013 478875122 482265854 484822578 485414047
642.3 485414047 487189445 489086304 489327812 488973770 488792305 489473267 489906502 490039101 491247330
651 491247330 492307892 492872467 494592018 495922279 495813065 495570107 494650879 492981491 492227058
659.7 492227058 492339554 492161598 492171745 493008270 493530159 493833427 494808044 494673195 489445114 491095695
669.3 491095695 493371124 495423889 496083145 495869637 498035698 500058708 500584755 501017685 501334190
678E01334190Q74367K64588k19079J271401K363815J452141P86133K088547J906395
686.7E12122498o58493r87969J436615J625748J48315q621K2163O84777J532669J028709
696.3E16946411R16939N56030p48596r99908L85437J332435L97797Q81004J703034
705E21370583J318969J157189q8578K67449R67865J43547l60375n55648P93838J064606
714.6E26079445N46837J505432J314125M45900O19087L23715l96957K87208N54276
723.3E31279068N27382Q22258J154938J497001J038666R17168Q00514Q23021L11355
732E39171371j8043R70650J031227J249580J415939P72057Q5297k26784p13844p70264
741.6E42967186K16141J72767Q49877J835403J179505L45611R47609J328011o08979
$$ plain form
678 501334190 502208557 502473145 502254066 503525467 505889282 507341423 508127556 510216103 512122498
686.7 512122498 511464005 510476036 511912651 513538399 513686714 513678093 513700256 514385033 515917702 516946411
696.3 516946411 517863350 518419380 517670784 516670876 517056313 518388748 518786545 519667549 521370583
705 521370583 522689552 523846741 523758163 524025612 524993477 525137024 524776649 524221001 525014839 526079445
714.6 526079445 526626282 528131714 529445839 529891739 530510826 530834541 530437584 530724792 531279068
723.3 531279068 531806450 532628708 533783646 535280647 536319313 537236481 538036995 538860016 539171371
732 539171371 539153328 540123978 541155205 542404785 543820724 544592781 544678078 544451294 543737450 542967186
741.6 542967186 543183327 543356094 544205971 546041374 547220879 547566490 548514099 549842110 549233131
750.3E49233131l62167J571312J083908k1286Q15849J392365P58285J078225J098022
759E56647644O83975r8610O24428J354561N20325J092491O47850N21355Q58345P55958
768.6E63608322M75311n49430K93388M95796j81236m93431m83704P21436J341438q0109
778.3E65147781j071167K74163O50940P59697L91273q07266m47579k65770K8916J001091
787.9E65662079J278801N97877P99790K98118j103630n55381p4654J4877m68674o89239
797.6E65759964K55089Q85429L32337K1972K99530q71391j473007k252846k682152
806.2E60274925j993828r80339K38228n95169p47185n99289j280021j241608j345100
814.9E51730614j966248j688766k19803k31247O19850J667480Q96874O83517P90139
$$ plain form
750.3 549233131 548870964 550442276 551526184 551504898 552320747 553713112 554471397 555549622 556647644
759 556647644 557331619 557233009 557857437 559211998 559732323 560824814 561472664 561994019 562852364 563608322
768.6 563608322 564083633 563534203 563827591 564323387 564142151 563648720 563165016 563886452 565227890 565147781
778.3 565147781 564076614 564350777 565001717 565761414 566152687 565345421 564897842 564632072 564660988 565662079
787.9 565662079 566940880 567538757 568338547 568636665 567533035 566977654 566903000 566917877 566449203 565759964
797.6 565759964 566015053 566900482 567232819 567254791 567554321 566682930 565209923 562957077 560274925
806.2 560274925 558281097 557300758 557538986 556943817 556196632 555597343 554317322 553075714 551730614
814.9 551730614 549764366 548075600 547855797 547624550 548244400 549911880 550808754 551492271 552282410
823.6E52282410J709327K011338J508560J243095J185684J993142L061103L450776
831.3E68445435L327331M236145L342476J260338M60892L99932O33011Q15201J889534
840E84810295R86252J336365K652359K605591K616653J146202O78139j14327J88675
848.7E96906204M20914k37160N81055J380195K953988K616615J339302O80771J690712
857.4F08332596J220169p26318M63829O27021J165696J076927O89468K12135J57433
866F13218956J029243l69567k78664j581268j835328k004470k931710r61723j87149
874.7F04098320M98772j28670L24287N69497m00429q11997j582641m66118q02727q77075
884.4F00421219r41391j37749P19452Q240K1477r42269L04985l66821j505318q75206
$$ plain form
823.6 552282410 553991737 556003075 557511635 558754730 559940414 561933556 564994659 568445435
831.3 568445435 571772766 576008911 579351387 580611725 581072617 581472549 582105560 582920761 584810295
840 584810295 585796547 587132912 589785271 592390862 595007515 596153717 596831856 596717529 596906204
848.7 596906204 597327118 597089958 597671013 599051208 602005196 604621811 605961113 606641884 608332596
857.4 608332596 609552765 608826447 609290276 609917297 611082993 612159920 612849388 613061523 613218956
866 613218956 614248199 613878632 613599968 612018700 610183372 608178902 605247192 604285469 604098320
874.7 604098320 604597092 604468422 604792709 605362206 604961777 604149780 602567139 602101021 601298294 600421219
884.4 600421219 599479828 599342079 600061531 600069771 600091248 599148979 599453964 599087143 597581825 596706619
894E96706619k94113Q43659k43340M57459L10859l54233n60340j243096p53593p70760
903.7E94099121M56543O88820J607056K169151J971550J692085J86501O54640k58904
912.3F03266563j13525m11186r46236m08592j389732r30520j704788j659469j739502
921E93963013k059212j661606k650833k712708k819747k158089k151680k823067l449364
929.7E71476707l060569j289902j512413j703796j509743j428833r40170m04282q33473
938.4E58793526j180954n00908q35991q60787j432914p22542L68538q32596p29256
947.1E52066116j35727K38839J88064r689k937M72106k01072k331505j335106p87468
956.7E48161621j650467j553955j336670j512337k301445k669448k532502j209602
$$ plain form
894 596706619 596412506 597256165 597012825 597470284 597781143 597426910 596866570 595623474 594869881 594099121
903.7 594099121 594555664 595244484 596851540 599020691 600992241 602684326 602870827 603525467 603266563
912.3 603266563 603153038 602741852 601795616 601387024 599997292 599066772 597361984 595702515 593963013
921 593963013 591903801 590242195 587591362 584878654 582058907 579900818 577749138 574926071 571476707
929.7 571476707 568416138 567126236 565613823 563910027 562400284 560971451 560031281 559626999 558793526
938.4 558793526 557612572 557111664 556275673 555414886 553981972 553259430 553627968 552795372 552066116
947.1 552066116 551930389 552169228 552357292 552347603 552344666 552816772 552615700 550284195 548949089 548161621
956.7 548161621 546511154 544957199 543620529 542108192 539806747 537137299 534604797 533395195
964.4E33395195j332207j937408j331024j388779q61473j439400k369575k097359k093544
973.1E18544426k302780k624436k897873l206634l270569l113708l531380l659287
980.8D93937759l048668l928298m809952m320297m390831m587746m092827l575439
988.5D61183701l379822l218804l367424l166656k931862k776146k553673k479782
996.2D37309532k370415k271919k295837k782555k561111k287560k032013j906585
1004D18801537j633187j481056k284927j751061j809921j514549j284333j767120j563416
1012.6D03711967k077064j763496j885682q92906j382904k913704j904716k194138
1020.3C88697357k336235k847595k139587j477433j642914j253013j477089o23169
$$ plain form
964.4 533395195 532062988 530125580 528794556 527405777 526544304 525104904 522735329 520637970 518544426
973.1 518544426 516241646 513617210 510719337 507512703 504242134 501128426 497597046 493937759
980.8 493937759 490889091 486960793 482150841 477830544 473439713 468851967 464759140 461183701
988.5 461183701 457803879 454585075 451217651 448050995 445119133 442342987 439789314 437309532
996.2 437309532 434939117 432667198 430371361 427588806 425027695 422740135 420708122 418801537
1004 418801537 417168350 415687294 413402367 411651306 409841385 408326836 407042503 405275383 403711967
1012.6 403711967 401634903 399871407 397985725 397092819 395709915 392796211 390891495 388697357
1020.3 388697357 386361122 383513527 381373940 379896507 378253593 377000580 375523491 374900322
1028.1C74900322j282806j034623j188964j024895k37160j191673k33193K03057J276970
1036.7C70187035J438484J258621J601219J557236J705551P39365R87510k77824l26500
1045.4C78870697M63829l04146r61151j898308q90884j261330j705780j973037j558342
1054.1C68781548m77677q83865q02956j462402K32429Q28972J056709K506524K312202
1062.8C72091484J630287J016770J890640J590614K716561K451706Q69903Q20389Q38280
1071.5C85916634J997146O42052O34270P09266K3537N86204P92161R03091m29268Q39615
1081.1C92614708J521454J465149J156349j19095N60303M69589R96819J159973J318931
1089.8D01144180J001854J040764J981773J697426J426087L21769R74465J006737P78274
$$ plain form
1028.1 374900322 373617516 372582893 371393929 370369034 370131874 368940201 368707008 368910065 370187035
1036.7 370187035 371625519 372884140 374485359 376042595 377748146 378487511 379475021 379197197 378870697
1045.4 378870697 379334526 379030380 378069229 376170921 375280037 374018707 372312927 370339890 368781548
1054.1 368781548 368303871 367420006 366617050 365154648 365387077 366216049 367272758 369779282 372091484
1062.8 372091484 373721771 374738541 376629181 378219795 380936356 383388062 384257965 385078354 385916634
1071.5 385916634 387913780 388555832 389190102 389899368 389922905 390509109 391301270 392204361 391775093 392614708
1081.1 392614708 394136162 395601311 396757660 396638565 397198868 397668457 398665276 399825249 401144180
1089.8 401144180 402146034 403186798 405168571 406865997 408292084 408613853 409588318 410595055 411373329
1098.5D11373329P11022O34193K028122J472435K035408J616669J219062J049462p1335
1107.1D22068367O28853L09105K31819l73039P96852J624527K64549J240768J520691
1115.8D28312492J723900P63817k63557j38436p03621m19769j53656j22910j84135
1124.5D28814125R29642J442795J258888J579437J169663J050186J603317K277031
1132.2D40125084J344948J364441K639656K843170K448311K151069K312851J742325
1139.9D56971855J123238P83081O78482Q62770J225357J072311Q08182R94682K26212
1148.6D64746170J45416M03061K14806p2861l19824n96352j531563r82666l59001l66020
1158.3D61281166l87306m63715m4174q24280n67779J31378Q20160J715469J384125
$$ plain form
1098.5 411373329 412084351 412718544 414746666 416219101 418254509 419871178 421090240 422139702 422068367
1107.1 422068367 422697220 423006325 423238144 422865105 423661957 425286484 425551033 426791801 428312492
1115.8 428312492 430036392 430800209 430536652 430398216 429694595 429274826 429121170 428998260 428814125
1124.5 428814125 429743767 431186562 432445450 434024887 435194550 436244736 437848053 440125084
1132.2 440125084 441470032 442834473 445474129 448317299 450765610 452916679 455229530 456971855
1139.9 456971855 458095093 458878174 459556656 460419426 461644783 462717094 463525276 464519958 464746170
1148.6 464746170 464891586 465294647 465509453 465436592 465116768 464520416 462988853 462006187 461647186 461281166
1158.3 461281166 460893860 460430145 460385971 459561691 458993912 459125290 459945450 461660919 463045044
1166.9D63045044K105637K808074K877083K506066K225113K351608K567558K172737
1174.6D82658920J954003K904129K900467K511825K329521K154961J617050J794167
1182.4E00825043K360992K245636J929436Q89358O07491P44705J226425R61647N1346
1191E11842079K57301L61939N38750k32087r53865r25636j133995n48286k50893n48325
1200.7E08406982o25152n36347p57980j384048j270409o82640l43819m58030p37572
1209.4E01610985l01552j00441n73883j95313K42577n19676o40297m36516p74612m44184
1219D97867088o39229r51080k17705j20239o09665p88955o08025o87904r36890q42209
1228.6D91465187j118050r32502m54750o30265o57043o37474k54669J99356k63939
$$ plain form
1166.9 463045044 465150681 467958755 470835838 473341904 475567017 477918625 480486183 482658920
1174.6 482658920 484612923 487517052 490417519 492929344 495258865 497413826 499030876 500825043
1182.4 500825043 503186035 505431671 507361107 508250465 508857956 509602661 510829086 511790733 511842079
1191 511842079 512099380 512461319 513000069 512767982 511814117 510888481 509754486 509206200 508955307 508406982
1200.7 508406982 507781830 507245483 506487503 505103455 503833046 503150406 502806587 502348557 501610985
1209.4 501610985 501309433 501208992 500635109 500439796 500682373 500162697 499522400 499085884 498311272 497867088
1219 497867088 497227859 496276779 496059074 495938835 495329170 494540215 493932190 493244286 492307396 491465187
1228.6 491465187 490347137 489414635 488959885 488329620 487672577 487035103 486780434 486979790 486715851
1237.3D86715851n52674n74607j86615Q3198l62015j0986j62659o04438r1553L9787
1247D84293289l69949n47066k41051m62913l89366P3089o2484j43319j37367n0468
1256.6D81962395k26174J91346L80706k81791n3597N85556O17714J8768M83323R78431
1266.3D84656677N01824M74586O29578Q46710J022339P98187M60892R99908J251946
1274.9D91642647J030350R41886N92270Q31909J138573R34830O82526J245956J413650
1283.6E00454597R85222J212082J192627J393471J595116J306343J017227R53407M96102
1292.3E10606194J70440N84717P50046P82814P05757O62880L37448k0332k24305m1580
1301.9E14314079L33290N5962J84174O0920m84428l81966N1842l21083m58832l1471
$$ plain form
1237.3 486715851 486163177 485588570 485401955 485485153 485123138 485112152 484949493 484345055 484253502 484293289
1247 484293289 483923340 483376274 483135223 482672310 482282944 482356033 482293549 482150230 482012863 481962395
1256.6 481962395 481736221 481927567 482308273 482026482 481972885 482558441 483176155 483194923 483678246 484656677
1266.3 484656677 485158501 485633087 486262665 487109375 488131714 488929901 489390793 490390701 491642647
1274.9 491642647 492672997 493614883 494207153 495039062 496177635 497112465 497794991 499040947 500454597
1283.6 500454597 501439819 502651901 503844528 505237999 506833115 508139458 509156685 510110092 510606194
1292.3 510606194 510776634 511361351 512111397 512894211 513599968 514262848 514600296 514579964 514355659 514314079
1301.9 514314079 514647369 514703331 514887505 514948425 514463997 514082031 514133873 513812790 513353958 513322487
1311.6E13322487n24559q07800r67217m01115j26915o50902J68190Q32977J174088
1320.3E12019234J093750Q02879N83954L98559M37203J33781N25856K47307j23367
1328.9E16119156n5275k25372n6763l41797l43513k75612l55378n39360k61764O6986
1338.6E13731308p5302P38411J085548J277123J041488Q16384Q96949L04299R7656
1347.3E19913864J17760O19240K02331l7842j03530k38915K00119l16620l17764n29022
1356.9E19509621l23830k58980n18989m06037n18951P0228l86734L62664Q3999p16514
1366.6E16896477m30756j128845p68814l12004J20697J80092k4414m38958o68640J048699
1376.2E14473534P53402j18713p41501n07316n14679n07317m39186j387749p43599
$$ plain form
1311.6 513322487 512797928 511990128 511022911 510621796 510494881 509843979 510012169 510845146 512019234
1320.3 512019234 513112984 513915863 514499817 514898376 515335579 515469360 515995216 516242523 516119156
1328.9 516119156 516063881 515838509 515781746 515439949 515096436 514820824 514465446 513926086 513664322 513731308
1338.6 513731308 513656006 514394417 515479965 516757088 517798576 518614960 519511909 519816208 519913864
1347.3 519913864 520031624 520650864 520853195 520815353 520711823 520472908 520673027 520356407 520038643 519509621
1356.9 519509621 519185791 518926811 518407822 518001785 517482834 517553062 517166328 517528992 517612991 516896477
1366.6 516896477 516465721 515336876 514568062 514256058 514376755 514556847 514532433 514093475 513424835 514473534
1376.2 514473534 515226936 515108223 514366722 513859406 513344727 512837410 512398224 511010475 510266876
1384.9E10266876n08652n56335j806030j098557m4517j547737j489830j766320j497078
1393.6D99951820k011489l208848j120224j561241j967048l190842j822929j132317
1401.3D83936882k141037j599503j669006k520485k138786j451645j733398j587906
1409D69095116j332131k001838j450959j117363q45031q16536j439858j256485o24046
1417.7D58210869M94881k850991r28459J127625j8349l7117q89702Q42438R17625O4812
1427.3D56933632J210251R25560M03976J45073J349068R72328R97734K350121J676101
1436D66963844Q89359Q16688K331963J368790J143760J861840J233024J401520N14488
1444.7D78525276J345864J476745J306229Q84628J095085K153015J125412J439972
$$ plain form
1384.9 510266876 509758224 509201889 507395859 506297302 506252785 504705048 503215218 501448898 499951820
1393.6 499951820 497940331 494731483 493611259 492050018 490082970 486892128 485069199 483936882
1401.3 483936882 481795845 480196342 478527336 476006851 473868065 472416420 470683022 469095116
1409 469095116 467762985 465761147 464310188 463192825 462347794 461531258 460091400 458834915 458210869
1417.7 458210869 458705750 455854759 454926300 456053925 456035576 455998459 455108757 455951195 456868820 456933632
1427.3 456933632 458143883 459069443 459473419 459618492 460967560 461939888 462937622 465287743 466963844
1436 466963844 467853203 468669891 471001854 472370644 473514404 475376244 476609268 478010788 478525276
1444.7 478525276 479871140 481347885 482654114 483538742 484633827 486786842 487912254 489352226
1452.4D89352226P12395J435089J728287m24538O45409J736145L466720J408692K606697
1461.1E02667122K262649J192017J804619n913K091293J894417J968308K453308L031578
1469.7E19359398L345108J630173J332054K073211L627968K833023J923981K138634
1477.5E38263550K241211K231903J536636J464844J403618J797981J830063J084022
1485.2E51853828J102028O24733L55873N27726j402245M46777J480599N09643J8502
1493.8E55517464R5253m62685m171562L99933q41294k914314K37732l37524r74007
1502.5E46548996p49855L09791r59968p693787m711265L526497K970810l59498P50237
1511.2E39631958j047859j762085K11716j386910p91931j180115j423836J413384J193008
$$ plain form
1452.4 489352226 490064621 491499710 493227997 492803459 493448868 495185013 498651733 500060425 502667122
1461.1 502667122 504929771 506121788 507926407 507920494 510011787 511906204 513874512 516327820 519359398
1469.7 519359398 522704506 524334679 525666733 527739944 531367912 534200935 536124916 538263550
1477.5 538263550 540504761 542736664 544273300 545738144 547141762 548939743 550769806 551853828
1485.2 551853828 552955856 553580589 553936462 554464188 553061943 553508720 554989319 555498962 555517464
1493.8 555517464 555612717 555150032 550978470 551378403 550537109 547622795 547860527 547523003 546548996
1502.5 546548996 545799141 546108932 545148964 537455177 532743912 536270409 539241219 538881721 539631958
1511.2 539631958 538584099 536822014 537033730 535646820 534854889 533674774 532250938 533664322 534857330
1519.9E34857330j890487l247872P72515K259178K016716j115532O20193J058503l75939
1528.6E34954605P16057Q33435M62723O2446o41060j336822J788177J187821O78635
1537.2E38706017J009559m357719k043381L534470J576423k01149J529808M58527j038742
1545.9E39173813J436348L43437Q91533m35143q29506J284791O70356J304436k678299
1554.6E41161766M81033K477875J541252m936523j1346932O397133J746979J470222
1562.3E38992805m93202p67059k921867k346268p6790j257935n52787p552758j331253
1571E21692886j155815l107071k479171k469368j069298j1101265r96247k850837l741303
1579.7D92722511l243332m707527k814369n089989l301277m660187m124069l975105
$$ plain form
1519.9 534857330 532966843 529718971 530491486 532750664 534767380 533651848 534272041 535330544 534954605
1528.6 534954605 535670662 536504097 536966820 537029266 536388206 535051384 536839561 538027382 538706017
1537.2 538706017 539715576 535357857 533314476 536848946 538425369 538224220 539754028 540212555 539173813
1545.9 539173813 540610161 540953598 541845131 541409988 540580482 541865273 542535629 543840065 541161766
1554.6 541161766 541642799 544120674 545661926 540725403 529378471 535775604 537522583 538992805
1562.3 538992805 538499603 537732544 534810677 532464409 532387619 531129684 530576897 523024139 521692886
1571 521692886 520537071 517430000 514950829 512481461 511412163 500310898 499314651 496463814 492722511
1579.7 492722511 489479179 484771652 481957283 476867294 473566017 468905830 464781761 460806656
1587.4D60806656m955406l546830n833435k822914m758148l162231l719330m541664
1595.1D27466698k512131m907074k314224m387284k411308l443107l198700k140236
1602.8D02152634m033547q37440l189354j212654k971611j649170j574936k757416
1610.5C83926506N5771k808609l2082k145729J68000L547o375694K231140j099205
1619.2C73923645J005898r79043J115227o44607k664986J748581j18752K355195j661072
1627.9C74080086P09076P74269M99916R34677k7542K431145N66101M26445k810669
1636.6C77583504L034286K237091J525116K609101K84843K142258J79977K651558J959190
1645.3C94206924j267318J926765p42836M771996J641845L529587K970391k57264j116180
$$ plain form
1587.4 460806656 455851250 452304420 446470985 443648071 438889923 435727692 432008362 427466698
1595.1 427466698 424954567 420047493 417733269 413345985 410934677 407491570 404292870 402152634
1602.8 402152634 398119087 397281647 394092293 392879639 389908028 388258858 386683922 383926506
1610.5 383926506 383982277 381173668 381141586 378995857 379163857 379167404 372791710 375022850 373923645
1619.2 373923645 374929543 373950500 375065727 374421120 371756134 373504715 373385963 375741158 374080086
1627.9 374080086 374789162 375563431 376063347 376998024 376970482 379401627 379967728 380394173 377583504
1636.6 377583504 380617790 382854881 384379997 386989098 387273941 389416199 389596176 392247734 394206924
1645.3 394206924 392939606 394866371 394123535 398895531 400537376 404066963 407037354 406780090 405663910
1653.9D05663910n69382M398232J600418K526588J417809K005615K317505K153320
1661.6D21514015K821045n42869L077430K162667L144798K780456K182541L429833
1669.4D40569916J972923M399147J206360L809776L773079J660996K393837L812217
1677.1D63598251M442978K880707M232483K501183M131927N057449K466660L983154
1684.8D93294792J677742N641327L534737L231849M275437L703270M642143M357185
1692.5E24358482M518013M413987M256401q5411N610275N883255N416221L593827k361641
1701.2E55603409P346077N153312L751717K509232K890968K233772K328148L634300
1708.9E85450935K206536K018470K555390K713814K617530L20817P23495K985229J102410
$$ plain form
1653.9 405663910 405094528 409492760 411093178 413619766 415037575 417043190 419360695 421514015
1661.6 421514015 424335060 423792191 426869621 429032288 432177086 434957542 437140083 440569916
1669.4 440569916 442542839 446941986 448148346 451958122 455731201 457392197 459786034 463598251
1677.1 463598251 468041229 470921936 475154419 477655602 481787529 486844978 489311638 493294792
1684.8 493294792 494972534 500613861 504148598 507380447 511655884 515359154 520001297 524358482
1692.5 524358482 528876495 533290482 537546883 537461472 543071747 548955002 554371223 557965050 555603409
1701.2 555603409 562949486 568102798 571854515 574363747 577254715 579488487 581816635 585450935
1708.9 585450935 587657471 589675941 592231331 594945145 597562675 597883492 598606987 601592216 602694626
1717.6F02694626l859596M007492L646698J790428J456680J145516N79338J370430
1725.3F12831612K138862J534386J362381J694412m24042j03798L025055L153572k024993
1734F23187447l190651M891166L795319K082863K819404L44j026154M019089K314644
1742.7F38893471L99627K347146L734893K777634K163773K883682J718216L928222
1750.4F58846664R31244P00074M605026K981415L010254K820892P2937J741943L159104
1759F78869553K570266K609330j215287K36130L568497J780166J609650J937790J759415
1767.7F93725510j246949J765747L995133L44620j170655j170959L377151J873780
1775.4G01493378r99375J866226Q71964J509857L66745r46350J437454J960297J553650
$$ plain form
1717.6 602694626 598835030 602842522 606489220 608279648 609736328 610881844 611461182 612831612
1725.3 612831612 614970474 616504860 617867241 619561653 619137611 619033813 622058868 625212440 623187447
1734 623187447 619996796 624887962 628683281 630766144 633585548 633585892 632559738 636578827 638893471
1742.7 638893471 639293098 641640244 645375137 648152771 650316544 653200226 654918442 658846664
1750.4 658846664 659777908 660477982 665083008 668064423 671074677 673895569 673968506 675710449 678869553
1759 678869553 681439819 684049149 682833862 683069992 686638489 688418655 690028305 691966095 693725510
1767.7 693725510 692478561 694244308 698239441 698584061 697413406 696242447 699619598 701493378
1775.4 701493378 700494003 702360229 703232193 704742050 705108795 704162445 705599899 707560196 709113846
1784.1G09113846o88629N20248J691208P61719L52630J170044P68509L05710j941528
1792.8G12053757l02735L743439R06143m35104J349258J377640K06223p36161J965714
1801.5G20128174j76315M87670J670762N21926Q43049J86462O44073J152344J067734
1810.2G26525879j029129j18027R10111L13644J295929M04510M30451l08457L34168
1818.8G28759079J005783p782O73523J19019J217269N66864k080535M47998J810379
1827.5G32511597J800384k22091k730790Q98133K240905J5183k19269M73557K57492
1836.2G35025101L77426Q0795J151810M04205M00009J43357P97042M57230m545517
1844.9G34291458K017136J986313r4300j90048Q49457J263809l7842N40848l28445
$$ plain form
1784.1 709113846 708425217 708945465 710636673 711398392 711751022 712921066 713689575 713995285 712053757
1792.8 712053757 711751022 715494461 716400604 715965500 717314758 718692398 718898621 718162460 720128174
1801.5 720128174 719951859 720439529 722110291 722632217 723475266 723661728 724305801 725458145 726525879
1810.2 726525879 725496750 725378723 726288834 726602478 727898407 728302917 728733368 728424911 728759079
1818.8 728759079 729764862 729757080 730430603 730549622 731766891 732333755 730253220 730701218 732511597
1827.5 732511597 734311981 734089890 731359100 732257233 734498138 734513321 734294052 734767609 735025101
1836.2 735025101 735402527 735483322 736635132 737039337 737439346 737582703 738379745 738836975 734291458
1844.9 734291458 736308594 738294907 738200607 738010559 738860016 740123825 740085983 740626831 740298386
1853.6G40298386j32141k4720j85241N77468K8763N96848K39639M87366J18866J35803
1863.2G42141037K74734O6147P07016n39703K73590j500092j401443J807098J427079
1871.9G43255463Q39538r3918M00086J69067R9335l76740m70047K49405k25906N57175
1881.5G44403458J53885K61993n9815j15509N40009j33896P51801n05295j585846O91223
1891.2G44402008R87778K33536N08499L00903n99899P54318K71301p8277k33612m41132
1900.8G46105423N6305k38648M10386L57742K96783J2436J93863J92719l20664l17993
1910.4G46748352n29633M34418k12326K06223L90625N00717J318893j453552m15192
1919.1G46988525O20041M58908K58637j388779p60116N1117O75735O25610O84052r3002
$$ plain form
1853.6 740298386 740166245 740141525 739956284 740533752 740562515 741159363 741399002 741886368 742005234 742141037
1863.2 742141037 742415771 742481918 743188934 742649231 742922821 741422729 740021286 741828384 743255463
1871.9 743255463 744095001 744001083 744401169 744570236 744669571 744292831 743822784 744072189 743846283 744403458
1881.5 744403458 744557343 744819336 744759521 744644012 745184021 745050125 745801926 745296631 743710785 744402008
1891.2 744402008 745389786 745623322 746131821 746432724 745832825 746587143 746858444 746780167 746546555 746105423
1900.8 746105423 746161728 745923080 746333466 746691208 746987991 747000427 747194290 747387009 747066345 746748352
1910.4 746748352 746218719 746653137 746440811 746647034 747037659 747538376 748857269 747403717 746988525
1919.1 746988525 747608566 748067474 748326111 746937332 746177216 746228333 746904068 747529678 748213730 748120728
1928.8G48120728n5848L31955m30908j41296p85370n4474n4703L1510O62307m654K81067
1939.4G47900314n3939L47824r03626j046982P45850O0120j14899j96610O26679O4850
1949G47429581j86234P2022j27106K71759k28043j58157m87823j7930o2866l09448
1958.7G46195755K71149J40381N35812l13034k19956P1183j96915j59073p12433k19879
1968.3G45392990L27911O75660P6370J89361Q8578m37775O867j96381R5062j10550
1978G46108093j21307j33896j35727l8910k01111K03095j80054K02637j16959l69110
1987.6G45216751l55606n59692P45468J74865p26623L4637M28696k69089k06680L00446
1997.2G44783173l13645J06735r9868j56098r5062j83411K3651l6697K65503m01993
$$ plain form
1928.8 748120728 748064880 748396835 747965927 747824631 747039261 746984787 746930084 746961594 747623901 747619247 747900314
1939.4 747900314 747846375 748194199 747290573 746243591 746989441 747049561 746934662 746738052 747364731 747429581
1949 747429581 747243347 747315369 747188263 747460022 747231979 747073822 746585999 746568069 746505203 746195755
1958.7 746195755 746466904 746607285 747143097 746830063 746610107 746681290 746484375 746325302 745612869 745392990
1968.3 745392990 745720901 746396561 746472931 746662292 746750870 746313095 746319962 746123581 746218643 746108093
1978 746108093 745986786 745852890 745717163 745678253 745477142 745680237 745500183 745702820 745585861 745216751
1987.6 745216751 744861145 744301453 745046921 745221786 744495163 744529800 744958496 744689407 744482727 744783173
1997.2 744783173 744469528 744576263 744476395 744320297 744225235 744041824 744065475 744028778 744294281 743892288
2006.9G43892288k55432j18179M6234K71606n05829m27856k86789J05209J79520m1580
2016.5G42859192n53970l20359L7003j79291K64282l28827O8818K38418n6610j17950
2026.2G41910706p30439J2207p6599O4774K31628j61285m97818m53034J91269k01568
2035.8G40289841J53732n7373l07846j63498k06146N5847k37122L21732J08108p5225
2045.5G39882050q6670j38398j47705m23355J19400m88052l74146o3705J60980N61371
2055.1G39001770J35040j4267l60183K3880l68042k68937k9068j59606J93023n27801
2064.7G37625809j5869l8453J35193L72391O9351K35672m81796r5978j31836j38015
2074.4G37536469j10398j66626K14157j02768J63575K7847J02310k15836l56063m34800
$$ plain form
2006.9 743892288 743636856 743518677 743564911 743836517 743330688 742902832 742616043 742721252 742900772 742859192
2016.5 742859192 742305222 741984863 742021866 741842575 742106857 741778030 741846848 742085266 742028656 741910706
2026.2 741910706 741180267 741192474 741115875 741180649 741412277 741250992 740753174 740300140 740491409 740289841
2035.8 740289841 740443573 740386200 740078354 739914856 739708710 739764557 739527435 739849167 739957275 739882050
2045.5 739882050 739795380 739656982 739509277 739085922 739205322 738717270 738343124 738279419 738440399 739001770
2055.1 739001770 739136810 739122543 738762360 738786240 738418198 738149261 738120193 737960587 738153610 737625809
2064.7 737625809 737609940 737571487 737706680 738079071 738148422 738384094 737902298 737806320 737674484 737536469
2074.4 737536469 737426071 737259445 737473602 737370834 737534409 737562256 737664566 737448730 737092667 736657867
2084G36657867m75082L68805M8752K05002k4948K5634J21460j53885p3471o35376m2267
2094.6G36022491j98059P019n2871m15955K74048j03912J56326m1046Q6593Q6823n44281
2105.2G35277176m74243m63944q3542j27334K34756J90659K97851K15378l25928k89688
2114.9G34451141o30111p9956l07770k13471J27411N3406K19803k9297K16141m42963
2124.5G33364334J40228L68348k61002j36566m61197P0801Q3084L86657P4387k51999
2134.2G33377075j08108k00043L69949k71148o2027l37296k55737N82733J17722L2501
2143.8G33245621n01557J8540L30963J43204M25949K57263j87225m79355Q087j84479
2153.5G33077011K02255J25656O0654L87345j75248J26953j55639k16065l13339L8910
$$ plain form
2084 736657867 736182785 736551590 736600342 736805344 736780396 736806030 736927490 736773605 736700134 736064758 736022491
2094.6 736022491 735824432 735831451 735778580 735362625 735636673 735532761 735689087 735648041 735734634 735821457 735277176
2105.2 735277176 734802933 734338989 734255447 734128113 734362869 734553528 734851379 735066757 734740829 734451141
2114.9 734451141 733821030 733741074 733433304 733219833 733347244 733400650 733620453 733591156 733807297 733364334
2124.5 733364334 733504562 733872910 733611908 733475342 733014145 733084946 733168030 733554687 733629074 733377075
2134.2 733377075 733268967 733068924 733438873 733167725 733105698 732768402 732512665 733095398 733213120 733245621
2143.8 733245621 732744064 732762604 733093567 733236771 733662720 733919983 733732758 733253403 733261490 733077011
2153.5 733077011 733279266 733404922 733465576 733852921 733677673 733804626 733648987 733432922 733119583 733158493
2163.1G33158493L47519l28827Q240K59476M48303l60947j56479N03082j75781k53143
2172.8G33449936j44119N20095K45133l7842j85394j18256L15933k7847L26843n4702
2182.4G34289780q3008k5101j31073R6436J0528J98365l37830K5101l1433p5150M37241
2193G34373856J98059K13318k20490J43280K32163q1330l05099k30027J92948j26343
2202.6G34390335J97144K85949L45230r6740k18735J20239l96271q4991R7733K75039
2212.3G34914932j25503m52347j4496N53894N80750m09241j29852N9661L90244K78320
2221.9G35646362k98004q4152k29569J90735j39541p5150J11542J297J70822j81122
2231.6G35113220J03302n5084k3727j30616Q7433M3869m82712J3276o7749L75900J90124
$$ plain form
2163.1 733158493 733506012 733177185 733185425 733444901 733893204 733532257 733375778 733878860 733703079 733449936
2172.8 733449936 733305817 733825912 734071045 734033203 733847809 733729553 734045486 734017639 734344482 734289780
2182.4 734289780 734206772 734181671 734050598 734147034 734157562 734355927 734018097 734043198 734011765 733936615 734373856
2193 734373856 734571915 734785233 734564743 734708023 734940186 734858856 734553757 734323730 734516678 734390335
2202.6 734390335 734587479 734873428 735218658 735121918 734903183 735023422 734627151 734542160 734639893 734914932
2212.3 734914932 734789429 734337082 734322586 734876480 735457230 735047989 734918137 734977798 735368042 735646362
2221.9 735646362 735348358 735264206 735034637 735225372 735085831 735010681 735122223 735123520 735294342 735113220
2231.6 735113220 735216522 735161438 735137711 735007095 735094528 735138397 734655685 734668961 734601212 734977112 735167236
2242.2G35167236n8822k06452l49807M15115J56784J21994k40250j02234n5618j80664
2251.8G34667282J69602l0365M30374o7978K09884J8692p39898j15891J4420L30276
2261.5G34886398j00097P2708J47629j19248Q9874j10626k06909l10593M30222j16043
2271.1G34663315j65863K63901k60163j40686r0027O55442R9868l87878k73666j5717
2280.8G34348526L58047l59344j02844k62451K20718K54898k94647J11847K3651L02811
2290.4G34601212n85785n42527m6844j45645l7155q3237O26526P6752j05134J53M9591
2301G33807907j04370n32761J7167p6523M9972p23648k87628Q60290N19486L46146
2310.7G33876038l72773k01950k41851N0277o7978m13284k90985n12467N66102K9220
$$ plain form
2242.2 735167236 735108414 734901962 734552155 734967270 735124054 735246048 735005798 734903564 734847946 734667282
2251.8 734667282 734836884 734806519 735236893 735168915 735378799 735397491 734657593 734541702 734556122 734886398
2261.5 734886398 734786301 734859009 735006638 734887390 734977264 734866638 734659729 734349136 734779358 734663315
2271.1 734663315 734497452 734761353 734501190 734360504 734270477 734925919 735025787 734637909 734364243 734348526
2280.8 734348526 734706573 734347229 734244385 733981934 734202652 734457550 734162903 734274750 734298401 734601212
2290.4 734601212 734015427 733472900 733426056 733280411 733243256 733160019 733786545 733863297 733758163 733758316 733807907
2301 733807907 733703537 733170776 733187943 733111420 733161392 732437744 732150116 733010406 733529892 733876038
2310.7 733876038 733503265 733301315 733059464 733109741 733041763 732628479 732337494 731825027 732391129 732420349
2320.3G32420349j09863o42471k10495J074829j54572K85187m1275L26843k94418j147385
2329.9G31506729K52304M3030j41754L3874J137772k74124j050949L07007K16293j36490
2339.6G31893692j243362q31833k64893P67517Q02155j34812l54766l51868K8915Q2321
2349.2G30393066O22559j95923j048431o19965N43595J337127K79541P19071j263886
2357.9G30766754k20032J022263k82364l31573j195298n08880j261826L71781Q03451
2366.6G29164276O15921Q2245j041031O38962n97992p64542o75125n99060J47400k53982
2376.2G26717072M7302j12534j66778l54843j45951l21884n34973J70135j4648m29306
2385.9G24853592m37546J93100K4338m8523J94702k61307j09024l51333k94800m00467
$$ plain form
2320.3 732420349 732310486 731668015 731457520 732532349 732377777 732662964 732621689 732948532 732654114 731506729
2329.9 731506729 731759033 731802063 731660309 731694183 732831955 732557831 731506882 731813889 732030182 731893692
2339.6 731893692 730650330 729818497 729553604 730321121 731123276 730988464 730633698 730281830 730310745 730393066
2349.2 730393066 731015625 730819702 729771271 729151306 729694901 731032028 731311569 732030640 730766754
2357.9 730766754 730546722 731568985 731286621 730955048 729759750 729250870 727989044 728360825 729164276
2366.6 729164276 729780197 729862442 728821411 729460373 728862381 728097839 727422714 726823654 726971054 726717072
2376.2 726717072 726764374 726651840 726485062 726130219 725984268 725662384 725127411 725297546 725282898 724853592
2385.9 724853592 724416046 724609146 724633484 724584961 724779663 724518356 724409332 724057999 723763199 723362732
2395.5G23362732l53699l8986o7520J17111l51486q8196j15051j12839M1046m29687
2405.2G21963425j48468M3945J42899l15934p09457o88706j80130J35499j44578K3194
2414.8G20121689l89328k30484k18048j65253O1111l65295k72293l89023n7983k31781
2424.5G17863312k67334j45035k40631J77765k94953k73590n11474m17557k81143n84641
2434.1G15024719j14288j67923K77023K25601Q8883j99127q37784m79355l87344k16523
2443.7G13213882n23681m54102J06964K13623L3875j09863m5777o25839k52304j82114
2453.4G11374664p66754m46396r2773k1897p6980J06430j95084l03650n05600o21032
2463G08450928k75650k08359m8523k82059m6005k30942k63138M8066k90223k55584
$$ plain form
2395.5 723362732 723009033 722970047 722902527 723019638 722668152 722579956 722464905 722352066 722393112 721963425
2405.2 721963425 721814957 721858902 722001801 721685867 720976410 720287704 720107574 720243073 720098495 720121689
2414.8 720121689 719732361 719501877 719283829 719118576 719179687 718814392 718542099 718153076 718095093 717863312
2424.5 717863312 717595978 717450943 717210312 717388077 717093124 716819534 716308060 715890503 715609360 715024719
2434.1 715024719 714910431 714742508 715019531 715245132 715334015 715134888 714297104 713817749 713430405 713213882
2443.7 713213882 712690201 712236099 712343063 712556686 712590561 712480698 712434921 711809082 711556778 711374664
2453.4 711374664 710607910 710161514 710068741 710046844 709969864 710076294 709881210 709577560 709071960 708450928
2463 708450928 708175278 707966919 707918396 707636337 707590332 707359390 707096252 707144318 706854095 706598511
2472.7G06598511o26450n15137o03027n63049j0147j02997k67334n16739r0942N4397
2482.3G03357086n6686l77655m84696j73416l03573k41318o85501l12195k53983o26983
2492F99841080k42844j65176J56097l41949o67115o04858l75748k42843k56348k9831
2501.6F97070465p27768k94876J1749j20468l0517n52674o69784r35974n60532j69373
2511.2F93020248M7608j59302l24707L6850m88586m25263l25928j76620k92740n24902
2520.9F90386658n3711j54648r2697o8283l4104m56237p40281n13076m18168j51367
2530.5F87704086l01284o0044k27890j97906j13221k97012r231o71006o68792l43781
2540.2F84813919j59225m9057m23356m96063k50702L58887r1705n57709n10254l95737
$$ plain form
2472.7 706598511 705972061 705456924 704853897 704290848 704280701 704177704 703910370 703393631 703302689 703357086
2482.3 703357086 703300400 702922745 702438049 702264633 701961060 701719742 701034241 700722046 700468063 699841080
2492 699841080 699598236 699433060 699589157 699247208 698580093 697975235 697599487 697356644 697100296 697070465
2501.6 697070465 696342697 696047821 696059570 695939102 695908585 695355911 694686127 693750153 693189621 693020248
2511.2 693020248 693067856 692908554 692583847 692620697 692132111 691706848 691380920 691204300 690911560 690386658
2520.9 690386658 690332947 690178299 690085602 690017319 689983215 689526978 688786697 688273621 687855453 687704086
2530.5 687704086 687402802 687342758 687114868 686916962 686803741 686506729 686497498 685826492 685157700 684813919
2540.2 684813919 684654694 684605637 684182281 683686218 683435516 683794403 683702698 683144989 682634735 682238998
2549.8F82238998m68978q10547k85950P5302K43988k13547l15323o2103n64575n51605
2559.5F79285660l03803j22070o96869l41949O7215n64042j67770p9880q0414k90451
2569.1F76705627n83725p49435o92673Q7586n570l41949l11432m7913j17950k59171
2578.7F73683395m28772o29196n1651l03955p22351m93469J2970N9814j15509J86234
2588.4F71197510m14810n72510k79389k82821l38135p65533o91224k48794q5068P782
2598F67527008J02997m43726l53927j05591k87628j00327o80466p35321o20880o28433
2607.7F63673706k1515P4539k86483k37198J75476m28543m27552l68423r29642m57992
2617.3F60766373n34592n18875j16959q8424p0267j06201m13971m95453k33383q46329
$$ plain form
2549.8 682238998 681770020 680959473 680673523 680748825 680992813 680779266 680463943 680401840 679837265 679285660
2559.5 679285660 678981857 678859787 678162918 677820969 677888184 677324142 677156372 677076492 676996078 676705627
2569.1 676705627 676121902 675372467 674679794 674767380 674761810 674419861 674108429 674060516 673942566 673683395
2578.7 673683395 673254623 672625427 672573776 672269821 671547470 671054001 671066971 671126785 671011276 671197510
2588.4 671197510 670782700 670210190 669930801 669647980 669309845 668544312 667853088 667604294 667519226 667527008
2598 667527008 667630005 667186279 666832352 666726761 666439133 666338806 665658340 664923019 664302139 663673706
2607.7 663673706 663652191 663726730 663440247 663203049 663378525 662949982 662522430 662154007 661224365 660766373
2617.3 660766373 660231781 659712906 659595947 659507523 659437256 659331055 658917084 658421631 658188248 657341919
2627F57341919r23615k99224n875k17361m25110j04905m22668n32989k85111l02124
2636.6F53822937o07529p11364n75257o77795q4000K69623Q8882j96380j44425N5924
2646.3F51240616n66254j195679j070556l18375l54004k88238j46637m11072k61002
2654.9F46628799n30777o9046J41678k96554n34516q12988m91791l32031l62472l83301
2664.6F42957001n0507L586k1286k57874p89032q0261j97372m11377k03858k77023
2674.2F40671997J7700k88772r5291K05383j06201p30362r04503n98717n15823o1684
2683.9F37593727j01318k69509n25856l47824L15972k88735p00798m67949m94232m63867
2693.5F34249611k88849k19116j44348k59476j85547K0104k06795j88599n81093l90968
$$ plain form
2627 657341919 656418304 656119080 656113205 655895844 655470734 655365829 654943161 654410172 654125061 653822937
2636.6 653822937 653215408 652504044 651928787 651250992 651166992 651436615 651525497 651329117 651184692 651240616
2646.3 651240616 650674362 649478683 648408127 648089752 647735748 647447510 647300873 646889801 646628799
2654.9 646628799 646098022 646028976 646170654 645874100 645339584 644526596 644034805 643702774 643340302 642957001
2664.6 642957001 642906494 642910080 642888794 642630920 641841888 641761627 641564255 641152878 640949020 640671997
2674.2 640671997 640689697 640400925 640305634 640511017 640404816 639674454 638769951 638171234 637655411 637593727
2683.9 637593727 637492409 637222900 636697044 636349220 636665192 636376457 635675659 635207710 634713478 634249611
2693.5 634249611 633960762 633741646 633597298 633337822 633152275 633172379 632965584 632776985 632195892 631804924
2703.1F31804924O3553k78511j22605k20222n19676n29480L7994J55792l71055m05045
2712.8F29615669l00827j59073o46171n05295j58386k47383j04561j21765J44043m48571
2722.4F27067680o03141k1706k1401l82423o84929k67753k83738J40610J67656o91032
2732.1F24419823o56052k33116L04603J67351j71165n51300n03350R1973q9798j98555
2741.7F22580414j12152p9613o4659j17493k92206j11961r4643n38330j67808J869
2751.4F21003418o6528j08490k42043l12996k86827j00136m94079k46735O0501k49862
2761F18956223k16141k35481j10627L2006l35541n55687k29645m28390j67008N4932
2770.7F16764641l89099k39868m30527j83220l97415p95327j59530m7035k42310m56123
$$ plain form
2703.1 631804924 631868477 631589966 631467361 631247139 630727463 630197983 630235977 630391769 630020714 629615669
2712.8 629615669 629314842 629155769 628509598 628004303 627845917 627598534 627493973 627372208 627516251 627067680
2722.4 627067680 626464539 626442833 626421432 626039009 625354080 625086327 624802589 624943199 625110855 624419823
2732.1 624419823 623763771 623530655 623835258 624002609 623831444 623280144 622776794 622868767 622778969 622580414
2741.7 622580414 622468262 622388649 622323990 622206497 621914291 621802330 621707687 621169357 621001549 621003418
2751.4 621003418 620936890 620828400 620586357 620273361 619986534 619886398 619392319 619145584 619206085 618956223
2761 618956223 618740082 618504601 618393974 618425980 618090439 617534752 617305107 616876717 616709709 616764641
2770.7 616764641 616375542 616135674 615705147 615521927 615124512 614329185 614169655 614122620 613880310 613424187
2780.3F13424187q6670j73645m96750m06532o13404l57361r8991O8665l40882o71653
2789.9F10246964m18473r6206k39258q15735m20189m57268l73268l12805p77092l29056
2799.6F06007614l53279p84759q69446k59629j78680q20160p49931l63159k7581j74064
2809.2F01426926n41077j034851n82924l89900j102944o61048m18511n85289o51588
2817.9E95458794m84887n97915n26314j11351o60591n46265o93359j144447q94776
2826.6E89798889o36101n54771p22046m85458p68547q37555q17337r53713p85332j128540
2836.2E82109489j075782j174889j031380p67746j016311j286736j500931j605720
2843.9E72649994k203064j966705j672898j883659j595192j235237j127548j470604
$$ plain form
2780.3 613424187 613337517 613163872 612667122 612260590 611647186 611289825 611190834 611259499 610918617 610246964
2789.9 610246964 609828491 609732285 609493027 608677292 608257103 607799835 607426567 607113762 606336670 606007614
2799.6 606007614 605654335 604869576 604000130 603740501 603561821 602741661 601991730 601628571 601600990 601426926
2809.2 601426926 600885849 599850998 599268074 598878174 597775230 597114182 596695671 596110382 595458794
2817.9 595458794 594973907 594375992 593849678 593738327 593077736 592531471 591838112 590693665 589798889
2826.6 589798889 589162788 588608017 587885971 587400513 586631966 585794411 584977074 584023361 583238029 582109489
2836.2 582109489 581033707 579858818 578827438 578059692 577043381 575756645 574255714 572649994
2843.9 572649994 570446930 568480225 566807327 564923668 563328476 562093239 560965691 559495087
2851.7E59495087j336899j191101m61846K58484j76925n23606m30793K81410j39313
2860.3E55774498p13196j28975Q8234l73420n78003j97335q75969j114807m99916k98691
2870E51082420n21965q31299l42979m85763l78190L5592n41497j088752q07877k55356
2879.6E45864334r01222j032562o62804p09763k89306k47345o24008q46215p61566
2888.3E39789543p18536p81479j194420j053581n47257p41806l64494n13268q05053
2897E33069649q68950j206169o46286n91126j035843q57238j99891m26178r49363n81551
2906.6E25707054q20770p56264p21550r69467o23360j010742j213646r20296j174392
2915.3E17496567j476746j507759j249733j040878j163178r69734p29637j068878p33872
$$ plain form
2851.7 559495087 558158188 556967087 556505241 556763725 556586800 556063194 555632401 555913811 555774498
2860.3 555774498 555061302 554932327 555020561 554647141 554069138 553871803 552995834 551881027 551381111 551082420
2870 551082420 550560455 549729156 549386177 548900414 548522224 548557816 548016319 546927567 546119690 545864334
2879.6 545864334 544963112 543930550 543267746 542557983 542268677 542021332 541397324 540551109 539789543
2888.3 539789543 539071007 538289528 537095108 536041527 535494270 534752464 534387970 533874702 533069649
2897 533069649 532200699 530994530 530348244 529757118 528721275 527864037 527664146 527237968 526288605 525707054
2906.6 525707054 524886284 524130020 523408470 522439003 521815643 520804901 519591255 518670959 517496567
2915.3 517496567 516019821 514512062 513262329 512221451 511058273 510088539 509358902 508290024 507556152
2924E07556152n6915l84827j95388M83703L07007L14598Q3428j26343M62913K25373
2933.6E08669701J46560R45359Q72345J07345M25606Q69522N44968O78138L93372N62515
2943.3E14215431O90308N493L50990M94271N70373N63774L21236O78253R12018N82771
2952.9E19384918j36528J01280K52457j07880L72925Q46901L34130K3269N50270L04337
2962.6E21926079N62706Q74252L61633N49965O83823O37131M14352N82047O73790O23512
2972.2E27889290J088714O52428J46294K84042O44302Q22144M84352o9504K40708P32002
2981.8E32914772p3090K0905K95448j42555m0398K23618O27441K65732j17187L3455
2991.5E34008141K20909K75993l21121k79923M62838P1258r44710q02879m22516k36130
$$ plain form
2924 507556152 507499237 507114410 506919022 507402725 507709732 508024330 508107758 507981415 508444328 508669701
2933.6 508669701 508816261 509761620 510633965 510741310 511166916 512036438 512581406 513259544 513652916 514215431
2943.3 514215431 514905739 514911232 515262222 515756493 516326866 516890640 517211876 517890129 518802147 519384918
2952.9 519384918 519248390 519349670 519602127 519494247 519867172 520714073 521048203 521071472 521621742 521926079
2962.6 521926079 522488785 523363037 523724670 524274635 524958458 525595589 526009941 526591988 527265778 527889290
2972.2 527889290 528978004 529630432 529776726 530060768 530705070 531527214 532011566 531942062 532182770 532914772
2981.8 532914772 532841682 532862587 533158035 533015480 532975082 533198700 533826141 534091873 533974686 534008141
2991.5 534008141 534229050 534505043 534183922 533903999 534366837 534438095 533493385 532690506 532267990 532031860
3001.1E32031860q4304j79177M1161m66881o10962r9716m71077n96886n25436o37551
3010.8E28401031m29039l13110l22075k55317n34440m45938j71547p87010j009750
3019.5E24132805p66449p33566n45235j90926j48468p15446r56955m47731q0757n88532
3029.1E18958740j123619r86862o05240l57361o42853q19892n94292n02586m26064
3037.8E12899971m77142p89566o46172m00734q25386j037750p65686n25856o08750
3046.5E06822929m56657j95694n76782p66907r66186j049958l88222j99050j074334
3055.1E01149139j437988p06482m26407n79223q48236r08356m67796q8234k49367q57468
3064.8D94579582p73468n72357o15997o93856o99272k49290j79482n67665j089325
$$ plain form
3001.1 532031860 531947556 531768379 531809540 531342659 530731697 530631981 530160904 529564018 529038582 528401031
3010.8 528401031 527971992 527658882 527336807 527081490 526547050 526101112 525929565 525142555 524132805
3019.5 524132805 523366356 522632790 522087555 521896629 521748161 521032715 520075760 519628029 519547272 518958740
3029.1 518958740 517835121 516848259 516243019 515885658 515242805 514422913 513828621 513326035 512899971
3037.8 512899971 512422829 511633263 510987091 510586357 509760971 508723221 507957535 507431679 506822929
3046.5 506822929 506366272 506170578 505593796 504826889 503860703 502810745 502422523 502223473 501149139
3055.1 501149139 499711151 499004669 498578262 497999039 497150803 496242447 495774651 495686417 495437050 494579582
3064.8 494579582 493806114 493233757 492617760 491923904 491224632 490975342 490795860 490228195 489138870
3073.5D89138870r69543l69606j43852n37720q66280n17578o46477k66151l20091j068802
3083.1D83432770o48499m59251n24063q26760q22525n96580o08444k29569K9488J16272
3092.7D78862839q48236j054688p47108j284638n51796j77269n37109p75414o23550
3101.4D72263031k87170p18270q20122m12826k87743o76002n80635o10581j085853
3110.1D66783829q02307o71273n57632k22092k13470o28472o68640o77986j059608
3118.8D61282349m90227o47011j024856m83284n78156n68542m66080o54259p03583
3127.5D55666351o39038o79588j001968j040993n95246m70542q62847o44226m44984
3136.1D49286919o79207m83818p99523j009063l32070n14602r58176p69348p94869
$$ plain form
3073.5 489138870 488169327 487799721 487655869 487118149 486251869 485734291 485087814 484821663 484501572 483432770
3083.1 483432770 482784271 482325020 481800957 480974197 480151672 479555092 478946648 478717079 478746567 478862839
3092.7 478862839 478014603 476959915 476212807 474928169 474376373 474199104 473661995 472886581 472263031
3101.4 472263031 471975861 471257591 470437469 470024643 469736900 469060898 468480263 467869682 466783829
3110.1 466783829 465981522 465310249 464752617 464530525 464317055 463688583 463019943 462341957 461282349
3118.8 461282349 460792122 460145111 459120255 458636971 458058815 457490273 457024193 456369934 455666351
3127.5 455666351 455027313 454347725 453345757 452304764 451709518 451238976 450376129 449731903 449286919
3136.1 449286919 448607712 448123894 447324371 446315308 445983238 445468636 444510460 443741112 442946243
3144.8D42946243p11860o08101n92881o22482p57446q33168r01642m38461n40161r67942
3154.5D35972099o35566r59740j141815m01726p8049n59807j057396o75773j35193
3163.1D30327034p50389j284752o18210m95682q58230q34084o19659n16625q52661
3171.8D23496742q00476p74383p16896o62995j066551p63817n11894o71425p84645
3180.5D16743660q28705n23414p00875q17146j13602j10931j139450j121941l41415
3189.2D11046181p76711r77669k18315q31680j582642o68029j39389l87955q26798
3197.9D04636993j252555q51288k72179l67622o07682l95660n97687o57615n82238
3206.5C99052467j139145p98225m25491q67653q03757l0327J82877o92940j097031
$$ plain form
3144.8 442946243 442234383 441626282 441033401 440410919 439653473 438820305 437918663 437480202 436940041 435972099
3154.5 435972099 435336533 434376793 433234978 432833252 432755203 432195396 431138000 430462227 430327034
3163.1 430327034 429576645 428291893 427673683 427178001 426319771 425485687 424866028 424349403 423496742
3171.8 423496742 422696266 421921883 421204987 420541992 419475441 418711624 418199730 417528305 416743660
3180.5 416743660 415914955 415391541 414690666 413873520 413759918 413648987 412509537 411387596 411046181
3189.2 411046181 410269470 409291801 409073486 408241806 406659164 405991135 405851746 405463791 404636993
3197.9 404636993 403384438 402533150 402260971 401893349 401285667 400890007 400292320 399634705 399052467
3206.5 399052467 397913322 397115097 396689606 395821953 395018196 394987869 395170746 394477806 393380775
3215.2C93380775j028480p52411k77252l31383o68449q83560p47757p16973q85429
3223.9C87089081o90766j82762o5689m03213q00247q82187m05045j70746m59022j089897
3233.5C81939507r83544l32641l89176l16124m73556r42383q42781l18413k56844o50177
3243.2C76433868n78308m65431l09029l34167n70984q09669n74875l0251n19905p54661
3252.8C71486588p99218p08885j22986j38397k37160m68559m61464p33261j003876
3261.5C66812782n65490k93465k67639o22330j23482K97051k91558o50367n63813k02484
3271.2C63529205m11682l87802l52821o20270n07698o57311o96678n11703r5635R3994
3280.8C59381599k36930o66428m38995l10822j015015m94232M2954j43357j59454j58806
$$ plain form
3215.2 393380775 392352295 391599884 391322632 390991249 390322800 389439240 388691483 387974510 387089081
3223.9 387089081 386398315 386215553 386149864 385746651 384946404 384064217 383659172 383488426 383029404 381939507
3233.5 381939507 380955963 380623322 380234146 379918022 379444466 378502083 377659302 377340889 377084045 376433868
3243.2 376433868 375855560 375390129 375081100 374746933 374175949 373366280 372791405 372761154 372241249 371486588
3252.8 371486588 370687370 369978485 369855499 369717102 369479942 369011383 368549919 367816658 366812782
3261.5 366812782 366247292 365953827 365686188 365063858 364940376 365237427 364945869 364295502 363731689 363529205
3271.2 363529205 363117523 362729721 362376900 361756630 361248932 360591621 359894943 359383240 359287605 359381599
3280.8 359381599 359144669 358478241 358039246 357728424 356713409 356219177 356262131 356118774 355959320 355800514
3290.4C55800514L3074o94428o50673J26305n79033j053658m37698k15607n11207k8916
3300.1C51788673L1548p41730m59213l2768l60337n23491p44133p90939l30238k82135
3309.7C47555237m50478o56776n18570l37029n97419k26212l40538n63698m13513n34973
3319.4C42916031k25296m79241p46650q46100n54123J22795p43980r67675m98886q29467
3329C37147408q78640r88159n38254l17878r29757o13517n9243m23011j214562p48138
3338.7C30436249N7564q40226j277427p43447n34706m96330o11801n19638n31616l71895
3348.3C24566727m63105q50067o06613k87208k6741n47181q32252l82080o14681n00336
3357.9C19456463m0493M0607k33345p77206q12245j35994k45857n71613l44162o12583
$$ plain form
3290.4 355800514 355833588 355139160 354488487 354614792 354035759 352982101 352544403 352328796 351817589 351788673
3300.1 351788673 351820221 351078491 350619278 350586510 350226173 349702682 348958549 348167610 347837372 347555237
3309.7 347555237 347104759 346447983 345929413 345592384 344994965 344768753 344428215 343864517 343451004 342916031
3319.4 342916031 342690735 342211494 341464844 340618744 340064621 340187416 339443436 338475761 337976875 337147408
3329 337147408 336268768 335280609 334742355 334424477 333494720 332881203 332821960 332398949 331184387 330436249
3338.7 330436249 330493813 329653587 328376160 327632713 327098007 326601677 325989876 325470238 324938622 324566727
3348.3 324566727 324103622 323253555 322646942 322359734 322332993 321785812 320953560 320571480 319956799 319456463
3357.9 319456463 319415970 319456577 319223232 318446026 317633781 317497787 317251930 316680317 316336155 315723572
3367.6C15723572j31703l84330r30710j80741k32238k34642m59576n87921m98886o57978
3377.2C11424847O2503K73648R6092o55994p70894J32237j84975k56557J4553k4891
3386.9C10110569l22723n09797k68287m56276m86221m21219j59931K82039L15113N398
3396.5C08088665o09016n83573j91898m28543k14291L11089j24359n1613J49326k15321
3406.2C06130466L1586k71320j84231M1294p48463J21327P48539l80039l52345J05515
3415.8C05242329L00426M04663k25372l57952j09215J61057P20405J91078l58600L52878
3425.5C06321697L05634j72997L24154M93889J42078k24742K39582N27095l1108N44261
3435.1C08469543M96979q8100l46661k12154Q81214P93838O76709J63841k58789N26695
$$ plain form
3367.6 315723572 315591869 315207539 314276829 314096088 313863850 313629208 313169632 312581711 312082825 311424847
3377.2 311424847 311487350 311760998 311857090 311201096 310430202 310562439 310377464 310120907 310135460 310110569
3386.9 310110569 309787846 309278049 309009762 308553486 308067265 307646046 307486115 307768154 308083267 308088665
3396.5 308088665 307479649 306896076 306704178 306275635 306061344 306372433 306248074 306196461 306345787 306130466
3406.2 306130466 306162052 305890732 305706501 305747795 304999332 305120659 305869198 305489159 305136814 305242329
3415.8 305242329 305542755 305947418 305722046 305364094 305254879 305415936 306136341 306327419 305968819 306321697
3425.5 306321697 306627331 306454334 306778488 307272377 307414455 307189713 307429295 307956390 307925282 308469543
3435.1 308469543 308966522 308878422 308531761 308319607 309200821 309994659 310671368 310835209 310576420 311103115
3444.7C11103115O30055P96146r0485N3921R57146K93140P6733N27592N55515M9629
3454.4C14952507P73468J028023N73273N89122K17228O35319K49367L51734R36012
3463.1C20306053M50134P03850Q72040P25746L57895P12547O67229P13844J248055
3471.7C26757393r689K74086J336784P50656M64478M92477L25203P29637J656609J136856
3481.4C33914490j3657K77825J149063Q29582L69911R88236J051139K80304L08876
3490.1C39155769J344109Q73909N71136J612626J189613O25000N85213O84433M64477
3498.7C47106285L99819P20520R73472J173897J87340Q42895J868935J361160J243172
3507.4C55877495J126365L4142k38914J236763J174392J210366J141738M34533J153373
$$ plain form
3444.7 311103115 311733170 312529316 312438831 312492752 313449898 313743038 313819771 314347363 314902878 314952507
3454.4 314952507 315725975 316753998 317327271 317916393 318133621 318768940 319018307 319370041 320306053
3463.1 320306053 320756187 321460037 322332077 323057823 323415718 324128265 324795494 325509338 326757393
3471.7 326757393 326747704 327021790 328358574 329109230 329573708 330066185 330391388 331121025 332777634 333914490
3481.4 333914490 333900833 334178658 335327721 336157303 336527214 337515450 338566589 338846893 339155769
3490.1 339155769 340499878 341373787 341944923 343557549 344747162 345372162 345957375 346641808 347106285
3498.7 347106285 347506104 348226624 349200096 350373993 350561333 351404228 353273163 354634323 355877495
3507.4 355877495 357003860 357038002 356799088 358035851 359210243 360420609 361562347 361996880 363150253
3516.1C63150253J378861J030807L84407K28730J017799J749725J342736O9351J001358
3524.8C71354027J624908J275330R18350Q34351J066055J377563J050950O32324J289291
3533.5C81423149J038475J723023J386413K30599J075706R92012J866112J241035R83811
3542.1C91960335J689758J273575J059685J59340J067047K62642J639671K809753J862679
3550.8D03784485J781463k50091J253586J410293J677475K678337J184960J852493
3558.5D15373001J438599J372719Q96301J290245J416664J060333M237175J762314
3566.2D28847351N71976K82707m22592L430939J989288J800003K090988J650581J258965
3574.9D41500206J437073J855011R91897K979698J810456M25186K063560K660676K418174
$$ plain form
3516.1 363150253 364529114 365559921 365944328 366173058 367190857 368940582 370283318 370352669 371354027
3524.8 371354027 372978935 374254265 375172615 376006966 377073021 378450584 379501534 380133858 381423149
3533.5 381423149 382461624 384184647 385571060 385801659 386877365 387869377 389735489 390976524 391960335
3542.1 391960335 393650093 394923668 395983353 396142693 397209740 397472382 399112053 401921806 403784485
3550.8 403784485 405565948 405315857 406569443 407979736 409657211 412335548 413520508 415373001
3558.5 415373001 416811600 418184319 419080620 420370865 421787529 422847862 427085037 428847351
3566.2 428847351 429419327 429702034 429279442 432710381 434699669 436499672 438590660 440241241 441500206
3574.9 441500206 442937279 444792290 445784187 448763885 450574341 450999527 453063087 455723763 458141937
3583.6D58141937J870117M135094J398392j465378K225189K53029K866173L367844
3591.3D72792397K885284J320648J050759L513717j5487J709556L024559J754379L106308
3600D91142120J184922J878738K672424J784745K041435K978973L197441l93295K847023
3608.7E09334526N25589L31955P575111J755333j479301M135437M82635M333115M493408
3617.4E31487808J464157J909447o75850K091179L435478K916680K600708L016433
3625.1E48246040L114014K585258N528298L44696o843491M256897M473343N565453
3632.8E67270508K348594p37037L127250L977204L157577J077996J738166K990456
3640.5E84950714K559853J667518J629334L080559L720932N424080j209527m210815
$$ plain form
3583.6 458141937 460012054 464147148 465545540 464080162 466305351 466558380 469424553 472792397
3591.3 472792397 475677681 476998329 478049088 481562805 481547318 483256874 486281433 488035812 491142120
3600 491142120 492327042 494205780 496878204 498662949 500704384 503683357 506880798 506487503 509334526
3608.7 509334526 509860115 510192070 517767181 519522514 518043213 522178650 522661285 526994400 531487808
3617.4 531487808 532951965 534861412 534185562 536276741 539712219 542628899 545229607 548246040
3625.1 548246040 551360054 553945312 559473610 559818306 552974815 557231712 561705055 567270508
3632.8 567270508 569619102 568882065 572009315 575986519 579144096 580222092 581960258 584950714
3640.5 584950714 587510567 589178085 590807419 593887978 597608910 603032990 601823463 597612648
3648.2E97612648O958771J893158k360001R73969N210952M390679L847923M434052
3655.9F22962151n304604K350044M687462J312714J878204J249733K561340J834984
3663.6F33532028K131386K158432J142998L745727K121353J119385N20630n812302
3671.4F40659637K583237P174988P612305j689682j5446320L730087Q445664N430908
3679.1F58500824k108078p3395K756806J883163J045456J07651O22940M408035O441879
3687.8F73585281p969589l109283O839981n056992L23410M669647P39594K003632O68411
3696.4F72694092l80249J738128K00806K009583L587417m207001j804351L513260R47189
3705.1F78298874O66275P97348L004074L650665p233658K618943L188858j1303482
$$ plain form
3648.2 597612648 604571419 606464577 604104576 605078545 610289497 614680176 618528099 622962151
3655.9 622962151 617657547 620007591 624695053 626007767 627885971 629135704 631697044 633532028
3663.6 633532028 635663414 637821846 638964844 642710571 644831924 645951309 646471939 640659637
3671.4 640659637 643242874 650417862 658030167 656340485 640894165 644624252 653069916 658500824
3679.1 658500824 656392746 656319351 659076157 660959320 662004776 662112427 662735367 667143402 673585281
3687.8 673585281 665615692 662506409 669346390 664289398 664612808 669282455 670022049 672025681 672694092
3696.4 672694092 672313843 674051971 674252777 676262360 679849777 675642776 673838425 677351685 678298874
3705.1 678298874 678965149 679762497 682766571 686417236 679183578 681802521 684991379 673687897
3712.8F73687897M475860M352494O95572Q25805J950379J021423l372269J374665O368866
3721.5F91380692l187180m894180M565429P0496q32901j410599p0801L138657J655579
3730.2F90415192O526794j446228q747940O576996l33100r080200J92108L033982J067657
3738.9F88205261K678528L353806l246155L026886J0734176j0202179j4909210J0522995
3746.6F90164108N288468L522110m293595r841766R972763m003143n248642N717239
3754.3F91277542L915787K614670n127793K484513M978103p307129j94625L673477
3762F96314545Q50372M57535L437500j943588m565583K831192M171601K5024q205414
3770.7F93373184J391907L216858O99005J090775j58539N32989p0495K431411M19693
$$ plain form
3712.8 673687897 678163757 682516251 683211823 684037628 685988007 687009430 683637161 685011826 691380692
3721.5 691380692 688193512 683299332 687864761 687935257 687102356 685691757 685620956 688759613 690415192
3730.2 690415192 696941986 695495758 686747818 693324814 692991714 683911514 684103622 687137604 688205261
3738.9 688205261 690883789 694237595 690991440 694018326 704752502 694550323 679641113 690164108
3746.6 690164108 695452576 698974686 694681091 684839325 694812088 690808945 685560303 691277542
3754.3 691277542 695193329 697807999 692680206 695164719 700142822 692835693 692641068 696314545
3762 696314545 697164917 697622452 701059952 699116364 694550781 697381973 701553574 701578598 693373184
3770.7 693373184 694765091 697981949 698680954 699771729 699613190 700146179 700075684 702507095 702926788
3779.4G02926788o603393J839142J420745O56510J836395k008514n16892J264038P07245
3788G01522064p6294m44641J63345J63270N42526l60184O94199K484512k673340l226318
3797.7F98789139J828918M445343N599594q963394j0010452N433350L462066L892060
3805.4G04476624L341293r115982j975556M945984J591645j93406K86408L37601J341705
3814.1G05036316M352188k201080j1939164M601517M996186L966522J431350j5619278
3821.8F94624557K987671N355378J706314K086944o30417l796310K60391J756516K712555
3830.5G07063599J060180p289428K190933N551376o399078l54996O990891p704010
3838.2G01109467l651123P331390l077240m95987N451508k547837l266830K657470
$$ plain form
3779.4 702926788 696323395 698162537 699583282 700239792 702076187 700067673 699550781 700814819 701522064
3788 701522064 701445770 701001129 701164474 701327744 701870270 701510086 702204285 704688797 702015457 698789139
3797.7 698789139 700618057 705063400 710662994 701699600 691689148 697122498 700584564 704476624
3805.4 704476624 707817917 698701935 696726379 701672363 703264008 703070602 703357010 703694611 705036316
3814.1 705036316 709388504 707187424 695248260 699849777 704845963 708812485 710243835 694624557
3821.8 694624557 697612228 702967606 704673920 706760864 706130447 702334137 702594528 704351044 707063599
3830.5 707063599 708123779 700834351 703025284 708576660 702177582 701822586 708813477 701109467
3838.2 701109467 697458344 704789734 701712494 701216507 706668015 704120178 700853348 703510818
3845.9G03510818R74808O26984K098236j531143Q07037M503327n683213M85535j2220078
3854.6F93572311J182480R035645N3558l93905J721878J773300L053131m872589k088394
3863.3G03037415L000640m970703j791687L596573M749375N631103r263611p843933
3871F96145172M640427N065155K440567q385163J447373M128265j21536J718826L577957
3879.7G10657043n053634o988907M999771J613617J162415M083099j0889587R17587
3887.4G00501404L891678J095733L290787j643295p282639J342240L949432n20554
3895.1G04624786L17917J98059J304627J548157p412644M593582R33686m201584N010376
3903.8G06916962l822480k014465n37643R72290L260803n85785l43857M24729K79541
$$ plain form
3845.9 703510818 704485626 705112610 707210846 705679703 706486740 710990067 705306854 705792389 693572311
3854.6 693572311 694754791 703790436 703843994 703450089 705171967 706945267 709998398 705125809 703037415
3863.3 703037415 706038055 701067352 699275665 702872238 707621613 713252716 703989105 696145172
3871 696145172 700785599 705850754 708291321 699906158 701353531 705481796 705360260 707079086 710657043
3879.7 710657043 705603409 698614502 703614273 705227890 706390305 710473404 699583817 700501404
3887.4 700501404 704393082 705488815 708779602 707136307 699853668 701195908 705145340 704624786
3895.1 704624786 704942703 705140762 706445389 707993546 700580902 705174484 706108170 701906586 706916962
3903.8 706916962 703094482 701080017 700542374 701514664 704775467 704189682 703845825 704270554 704550095
3912.5G04550095J97754N9509J092529J650925k948456l498306L288040O5842k639618
3921.1G01818314J977844J923523P11822l164673k209014J736908J623535J035003
3928.8G05453262j420898j25656J615829k616653r81751J889801M00696R5902J81427
3937.5G04491959p43180j208038r3689K051773P90253k884827l17993P90558J035538
3946.2G03912354O34231k762909J468277J689911k544556L07083k78778o2484J138992
3954.9G03502121O18591J86158j093140K85568J3886P9650N1270j615295J38321L14636
3964.5G02481766J08185J12228j10703R55048l13415q58613Q48313M3182p07168L22265
3974.2G02881088j86233m26102J29166P61108N91431o13938k05154J86768M3563j98059
$$ plain form
3912.5 704550095 704747849 704807358 705899887 707550812 704602356 701104050 704392090 704457932 701818314
3921.1 701818314 703796158 705719681 706431503 703266830 701057816 702794724 704418259 705453262
3928.8 705453262 704032364 703906708 705522537 702905884 701924133 703813934 704214630 704310532 704491959
3937.5 704491959 703748779 702540741 702447052 704498825 705289078 702404251 702086258 702876816 703912354
3946.2 703912354 704546585 701783676 703251953 704941864 702397308 702704391 702425613 702363129 703502121
3954.9 703502121 704120712 704306870 703213730 703499298 703513184 703592834 703644104 702028809 702167130 702481766
3964.5 702481766 702589951 702702179 702591476 703546524 703233109 702374496 703222809 703265991 702558823 702881088
3974.2 702881088 702694855 702268753 702397919 703159027 703750458 703136520 702931366 703118134 703161697 702963638
3983.8G02963638l58581L1738M2877l6850k63443j8844M0664K83051N99518L32031
3993.5G03615799M11301o15540q59070J91880J25198p1259J37635
4000.2G02935944
$$ plain form
3983.8 702963638 702605057 702636795 702679672 702642822 702379379 702360535 702401199 702684250 703283768 703615799
3993.5 703615799 704027100 703411560 702552490 702744370 702869568 702798309 702935944
4000.2 702935944
##END=$$ End of the data block
