##TITLE=$$ Begin of the data block
##JCAMP-DX=5.00 $$ ACD/SpecManager v 10.08
##SPECTROMETER/DATA SYSTEM=Varian
##DATE=08 Jan 2013 16:09:50
##DATA TYPE=INFRARED SPECTRUM
##DATA CLASS=XYDATA
##ORIGIN=
##OWNER=
##NPOINTS=3735
##FIRSTX=399.26403809
##LASTX=4000.35498047
##MAXX=4000.35498047
##MINX=399.26403809
##MAXY=75.02153015
##MINY=30.51872063
##XFACTOR=1.0000000000
##YFACTOR=0.000000100000000
##FIRSTY=47.92067337
##DELTAX=0.96440572
##XUNITS=1/CM
##YUNITS=TRANSMITTANCE
##XYDATA=(X++(Y..Y))
399.3D79206734K0438461M756546j016426r368324J831779O619339l857002j665611
407D96945496J459770N81779j360397Q870010Q362389l544426n524712l207130J916542
415.7E04499321j722908m528465m704171R996071Q129349n548477p682915m978065
423.4D93459740L353347n38520k875138K960205L382531J133880o77337J453476L616943
432.1E05269127L120842n115738q898354j243553j810188P32880N609626K430573j880074
440.7D98215141l264541l355217J973800O303788L851738M480781r30939l684387m322738
449.4D99267426l299904N141639j72882l777542K695885p07817k188759j261902l067627
458.1D92628517J602516N942154K347260l275147k497215l402481j548843K019157
$$ y = [479206734, 499645195, 504401741, 503385315, 494016991, 495848770, 502468109, 498611107, 496945496, 498405266, 498987045, 497626648, 506496658, 514859047, 511314621, 505789909, 502582779, 504499321, 502776413, 498247948, 493543777, 503539848, 511669197, 506120720, 498437805, 493459740, 496813087, 496274567, 493399429, 496359634, 499742165, 500876045, 500198708, 501652184, 505269127, 508389969, 503274231, 494375877, 493132324, 491322136, 492055016, 497664642, 500095215, 498215141, 494950600, 491595383, 493569183, 499872971, 503724709, 508205490, 507274551, 503590164, 499267426, 495967522, 501109161, 500936279, 497158737, 499854622, 499146805, 496958046, 495696144, 492628517, 494231033, 500173187, 502520447, 499245300, 496748085, 493345604, 491796761, 493815918]
465.8D93815918N58205j834374N61714K583008m64020n563888m879646M279899K24075
474.5D89280891l38058M286537K262650j312828j373368j814689k456665J009369k537118
483.2D87006721l001937O140823P96585j643639N02625j219940M91791J13182j857682
491.8D87328529k904052o6719L571968R1819k094650M04511K811164J929818k656250
500.5D88416138m432526k259483P72171M07219N02243J273231l69148J51939L04718
509.2D84766502j712265O24123L90778k374611j357384j415253p90176L26919j068229
517.9D77390404J31645J073608j423492k490082M24652J825829M89197m07944j655770
526.6D75358047M93699J17950k096672k208405j507682K191085K100564P60993J126671
$$ y = [493815918, 494374123, 492539749, 493101463, 495684471, 495220451, 489656563, 484776917, 489056816, 489280891, 488942833, 493229370, 495492020, 494179192, 492805824, 490991135, 488534470, 489543839, 487006721, 484004784, 490145607, 490942192, 489298553, 489801178, 488581238, 489073029, 489186211, 487328529, 484424477, 484357758, 487929726, 488021545, 485926895, 486331406, 489142570, 491072388, 488416138, 483983612, 481724129, 482496300, 482903519, 483405762, 484678993, 484309845, 484461784, 484766502, 483054237, 483678360, 484069138, 481694527, 480337143, 478921890, 478131714, 478458633, 477390404, 477522049, 478595657, 477172165, 474682083, 475106735, 476932564, 477421761, 477013817, 475358047, 475851746, 475969696, 473873024, 471664619, 470156937, 472348022, 474448586, 475209579, 476336250]
535.2D76336250o11229j24778p10526k162475j160241o18019l51791J10092j10016
543.9D70597267r25636j3275P58552l15399j003265L4790k36283k385559q51555K9908
553.6D65689545l20893R81217J19858j144600r04084k9029o48308q69179J319733Q60290
563.2D65054550j390037j47705J969909Q55370j45416J38244o61430J65100p65648
571.9D65072937k244759j04026N91735r6168M50096P85332R66415K60964n10674q62884
581.5D64308968q22335j54876o57502j20735J602555M29267k136P25479N06363O39305
591.2D66454353n03502K60888J076965j48850K31209J56212N15823N86205l46527l44010
600.8D67938766j048660n41572m31481j184807L42293R25751M8981o56243j010360
$$ y = [476336250, 475725021, 475600243, 474889717, 472727242, 471567001, 470948982, 470597191, 470707283, 470597267, 469671631, 469658356, 470416908, 470101509, 469098244, 469133034, 468896751, 466511192, 465659637, 465689545, 465368652, 466349869, 466469727, 465325127, 464421043, 464392014, 463743706, 462874527, 464194260, 465054550, 463664513, 463516808, 465486717, 466342087, 466196671, 466334915, 465673485, 465838585, 465072937, 462828178, 462724152, 463315887, 463219719, 463669815, 464455147, 465421562, 465682526, 465171852, 464308968, 463486633, 463331757, 462674255, 462553520, 464156075, 464585342, 464583206, 465308685, 465815048, 466454353, 465950851, 466211739, 467288704, 467139854, 467371063, 467527275, 468043098, 468629303, 468282776, 467938766, 466890106, 466348534, 465917053, 464732246, 465074539, 466000290, 466049271, 465393028, 464382668]
609.5D64382668J81961R20868m26789j233291o34079o50063r73778O6223M73137J38932
619.2D62245789J052970J162072Q33358O04516m5357R50813O57692j86386O67763N58662
628.8D68501892Q62160K029953J650619J270638K092209J460037Q62846Q09441M81186
637.5D80020981M49714N71824J742553J245270M85726J067352J752128K027970L04985
646.2D89668503o61621m98696O12603J406402J091309J676712J672249R62371J75744
654.8D96105576L21846J65634r39331j478958p28112r3307l32566P744m5280m88053
664.5D92495193J63842K056274J938820n308914M03709J902237K333412J568871l93448
673.2D97159996R63249J182442J229896J696015l7880p00340j67542J39237J949615
$$ y = [464382668, 464564629, 465485497, 465058708, 463825417, 463191338, 462541275, 461567497, 461633720, 462106857, 462245789, 463298759, 464460831, 465294189, 465898705, 465853348, 466804161, 467461853, 467275467, 467943230, 468501892, 469364052, 471394005, 473044624, 474315262, 476407471, 477867508, 478730354, 479539795, 480020981, 480470695, 481042519, 482785072, 484030342, 484516068, 485583420, 487335548, 489363518, 489668503, 489006882, 488508186, 489120789, 490527191, 491618500, 493295212, 494967461, 495929832, 496105576, 496427422, 496593056, 495653725, 494174767, 493446655, 493353348, 493020782, 493028526, 492983246, 492495193, 492659035, 494715309, 496654129, 491345215, 491748924, 493651161, 495984573, 497553444, 497159996, 498123245, 499305687, 500535583, 502231598, 502193718, 501493378, 501325836, 501465073, 503414688]
681.8E03414688L090286J471329J699486K715149J189689q75129j646652n37987Q76121
690.5E11396980O15120P37610J912003J481132N53932J42899N28145N55000k15797
699.2E17707024K57339M96330O83480J88026K91252J236038J300660J340866O44226
707.9E24145241J055832J83677l28674O54831j58463L59459J316300K210655J047897
716.6E30486755j96647M57496l4942R155j64795R29146P67822p667R58061R83772K037697
727.2E36225853J753044J118584L92761m86565N34058O93436P85751P22961P29599
735.8E42469482P28531O00548N27458j90696O8359J045952J095543M5280K14195J379471
745.5E47984123J316033m52576q59451P61718N76516K83126J048890P18193k48604
$$ y = [503414688, 506504974, 507976303, 509675789, 512390938, 513580627, 512705498, 511058846, 510520859, 511396980, 512012100, 512749710, 514661713, 516142845, 516696777, 516839676, 517367821, 517922821, 517707024, 517964363, 518460693, 519144173, 519332199, 519623451, 520859489, 522160149, 523501015, 524145241, 525201073, 525384750, 525056076, 525710907, 525552444, 525911903, 527228203, 529438858, 530486755, 530290108, 530747604, 530712662, 530721817, 530557022, 531486168, 532253990, 532246323, 533204384, 534188156, 536225853, 537978897, 539097481, 539490242, 539003677, 539537735, 540231171, 541016922, 541739883, 542469482, 543198013, 543798561, 544326019, 544135323, 544203682, 545249634, 546345177, 546390457, 546604652, 547984123, 549300156, 548847580, 547988129, 548749847, 549326363, 549609489, 550658379, 551376572, 551127968]
754.2E51127968P98950P49474N66330K638511J389275N71480Q25958P20978N93414
762.8E59982338j97105J071014N11017m4480J050950K096328J039543q93173N3101
771.5E64669533r49707o58989N80101m2839N57937O53916N5504k65160K39029n1956
781.2E64787369L30887O28242k10075L56636M85420K21939M01306O07758j41869M81529
790.8E67949142P11365l38936K62757m71535o07910m97818n54466j04180Q34503J236573
800.5E68419495q12035j085548j575203j865692j835328j994285r33113r03855m7264
809.1E57367172k16255m46167j67847o85196j399459k425919j369514j279488j489639
817.8E47887688k04316O57235O09932Q12568K097245J597786J232528J434593J236382
$$ y = [551127968, 551926918, 552676392, 553242722, 555881233, 557270508, 557841988, 558667946, 559388924, 559982338, 559785233, 560856247, 561367264, 561322784, 562373734, 564470062, 565509605, 564616432, 564669533, 563719826, 563060837, 563640938, 563598099, 564156036, 564809952, 564865456, 564600296, 564839325, 564787369, 565118256, 565746498, 565536423, 565893059, 566378479, 566600418, 567001724, 567609482, 567467613, 567949142, 568660507, 568321571, 568584328, 568112793, 567504883, 567007065, 566452599, 566348419, 567182922, 568419495, 567607460, 566521912, 564946709, 563081017, 561245689, 559251404, 558318291, 557414436, 557367172, 557150917, 556704750, 556536903, 555851707, 554452248, 552026329, 550656815, 549377327, 547887688, 547683372, 548340607, 548950539, 549763107, 551860352, 553458138, 554690666, 556125259, 557361641]
826.5E57361641J291809J347885K195282L030434L529434L234444L328933K553482
834.2E77873344J790924J634980J295242J218453k80228J417961K255859J525650K543412
842.9E91275597J861839J611061J833496J145058q54798K50855M15230q85582J179352
851.6E97832108J459922K366104K857361K378998J608009N92232J3924l36762J309471
860.3F10081367L64266O50635J663131J027298M05045k48489J3656r13009K37503o90308
869.9F12591095k435150k544251k383003l03192j41907q3160o63567K33078O08292
878.6F04878235q40683j85585n34096k48375r61342j144523m74205m91219m26254m37508
888.2E99134445N85480k41318l48930n42183m71268j13373p13157j77002o63986N13992
$$ y = [557361641, 558653450, 560001335, 562196617, 565227051, 568756485, 571990929, 575319862, 577873344, 579664268, 581299248, 582594490, 583812943, 583532715, 584950676, 587206535, 588732185, 591275597, 593137436, 594748497, 596581993, 597727051, 596872253, 597123108, 597538338, 596652756, 597832108, 599292030, 601658134, 604515495, 606894493, 608502502, 609094734, 609108658, 608771896, 610081367, 610445633, 611096268, 612759399, 613786697, 614191742, 613943253, 613956909, 613043900, 613281403, 612591095, 610155945, 607611694, 605228691, 604925499, 604783592, 604700432, 604036865, 604269943, 604878235, 604037552, 603851967, 603317871, 603069496, 602108154, 600963631, 600489426, 599998207, 599571953, 599134445, 599719925, 599478607, 599129677, 598587494, 598116226, 598002853, 597289696, 597112694, 596448708, 596962700]
897.9E96962700r5406j225052M1466l18909p11631l66936R78622J105423J542702J680451
907.5E99593430J163406J667824R44519Q06198K8686k92549p74841j070175l35541
916.2F01730957j331596k193261j690521q61091k116471j273727o38313l021508l577919
924.9E85026550l524017k567291k117119k704506l349304k549706j278877j494522
932.6E65441208j119232j514740j329537o50139o19278q64601j401405j088142j060448
941.3E55793686n87120o37283p31278k82783l55683m35409o45829q5868j62812m9514
950.9E51820107N44662Q9607r66911j158486p02705j529655j578026j923676j866569
959.6E42728348j619797k368622k120666k210961j592827j233024j447754j872597
$$ y = [596962700, 596867294, 595642242, 595683708, 595364799, 594653168, 594286232, 595264854, 596370277, 597912979, 599593430, 600756836, 602424660, 603369179, 604175377, 604204063, 603911514, 603136673, 602066498, 601730957, 600399361, 598206100, 596515579, 595654488, 593538017, 592264290, 591625977, 588604469, 585026550, 581502533, 578935242, 576818123, 574113617, 570764313, 568214607, 566935730, 565441208, 564321976, 562807236, 561477699, 560827560, 560208282, 559343681, 557942276, 556854134, 555793686, 555206566, 554569283, 553838005, 553555222, 553199539, 552764130, 552118301, 552032433, 551869621, 551820107, 552364769, 552454376, 551487465, 550328979, 549626274, 548096619, 546518593, 544594917, 542728348, 541108551, 538739929, 536619263, 534408302, 532815475, 531582451, 530134697, 528262100]
967.3E28262100j667290n87539j283455j611481k463798k866364j989593k376862k881699
976E10534019l261108l309555l214111l043099l442344l686753l832054m514732m285927
984.7D77944336m296227m051666l700638m339485l827095l057709l595581l374710
992.4D47701225k795829k742997k543335k523536k723122k529144k380181k570457
1000.1D26892624k319183k106629k098465k474174j500321n98717j627235k005310
1007.8D12162590k377319j586457j538772j919251j498909j863632j072349j866227
1015.5C98439674j736259j591339k815895j892891j888809k463761k335052j405487
1023.2C82310181j853943j636887j096992j795578j531906j959343l38288o82907j535492
$$ y = [528262100, 526594810, 526007271, 524723816, 523112335, 520648537, 517782173, 515792580, 513415718, 510534019, 507272911, 503963356, 500749245, 497706146, 494263802, 490577049, 486744995, 482230263, 477944336, 473648109, 469596443, 465895805, 461556320, 457729225, 454671516, 451075935, 447701225, 444905396, 442162399, 439619064, 437095528, 434372406, 431843262, 429463081, 426892624, 424573441, 422466812, 420368347, 417894173, 416393852, 415795135, 414167900, 412162590, 409785271, 408198814, 406660042, 404740791, 403241882, 401378250, 400305901, 398439674, 396703415, 395112076, 392296181, 390403290, 388514481, 386050720, 383715668, 382310181, 380456238, 378819351, 377722359, 375926781, 374394875, 372435532, 372097244, 371414337, 369878845]
1031.9C69878845o33087n03120M91256K46697R65080L35617R80911K558632J645737
1040.6C75966568J223373O42624J232834M48075j86921l99971m97780m76646j370926
1049.3C76581230m34837j621552k065010j203689q70018q28934j780777j755638j624794
1058C64395981N83381J262017J636352J919098J304207K209015K516060K778854J704865
1066.6C80309830K096595J301919J049880J955643P12891J390800J62125j67160J117630
1075.3C89930153R82056j4763l00637N56755L38440J476899J290359J791077J034050
1084C97084389n41916O87218M51202R48448N76668J255379J222229N29861K218781
1092.7D04432259K117271J762352P31239R19152O28433J59492Q35762P99103J554146
$$ y = [369878845, 369245758, 368742638, 369233894, 369480591, 370445671, 370781288, 371762199, 374320831, 375966568, 377189941, 377832565, 379065399, 379513474, 379326553, 378926582, 378428802, 377952156, 376581230, 376146393, 374524841, 372459831, 371256142, 370386124, 369557190, 367776413, 366020775, 364395981, 364979362, 366241379, 367877731, 369796829, 371101036, 373310051, 375826111, 378604965, 380309830, 382406425, 383708344, 384758224, 386713867, 387426758, 388817558, 388979683, 388812523, 389930153, 390912209, 390897446, 390596809, 391153564, 391492004, 392968903, 394259262, 396050339, 397084389, 396542473, 397229691, 397680893, 398629341, 399206009, 400461388, 401683617, 402213478, 404432259, 406549530, 408311882, 409043121, 409962273, 410590706, 410750198, 411585960, 412385063, 413939209]
1101.4D13939209J478424K566757J733628O07490J840630J097564K0333K61917Q08601
1110D24354553j76887p9918N07240J253624K205963J203881M36477l13721J59874p0381
1119.7D29480705j72424J83525m90265K92664k75231K16294J313705J588516J898232
1128.4D34035721J304703J158828O74057J499977K256203K417603K594566K254753
1136.1D48196411K412720K590675K155419J035499J164131J417504J408348R19685
1143.8D61300392R8610Q99124Q63114L90396Q09631J112747N57137l41568m33045m41207
1153.4D64815331q36564j218834o18438k92053m59366l80860n60074k14080n22042
1162.1D59713020o08177p8697O57005J440125J331672J866990K596321L035202L117866
$$ y = [413939209, 415417633, 417984390, 419718018, 420325508, 422166138, 423263702, 423284035, 423545952, 424354553, 424177666, 424097748, 424604988, 425858612, 428064575, 429268456, 429704933, 429391212, 429551086, 429480705, 429308281, 429491806, 429001541, 429294205, 429018974, 429235268, 430548973, 432137489, 434035721, 435340424, 436499252, 437173309, 438673286, 440929489, 443347092, 445941658, 448196411, 450609131, 453199806, 455355225, 456390724, 457554855, 458972359, 460380707, 461300392, 461399002, 462298126, 463161240, 463551636, 464361267, 465474014, 466031151, 465689583, 465256538, 464815331, 463978767, 462759933, 462141495, 461849442, 461390076, 461009216, 460449142, 460235062, 459713020, 459104843, 459026146, 459683151, 461123276, 462454948, 464321938, 466918259, 469953461, 473071327]
1170.8D73071327L012467K327156J904068K248115K396584K337951K361374K911187
1178.5D92570229K615852K158203K099838K054940J999740J900025J480560Q41789
1186.2E07721176R47609Q66585J071625Q79898O31637L92304k04926N02129M3678q56743
1195.9E11994972n73730q43506j124306p00416l83912p04803r23195n66597n97076
1204.5E05577431r53408r18006r42231n38406k06375l69759k86636l73688j23596l08762
1214.2E00556564r69925o55746l92075m96368n69344m88472j76887k73590p26090n85327
1223.8D95222740n46112j008072n15938l68232j255837j266060n14831m31214p78350
1232.5D88538094o75507n66483k31094J15738l93639n30548m90646l83873J07231j50375
$$ y = [473071327, 476083794, 478410950, 480315018, 482563133, 484959717, 487297668, 489659042, 492570229, 495186081, 497344284, 499444122, 501499062, 503498802, 505398827, 506879387, 507721176, 508668785, 509535370, 510606995, 511486893, 512118530, 512510834, 512305908, 512808037, 512851715, 511994972, 511421242, 510577736, 509453430, 508753014, 508369102, 507664299, 506741104, 506174507, 505577431, 504624023, 503706017, 502763786, 502225380, 502019005, 501649246, 501362610, 500988922, 500865326, 500556564, 499586639, 498930893, 498538818, 498042450, 497473106, 496984634, 496807747, 496534157, 495808067, 495222740, 494676628, 493668556, 493152618, 492784386, 491528549, 490262489, 489747658, 489316444, 488538094, 487862587, 487296104, 487065010, 487180748, 486787109, 486256561, 485765915, 485382042, 485489273, 485338898]
1242.2D85338898k30294j90925m39797m35638n63736j75323K56767j82686l75214j85585
1251.8D82816467m69742j61552L82385J52932Q0528j79100k11678j9646j77497M7111
1261.4D82260208M83475M98352K31323O72798O85578K13127L68423O98281J136741
1270.1D87248306J130142O18325K48832Q27523J561203J223526P47146J018143J180878
1278.8D95804024R78241N88951M26369J159324J166306R78889J472511J719208J322365
1287.5E05616188J045151J662636J077613M84696M18968K77786N46646P59430P83959
1296.2E12673073N96390R58862N94444L48244K38190p3624J98555l32337m38766l61671
1305.8E14401360p401K93655r9754k08778m5319m42772j500511q03108m57077n22576
$$ y = [485338898, 485108604, 484917679, 484477882, 484042244, 483478508, 483303185, 483559952, 483377266, 483002052, 482816467, 482346725, 482185173, 482567558, 482720490, 482801018, 482621918, 482410240, 482390594, 482213097, 482260208, 482743683, 483242035, 483473358, 484146156, 484831734, 485044861, 485413284, 486111565, 487248306, 488378448, 488996773, 489245605, 490073128, 491634331, 492857857, 493605003, 494623146, 495804024, 496782265, 497371216, 497797585, 498956909, 500123215, 501102104, 502574615, 504293823, 505616188, 506661339, 508323975, 509401588, 509886284, 510305252, 510583038, 511129684, 511889114, 512673073, 513269463, 514228325, 514822769, 515171013, 515409203, 515335579, 515534134, 515201797, 514763031, 514401360, 514393959, 514687614, 514587860, 514379082, 514333763, 513890991, 512390480, 511587372, 511130295, 510607719]
1315.4E10607719j69105l4523N42793O4774O31828J166382R34715P91054N03998Q64601
1325.1E15904236K84767J74065j7624K899L31230l66821l21465l17611k11449l45230
1334.7E15116997m14047n7984J16615J45417o61278J40495J407280J191330O42357
1343.4E17627182O21185P51610N74265Q02917L76015J54648L0403M47540K15073k77520
1353.1E21323318L1052p77092m13322j35117k86636l81813l94783l04222n37262j79902
1362.7E17944221q78944L11661K05879m62341j77193j042671n47257l80210k36207
1371.4E14736938O8131j30959l36570m20761O77795J85165j19438j62239K6627j08261
1381E14416428q85506j086006j216469n33371o84433r03244j470490q07380m51355
$$ y = [510607719, 510438614, 510404091, 510946884, 511011658, 511643486, 512809868, 513744583, 514535637, 515039635, 515904236, 516189003, 516363068, 516345444, 516348343, 516679573, 516312752, 515991287, 515673676, 515462227, 515116997, 514702950, 514644966, 514761581, 514906998, 514245720, 514386215, 515793495, 516984825, 517627182, 518248367, 518999977, 519574242, 520377159, 520753174, 520907822, 520938225, 521385765, 521600838, 521323318, 521354370, 520577278, 520163956, 520028839, 519742203, 519360390, 518965607, 518661385, 518124123, 517944221, 517065277, 517376938, 517582817, 517120476, 516943283, 515900612, 515353355, 514973145, 514736938, 514805069, 514674110, 514337540, 513916779, 514594574, 514779739, 514660301, 514498062, 514524689, 514416428, 513530922, 512444916, 511228447, 510695076, 510010643, 509107399, 507636909, 506829529, 506378174]
1389.7E06378174j658287j689720j700364q58306k001458l409500j306686j661911
1397.4D92091942j576233l279991k040863r38683k068252j743851j397896k022247
1405.1D77023926k333946j614151j832276j571426j261101k167358j624985j192513
1412.8D63426170r35363o83709r42916j276703j440049m0702k338753k22588J237297
1421.5D56782684j11274J33705p67365L79792Q46862L08647J140480N26848L71704
1430.2D59612083N83840J474647J286850J247559K122078Q88786m43191J446075K633400
1438.9D70852127J808090J516495J663170J061058J331024Q51555J408958J037445
1446.6D81529922Q16536Q92144J757316K127686O63795J408158J199989J777458J626129
$$ y = [506378174, 504719887, 503030167, 501329803, 500471497, 498470039, 495060539, 493753853, 492091942, 490515709, 487235718, 485194855, 484256172, 482187920, 480444069, 479046173, 477023926, 474689980, 473075829, 471243553, 469672127, 468411026, 466243668, 464618683, 463426170, 462490807, 461807098, 460864182, 459587479, 458147430, 458106728, 455767975, 455545387, 456782684, 456671410, 456805115, 456037750, 456417542, 457264404, 457573051, 458713531, 459240379, 459612083, 460195923, 461670570, 462957420, 464204979, 466327057, 467215843, 466772652, 468218727, 470852127, 472660217, 474176712, 475839882, 476900940, 478231964, 479083519, 480492477, 481529922, 482346458, 483238602, 484995918, 487123604, 487787399, 489195557, 490395546, 492173004, 493799133]
1455.3D93799133K67220Q55675k20833L476181J870689K559281J950607J378479K249603
1464E08186035O3515K029571K218705K207832K162361K533112L149147J792450J673965
1472.6E26016693K540932L958053K731247J514473K200547K289123K077103J600799
1480.3E44928970J435585J324082J784324J637574J270942J224709k1973M94499J211281
1489E55289993q60595r9602M90150L37563M921j53580o37169l919296O62422j015434
1498.7E50099373k263680M79050o58417p94601o25992O63033Q3046p111512o346359
1507.3E33523941K886887L420181m68483N26428j114158j997529L72887p96471o96945
1516E35656738k485847j356545J926537J393776j481400l888054L78571K453690K200050
$$ y = [493799133, 494066353, 494922028, 494701195, 498177376, 500048065, 502607346, 504557953, 505936432, 508186035, 508249550, 510279121, 512497826, 514705658, 516868019, 519401131, 522550278, 524342728, 526016693, 528557625, 532515678, 535246925, 536761398, 538961945, 541251068, 543328171, 544928970, 546364555, 547688637, 549472961, 551110535, 552381477, 553606186, 553584213, 554078712, 555289993, 554429398, 554329796, 554819946, 555157509, 555162430, 555008850, 554371681, 550452385, 551114807, 550099373, 547835693, 548314743, 547656326, 546861725, 546235733, 546898766, 546981812, 539870300, 533523941, 536410828, 539831009, 539362526, 539888954, 538774796, 536777267, 537150154, 536353683, 535656738, 533170891, 531814346, 533740883, 535134659, 533653259, 529765205, 530143776, 532597466, 534797516]
1524.7E34797516j448898L22456J242409M22630J190643P59621N70030N85213k2049
1533.4E38419571k669106J311074J300773N75791J223373l607368j620636L073120
1541.1E38006592J202888o19430J728744P34597j752472J824951O45599Q22296m63218
1549.8E42130547j015358J609268N72891J279335k455902P0190K080384N73425m191361
1558.5E40653419j1035194O966362J692543J226921n91202r38797k538757k004738
1566.2E33430557n6457j707802r70192p015038j287384j081314l168716k363281k606812
1574.9E13173561j890335j1633949m56848k201043l428001k961121m800682l105392
1582.6D82696190n308457l790588m558372l797760l982239n133705l285141n300370
$$ y = [534797516, 533348618, 533671074, 534913483, 535336113, 536526756, 537286377, 537856407, 538441620, 538419571, 535750465, 537061539, 538362312, 538938103, 540161476, 536554108, 534933472, 538006592, 539209480, 538590050, 540318794, 541053391, 539300919, 541125870, 541771469, 542593765, 542130547, 541115189, 542724457, 543297348, 544576683, 542120781, 542190971, 544271355, 544844780, 540653419, 529618225, 536584587, 538277130, 539504051, 538912849, 537974052, 535435295, 533430557, 533374100, 531666298, 530696106, 523681068, 522393684, 521312370, 518143654, 515780373, 513173561, 511283226, 499649277, 499192429, 496991386, 493563385, 490602264, 485801582, 482696190, 477387733, 473597145, 469038773, 465241013, 461258774, 456125069, 452839928, 447539558]
1590.3D47539558k870521n086556l577957l660316m473877k677994m670906k234192
1598D18287239m434166k485351l497124l148880k236824m179154q75396l298874j464196
1606.7C92667274k967605j229859j542892l174553L02353k676468j23100j795921j38779
1615.4C79320450j227760o356087L257866n67360R37538j236382R28078j086388k982177
1624C70987778K207260M0092J907959j676750J416741P98034M87213J007805k67410
1632.7C76908722K389870O59256J48239j853104L208160J428147J036033K594986M81720
1641.4C87002029K398110L03230K559128K169647o11381K052230j080398M277916J370354
1650.1D00440865L159408K488518o97174n55229j06812M491310J573906K893944J708145
$$ y = [447539558, 444669037, 439582481, 436004524, 432344208, 427870331, 425192337, 420521431, 418287239, 413853073, 411367722, 407870598, 404721718, 402484894, 398305740, 397430344, 394131470, 392667274, 389699669, 388469810, 386926918, 383752365, 384054718, 381378250, 381255150, 379459229, 379320450, 378092690, 371736603, 374994469, 374427109, 375364647, 374128265, 375056343, 373969955, 370987778, 373195038, 373235130, 375143089, 373466339, 374883080, 375681114, 376168327, 377176132, 376908722, 379298592, 379957848, 380106087, 378252983, 381461143, 382889290, 383925323, 386520309, 387002029, 389400139, 389703369, 392262497, 394432144, 393820763, 395872993, 394792595, 399070511, 400440865, 403600273, 406088791, 405391617, 404836388, 404729576, 409220886, 410794792, 413688736, 415396881]
1658.8D15396881J886330K279052K345353L085632m70581L228607K104988L077660
1666.5D32933922L231735K474251K568168J024399M624481K205353L628502L605728
1674.2D56296539K256050J546441L614769M903335K883568L744507K536278M770736
1681.9D82552223N651398P22771J824722L763657O175689M028130L694687M206772
1689.6E12620049L387107M551354M186554M438324M406128L892479J169738N209847
1697.3E43861580N362968N977593L779030l491860P361717N253220M363976K787437
1705E75255661K394524K560386K944031L692284J800956J489907K803383K794303K360192
1713.7E98095627P29790R52415L141670N27611m707222M589424L686371K349701J762428
$$ y = [415396881, 417283211, 419562263, 421907616, 424993248, 424522667, 427751274, 429856262, 432933922, 436165657, 438639908, 441208076, 442232475, 446856956, 449062309, 452690811, 456296539, 458552589, 460099030, 463713799, 468617134, 471500702, 475245209, 477781487, 482552223, 488203621, 488926392, 490751114, 494514771, 500690460, 504718590, 508413277, 512620049, 516007156, 520558510, 524745064, 529183388, 533589516, 537481995, 538651733, 543861580, 549224548, 555202141, 558981171, 555489311, 562851028, 568104248, 572468224, 575255661, 577650185, 580210571, 583154602, 586846886, 588647842, 590137749, 592941132, 595735435, 598095627, 598825417, 599777832, 602919502, 603447113, 598739891, 603329315, 607015686, 609365387, 611127815]
1722.4F11127815O43997P76215J587334J547279R74693J331673J541596p64924N07660
1731.1F19273338L389855K970047j487808l104363M421349L775596K159844K827034
1738.8F34224892K80456q60748L514175K417641J226501J938935L472366L186493K263031
1747.5F51663742K266922J617889M258042R48105R64203M419479K734146K944260K336578
1756.2F74153366K07596K177353K992706K439957K376938r12171N61142L462601J873398
1764.8F89332886J493530J956024J767960j391297K046280M025116J9455k251053q54797
1773.5F96144104M025192J818009n17807K202987P13807J591186M29153j229553J308289
1782.2G06485367K226715J661301q92640K47803J414414R06601M55551J161422J241990
$$ y = [611127815, 611771812, 612548027, 614135361, 615682640, 616657333, 617989006, 619530602, 618765678, 619273338, 622663193, 625633240, 624145432, 621041069, 625462418, 629238014, 631397858, 634224892, 634505348, 633644600, 637158775, 639576416, 640802917, 642741852, 646214218, 649400711, 651663742, 653930664, 655548553, 659806595, 660754700, 661718903, 666138382, 668872528, 671816788, 674153366, 674360962, 676538315, 679531021, 681970978, 684347916, 683435745, 683996887, 687459488, 689332886, 690826416, 692782440, 694550400, 693159103, 695205383, 699230499, 699249954, 696998901, 696144104, 700169296, 701987305, 701469498, 703672485, 704386292, 705977478, 706406631, 705177078, 706485367, 708712082, 710373383, 709480743, 709728546, 711142960, 712049561, 712505112, 713666534, 714908524]
1790.9G14908524L50875k383956j24589L797532Q46557o44912J041641J565704O78558
1799.5G20035934q15277J763001k75116O80237K107238N87922N87921J85852L31497
1808.2G25189209O39038J025009q22296j0452R83658M90265J314926M56390Q03452
1816.9G30069199k15073L01132R12476k15302Q25959m9286R88159R21249k433014K08206
1826.5G31313705K387314J944428m56696k654571N82351J897354P6066M6615O57578
1835.2G35794144M32739O4850l25012J390991N77621M35257J28403N16510M00009m143906
1844.9G35271606K100449J977997j26877j48315O92520J052475R7580M96750m08097
1853.6G41006088n1117n6228j64643N45502K61459P26777Q2473N36347K49786M83933
$$ y = [714908524, 715259399, 712875443, 712750854, 716548386, 717394943, 716750031, 717791672, 719357376, 720035934, 719220657, 720983658, 720708542, 721388779, 723496017, 724083939, 724671860, 724857712, 725189209, 725828247, 726853256, 726030960, 726020508, 727004166, 727494431, 728809357, 729265747, 730069199, 729854126, 730155258, 731067734, 730852432, 731678391, 731629105, 732617264, 733538513, 731105499, 731313705, 733701019, 735645447, 735188751, 732534180, 733116531, 735013885, 735089951, 735136566, 735794144, 736226883, 736291733, 735966721, 737357712, 737935333, 738370590, 738498993, 739015503, 739415512, 735271606, 737372055, 739350052, 739223175, 739074860, 739767380, 740819855, 740917435, 741414185, 741006088, 740954971, 740898743, 740734100, 741279602, 741541061, 742267838, 742350311, 742886658, 743136444, 743620377]
1863.2G43620377K68859k71606M30374q47931M11377j126785r36585J615067R06448
1871.9G44069595P77359j00555K69241j8081O7977q1253j86767J35116n52291N08956
1881.5G44889297M82407R30023K79999k80304L12424m42276O68335k59857j318589
1890.2G45261459L97568N19867L49884R72366L65906q20541N50995l128N4702r5596
1899.8G47553482l37601M87824j24054K54059j74408K65884N36041j46331j29624k60772
1909.5G47924500j60141k59781L45764k67716M85001P81403M17404R48868j765976
1918.2G48449326l82233R14078K52533j5030j048279n45502P7362P27921K08740Q3771
1927.8G48722687M3182K57492L43018n94788k81448n14298l7918j08261Q0490K28424
$$ y = [743620377, 743889236, 743617630, 744048004, 743200073, 743611450, 742484665, 741548080, 743163147, 744069595, 744846954, 744746399, 745015640, 744997559, 745065536, 744984283, 744797516, 744932632, 744380341, 744889297, 745371704, 746301727, 746581726, 746301422, 746613846, 746171570, 746839905, 746580048, 745261459, 745659027, 746178894, 746528778, 747501144, 747867050, 747046509, 747597504, 747594376, 747649078, 747553482, 747215881, 747703705, 747579651, 747833710, 747659302, 747925186, 748461227, 748314896, 748185272, 747924500, 747764359, 747504578, 747850342, 747582626, 748067627, 748849030, 749266434, 750215302, 748449326, 748067093, 748981171, 749233704, 749218674, 748170395, 747624893, 747702255, 748430176, 748638916, 748722687, 748765869, 749023361, 749366379, 748771591, 748490143, 747975845, 747937927, 747829666, 747910156, 748138580]
1937.5G48138580j15204N41306J00250Q82263k87246j434021K88162J50452j9379m50058
1947.1G47795105L54156L31269J58462p4539j18561K05384n68848j2131m38690j31454
1956.7G47500153J89285m10156K08511K28806K43530k01340N1575o8512k76489j5488
1966.4G47449875o85883l54385K98309O76041J09787J45645J75400k45209k76565m63410
1976G46829605L43628L01209j7395m55323l92227J3046k60467K28729Q2550K9907j12838
1986.6G46590424j12534l12729l76663M73709k4719l89786R1171M15039l41720l42865
1996.3G45669327J76010l52860n4626j85547r766j44195j70975K3499o1417K41165
2005.9G45130615k42767L9749l66821j93939J96991l58658l4333j59072P2326j1902
$$ y = [748138580, 748023376, 748564682, 748664932, 749547195, 749259949, 747825928, 748114090, 748264542, 748245163, 747795105, 748149261, 748480530, 748638992, 748564453, 748445892, 748651276, 748082428, 748070297, 747631607, 747500153, 747689438, 747279282, 747487793, 747716599, 747960129, 747758789, 747810364, 747741852, 747465363, 747449875, 746763992, 746409607, 746707916, 747383957, 747493744, 747639389, 747814789, 747569580, 747293015, 746829605, 747173233, 747474442, 747457047, 747001724, 746609497, 746622543, 746362076, 746590805, 746673355, 746703262, 746590424, 746477890, 746165161, 745788498, 746262207, 746237488, 745847702, 745938873, 746353912, 746012192, 745669327, 745845337, 745492477, 745437851, 745252304, 745242538, 745098343, 744927368, 744950867, 744889450, 745130615, 744887848, 744927597, 744560776, 744366837, 744563828, 744205170, 744170837, 744011765, 744084091, 744072189]
2015.6G44072189o8435n08728k47040J81656k07215N62821j29852j90278l5934l73459
2025.2G43055725m83475o33926L70560k09046q3999K47192l7537j66931m02984N4321
2034.9G41709900l62473k7465j34278q8653M6615m16946K670j0528M66461J32751k51236
2045.5G41066818k80761K3422R4909o94656k00043j86767M6386j51062k7847K86789
2055.1G39977188j45416K36282l23410r8038k18505j88599N9128k84653J09253m47922
2064.7G38675308J7014J65558K74429L20435L0899M46090l11889l40729m64630k10495
2074.4G38601990K1820l0441K70462k79923j54114j77078K11945r079l01285j56555
2084G37997742k92969J99661k31094J21765K22244J81504Q3999n64422n9662p4539
$$ y = [744072189, 744003754, 743495026, 743247986, 743429642, 743222427, 743785248, 743655396, 743465118, 743429184, 743055725, 742572250, 741938324, 742308884, 742099838, 742015839, 742263031, 742225494, 742058563, 741655579, 741709900, 741347427, 741319962, 741185684, 741097031, 741143646, 740726700, 740729370, 740718842, 741185303, 741318054, 741066818, 740786057, 740809479, 740904388, 740209732, 740009689, 739822922, 739869308, 739718246, 739690399, 739977188, 739831772, 740068054, 739744644, 739646606, 739428101, 739239502, 739298630, 739013977, 739123230, 738675308, 738692322, 738857880, 739132309, 739452744, 739483643, 739929733, 739617844, 739277115, 738812485, 738601990, 738623810, 738593369, 738863831, 738583908, 738429794, 738252716, 738464661, 738455582, 738154297, 737997742, 737704773, 737904434, 737673340, 737795105, 738017349, 738198853, 738282852, 737718430, 737658768, 737584229]
2093.7G37584229k48871o11649q011L97797N2566j76696o71463L94210L54615l69339
2103.3G36697388l97187k14920j98822l46069N8060o2561L84369m9134k34222L25928
2113G35962830L7155n8975n31998m70352m00162O2866P6447k06528O6147L6392K84348
2123.6G34858170k10877Q0032j3885k15607j59225n46723L86200N87998N85861l04871
2133.2G35047073l93066K07138n13458J40686K32696j14059l43552r5215J52817j4801
2142.9G34306259J74484j40838L51181n2109m15726K45514K91672j87531n07278J1444
2152.5G34077072K33460N43747j2513l7460K76260q7356K8839m75311q6365l68500
2162.1G34091873k45437N62362R6054K63291L29055J74180l58811j99814K9068N3330
$$ y = [737584229, 737335358, 736723709, 736715698, 737113495, 737166061, 736989365, 736317902, 736712112, 737066727, 736697388, 736300201, 736085281, 735886459, 735540390, 735598450, 735535889, 735920258, 735871124, 735636902, 735962830, 735999985, 735941010, 735409012, 734938660, 734538498, 734601364, 734677811, 734471283, 734537430, 734573822, 734858170, 734647293, 734727325, 734713440, 734497833, 734338608, 733791885, 734178085, 734766083, 735351944, 735047073, 734654007, 734861145, 734347687, 734488373, 734721069, 734607010, 734263458, 734168243, 734321060, 734306259, 734480743, 734339905, 734691086, 734638977, 734223251, 734468765, 734760437, 734572906, 734065628, 734077072, 734310532, 734854279, 734841766, 734804306, 735080566, 734993210, 735022049, 734546738, 734460373, 734091873, 733846436, 734408798, 734504852, 734768143, 735097198, 735271378, 734912567, 734712753, 734741821, 734795151]
2171.8G34795151J24969k70843J23901r5673J67389L60337K46582O9122k52151K07290
2181.4G35476074j26953J88370k3804l31497j17111O0806M32282k46354l2348p7057
2191.1G35202408J32751K76490J60446K98538l53623L68577Q6517l49503r1858K2355
2200.7G35753098L23867K05002L29285k81830l9444j63040n7144K38418l68347K06375
2210.4G36146240N8899K89459k03857n40848L72544J80816o103J8310M10309m6005
2220G36679764j07193k96784l22723M20074n6915J19095j63879l6850L16543J34888
2229.7G36686020p1793l86505Q0948k83813K04544M27169J70289m7837n60608q5907
2239.3G36132507k53753J18408J10855J50070q9950m64325L01361m9591J29547K4566
$$ y = [734795151, 734920120, 734649277, 734773178, 734677505, 734844894, 735205231, 735451813, 735520935, 735268784, 735476074, 735349121, 735537491, 735513687, 735182190, 735065079, 735125885, 735558167, 735311813, 735279465, 735202408, 735335159, 735611649, 735772095, 736070633, 735717010, 736085587, 736172104, 735822601, 735730743, 735753098, 736076965, 736281967, 736611252, 736329422, 736289978, 736126938, 736069794, 736308212, 735939865, 736146240, 736205139, 736494598, 736290741, 735749893, 736122437, 736303253, 736297150, 736315460, 736725769, 736679764, 736572571, 736275787, 735953064, 736373138, 736316223, 736435318, 736271439, 736234589, 736551132, 736686020, 736614227, 736227722, 736308670, 736024857, 736229401, 736656570, 736826859, 736779022, 736218414, 736132507, 735878754, 735997162, 736108017, 736258087, 736168137, 735703812, 736005173, 735955582, 736085129, 736109695]
2248.9G36109695M5624K9297j44043N3864l07694L28674K26136L50799j75323n44968
2258.6G35972061J7166l65905L38363Q5602j2360N646j1215L59878j88598l91693m78440
2269.2G35330505O28662K88163j84326K51617l11585k136M5166K47116j7624j07498
2278.8G36168060k63672l60260J40152k59323J94855k15683j86081K85568L9368M14047
2288.5G35957031N1346j08108l90473k29263k67487m16641o2408j36872K33689K59094
2298.1G34889908K87704J9532J28860k61993p32270k43606l40576M01611J66321M654
2307.8G34320145J43280L24630M17023n96390K19880j49613k66113K0218o77262j88827
2317.4G33566971l3951K51160l76282o60782p96127M99420J335144o25992J45645J113282
$$ y = [736109695, 736155319, 736184616, 736040573, 736094437, 735786743, 736115417, 736341553, 736692352, 736517029, 735972061, 735989227, 735623322, 735961685, 736047287, 736034927, 736040573, 736029358, 736389236, 736200638, 735808945, 735330505, 735959167, 736247330, 736063004, 736314621, 736003036, 736000900, 736046066, 736293182, 736275558, 736168060, 735904388, 735544128, 735684280, 735424957, 735619812, 735404129, 735218048, 735503616, 735542984, 735957031, 736008377, 735900269, 735509796, 735280533, 735013046, 734596405, 734533997, 734397125, 734630814, 734889908, 735177612, 735197144, 735326004, 735064011, 734331741, 734088135, 733747559, 734149170, 734315491, 734320145, 734463425, 734788055, 735205078, 734608688, 734828568, 734678955, 734412842, 734433060, 733755798, 733566971, 733533020, 733784180, 733407898, 732747116, 731950989, 732450409, 733785553, 733159561, 733305206, 734418488]
2327.1G34418488M82330p22962l7918M1046j081466j46332J05896O10352K03094k10648
2336.7G33661880p65914n43290K49100J26038p6371j123046J70593k3956j59836L46832
2346.3G31862030j55640N9128P8583M88205p36389o65283k42768j67007J084137J2817
2356G31617813J090851o74439o16226J40839n9281N07889n58319J654511j331940k776337
2365.6G28995361r74807J112365J297684r91287N4321n78766M0207M07562k56042j57395
2375.3G28949203n94635m15725m29840q9035l28064p5074k26287m74015K39868j05743
2384.9G26450653k23007j93176j0071j03531P4310K43607n18265m70505m29840l1433
2394.6G24788742p629q0414o6910j84174K34910m07105l45612k51617m40903j91879
$$ y = [734418488, 734900818, 734177856, 734139938, 734180984, 733099518, 732953186, 733059082, 733669434, 733872528, 733661880, 732895966, 732352676, 732601776, 732727814, 732651443, 731528397, 731698990, 731675034, 731515198, 731862030, 731706390, 731765518, 731844101, 732332306, 731595917, 730930634, 730687866, 730520859, 731604996, 731617813, 732708664, 732034225, 731417999, 731558838, 731499557, 732007446, 731449127, 733103638, 731771698, 728995361, 728020554, 729132919, 730430603, 729439316, 729493637, 728914871, 728955078, 729362640, 729106598, 728949203, 728354568, 727938843, 727509003, 727419968, 727091904, 727016830, 726790543, 726316528, 726556396, 726450653, 726227646, 726034470, 726024399, 725920868, 725995178, 726238785, 725720520, 725250015, 724820175, 724788742, 724781113, 724700699, 724633789, 724449615, 724684525, 724277420, 723931808, 723680191, 723239288, 723047409]
2404.2G23047409k60162o0730J8921J2893k69546j3809l54844n00106R460k30408l5324
2414.8G21363754m15497k80609o9732o3630J66474k03323m82712p20902O3935j60065
2424.5G19197693m67835k04925m86984Q6746O3324R918l31955m09851k40402m43421
2434.1G16772308k34756n92270j65634J21536j8310K3727j47247l23258m20990j37024
2443.7G14878082m59366m27780m85611m45175m4250K7160K10114k07749j70669l20664
2453.4G12554092l63540k95258n18493k32773k30179Q2474n9967o3706j81732n42450
2463G10148468m94690p05566j45569r0103o6758k7084j44882L9215l64075l47442n13764
2473.6G07287750n19256m38614m68369j25732k67563n53055l71704r6130j60752L0442
$$ y = [723047409, 722787247, 722726517, 722745438, 722758331, 722488785, 722474976, 722120132, 721620026, 721629486, 721399078, 721363754, 720948257, 720667648, 720597916, 720534286, 720700760, 720497437, 720014725, 719293823, 719357758, 719197693, 718729858, 718524933, 718037949, 718124695, 718188019, 718197937, 717865982, 717456131, 717215729, 716772308, 716537552, 715945282, 715779648, 715901184, 715882874, 715906601, 715759354, 715436096, 715015106, 714878082, 714418716, 713990936, 713505325, 713060150, 713015900, 713043060, 713253174, 713045425, 712874756, 712554092, 712190552, 711895294, 711376801, 711144028, 710913849, 710996323, 710936356, 710872650, 710690918, 710148468, 709653778, 708948212, 708802643, 708712540, 708645782, 708618698, 708473816, 708513031, 708148956, 707801514, 707287750, 706768494, 706329880, 705861511, 705735779, 705468216, 704915161, 704543457, 704447327, 704286575, 704317017]
2483.3G04317017l35083n38941m85611j52283L82767m84772j86538k00653p51038n41611
2492.9G01023254n70068J03531j06278n59768r45969m64554Q3008n55801j59302p4387
2502.6F97773666j03302k42233j29623q9951p14950m95987n91813l43170j61972l61404
2512.2F94539261m22897m18473k47879j12304j374p85064m43650K060j31454j3352
2521.9F91964874o28280k93045j12687j67541l52860o64749j36490j83487l02581j81732
2531.5F88941422j50223l15933l38517m04739m88815l19672l93829j17951l7155k36511
2541.1F86138077m01459k67334l97797l54385L36685p6828l19061n20325o37130m67835
2550.8F83032608p63245k62985L6850j41144j45416J72196o6605n97992m75998m26865
$$ y = [704317017, 703981934, 703442993, 702957382, 702805099, 703187866, 702703094, 702516556, 702315903, 701564865, 701023254, 700453186, 700556717, 700450439, 699890671, 698944702, 698480148, 698563156, 698007355, 697848053, 697773666, 697670364, 697428131, 697298508, 697208557, 696493607, 695997620, 695405807, 695062637, 694900665, 694539261, 694116364, 693697891, 693450012, 693337708, 693336334, 692551270, 692107620, 692109680, 691978226, 691964874, 691336594, 691043549, 690930862, 690763321, 690410461, 689745712, 689609222, 689425735, 689123154, 688941422, 688791199, 688475266, 688136749, 687732010, 687243195, 686923523, 686529694, 686411743, 686374588, 686138077, 685736618, 685469284, 685071487, 684717102, 685053787, 684976959, 684657898, 684137573, 683500443, 683032608, 682269363, 682006378, 682043228, 681902084, 681756668, 681928864, 681862259, 681264267, 680788269, 680361404]
2560.4F80361404l25470p15103n99975j33896k09503r6283j51673k66418k15912k55966
2570.1F77391205o75125m64936j37786j42518l78723n14297J11770l1280N6915l50189
2579.7F74865036p43027j50223n09109o53687n92575P3929K23007j59225k52914n91279
2589.4F71509933q3923k89307k54516j47934n34973o77872q65860l12881o3248J85699
2599F68465118n4473j21918k11182o32248k02789o85501o83594n01404l27224l6698
2608.6F65008087l26691j07879p7591K13394k67487o54830o60859p14492p401n05676
2618.3F61898575o31104k88620k66113M7379r3384n08652n89218j96762m76151p38907
2627.9F58157043o84509n47333l01590q5983Q6365l54004l72086l23028n71213p35245
$$ y = [680361404, 680035934, 679320831, 678720856, 678586960, 678377457, 678281174, 678129501, 677863083, 677647171, 677391205, 676716080, 676251144, 676113358, 675970840, 675592117, 675077820, 675189590, 675158310, 675215225, 674865036, 674122009, 673971786, 673462677, 672808990, 672216415, 672290344, 672513351, 672354126, 672101212, 671509933, 671426010, 671136703, 670882187, 670734253, 670199280, 669521408, 668655548, 668342667, 668279419, 668465118, 668410645, 668288727, 668077545, 667445297, 667242508, 666557007, 665873413, 665372009, 665044785, 665008087, 664681396, 664573517, 664495926, 664709320, 664441833, 663787003, 663126144, 662411652, 662404251, 661898575, 661267471, 660978851, 660712738, 660760117, 660666733, 660158081, 659568863, 659372101, 658895950, 658157043, 657472534, 656925201, 656623611, 656537628, 656623993, 656269989, 655897903, 655574875, 655003662, 654268417]
2637.6F54268417m17938n10635r56345O2790J58997k95945j21002j41449j42059m87366
2647.2F51417465o89010q47550o07223m61655l45154n8288j34736J9303j6480r0484
2656.9F48186188m47159o71005o88706p52868n42374m04892k12097k27127J7471K0371
2666.5F44277802J74026q8577q73184m56467l84445j37177j85699m74396p5913k69928
2676.1F41506042k99835J9074O7901q80127r01107j82000k84462k29263m08745k03094
2685.8F38204384l11279m48304j12266J13334o5994q07075o34613m12522j99318k08053
2695.4F35118294l00446j8081j42594p591j22109j33247n69572n74761j63269o91871
2705.1F32394753k52495J5907p2746l9101m47617o27212k48642O2065j52244k10076
$$ y = [654268417, 653850479, 653339844, 652383499, 652446289, 652605286, 652309341, 652188339, 652046890, 651904831, 651417465, 650728455, 649880905, 649273682, 648812027, 648466873, 648408585, 648273849, 648293152, 648276672, 648186188, 647739029, 647068024, 646379318, 645626450, 645084076, 644679184, 644467087, 644239960, 644257431, 644277802, 644451828, 644363251, 643490067, 643033600, 642649155, 642511978, 642326279, 641851883, 641775970, 641506042, 641206207, 641225281, 641293182, 640413055, 639511948, 639329948, 639045486, 638816223, 638407478, 638204384, 637893105, 637444801, 637332535, 637445869, 637379875, 636572800, 635938187, 635525665, 635326347, 635118294, 634817848, 634799767, 634657173, 634649582, 634527473, 634394226, 633824654, 633249893, 633086624, 632394753, 632142258, 632158165, 632085419, 632046318, 631598701, 630971489, 630722847, 630784912, 630632668, 630422592]
2714.7F30422592o86378n01137j12572j34048o3896m81682J6288J39809k95601l53546
2724.4F27949829m47044l59001l66745k81601j44081K28233j49079p23342o61698j1520
2734F25033951L97835n89257l83835j49765n14030J06888K08473j57051n02472k71034
2743.7F23179703J98211K53602m5395l36075n06554m37508J79863K48909k28920o24923
2753.3F21880913l30277M20r6932k70652l12653l7537m89463l69873j06888j97144
2762.9F19669914k10609n14031o9122k1629j42937p17049p86590J17950J00937L3226
2772.6F17460060l66974j28593k83928o40869p0000l53126m84047o23284m4021K32658
2782.2F14697876o83098q76884o09475j55181q2703n226m6082l28407p28340o35491
$$ y = [630422592, 629736214, 629235077, 629122505, 628988457, 628924561, 628442879, 628459167, 628598976, 628303375, 627949829, 627502785, 627143784, 626777039, 626495438, 626351357, 626579590, 626430511, 625707169, 625045471, 625033951, 625431786, 624842529, 624458694, 624308929, 623794899, 623901787, 624110260, 623953209, 623450737, 623179703, 623377914, 623631516, 623586121, 623250046, 622743492, 622305984, 622485847, 622734756, 622505836, 621880913, 621550636, 621551056, 621454124, 621183472, 620870819, 620833282, 620343819, 619973946, 619867058, 619669914, 619459305, 618945274, 618876152, 618854523, 618711586, 617994537, 617207947, 617325897, 617426834, 617460060, 617093086, 616964493, 616680565, 616039696, 615969696, 615616570, 615132523, 614509239, 614465218, 614697876, 614014778, 613137894, 612528419, 612373238, 612290535, 612285309, 612239227, 611910820, 611182480, 610546989]
2791.9F10546989k55432m58374k1782k88696o23054n35737p26509l41796m60968p85218
2801.5F06049423p82547l40118l71857o42357n78689n89028l0975k632o49567j254845
2811.2F00806808p52983k77366o99120o55021n93453m37469p73278n98564k23465l60145
2820.8E95435944m43802j051216p88308q00705p49511l64876p69806p68051q00285
2829.5E88899384n82886m19960o79436q70972r33189j252747j015205m01726j043663
2838.2E81699600j137199j332512j455994r66758j468506j823769j824341j461105
2845.9E70229416j563721j974449k085342j747818j070443j367034j151925n66749
2853.6E58701935m14391n77507n37605j50337k42005J42784K20681J7662j84708n60226
$$ y = [610546989, 610291557, 609833183, 609811401, 609522705, 608899651, 608363914, 607637405, 607295609, 606834641, 606049423, 605266876, 604926758, 604554901, 603912544, 603333855, 602744827, 602713852, 602711220, 602061653, 600806808, 600053825, 599776459, 599077339, 598422318, 597828865, 597391396, 596618118, 596019554, 595796089, 595435944, 594992142, 593940926, 593152618, 592351913, 591602402, 591237526, 590467720, 589699669, 588899384, 588316498, 587896538, 587217102, 586346130, 585412941, 584160194, 583144989, 582743263, 581699600, 580562401, 579229889, 577773895, 576807137, 575338631, 573514862, 571690521, 570229416, 568665695, 566691246, 564605904, 562858086, 561787643, 560420609, 559268684, 558701935, 558287544, 557710037, 557172432, 557022095, 556780090, 556922874, 557143555, 557161217, 556976509, 556416283]
2863.2E56416283o21758m70085k88315p62405q32787p21931q69522r29909n82962p1945
2872.9E50264664m52004l89442j39504j52359n58738r42154o13938o09665p73582j257553
2882.5E44375725j027718l27759L6240j70746j076813q04977n91965r94606r82246
2891.2E38435135r38873j361542r55887J78719l31574q24661j162758j307716p62368
2899.9E30968475n08842o29997j211434m90494j98021l65142j99738j121063j057510
2908.6E25186234p29943p82127j022988j194725j010284j247902j249885j576272j192703
2917.2E15179405o37359j310692j320343j042023r20029m51851k28271m10996n83534
2925.9E08274307k07824M01496K96212J96342K10152o1226J78451K66800K33612L83416
$$ y = [556416283, 555794525, 555324440, 555036125, 554273720, 553440933, 552719002, 551849480, 550919571, 550336609, 550264664, 549812660, 549423218, 549283714, 549131355, 548572617, 547630463, 547016525, 546406860, 545633278, 544375725, 543348007, 543020248, 543056488, 542885742, 541808929, 541003952, 540411987, 539417381, 538435135, 537496262, 536134720, 535178833, 535357552, 535025978, 534201317, 533038559, 531730843, 530968475, 530459633, 529829636, 528618202, 528127708, 527929687, 527564545, 527364807, 526243744, 525186234, 524456291, 523674164, 522651176, 521456451, 520446167, 519198265, 517948380, 516372108, 515179405, 514542046, 513231354, 511911011, 510868988, 509948959, 509497108, 509268837, 508857841, 508274307, 508066483, 508467979, 508764191, 508960533, 509170685, 509109459, 509287910, 509554710, 509788322, 510171738]
2935.6E10171738N04417O02646O31256O92062O76079Q60176P41005O53191N80978M63410
2945.2E16576958N98678K15226J23558L08799N61447Q62771Q84323J10359m38156N42717
2954.8E20346680M71725J51863N25513M17252J1978j24932O81115Q29658P65686N85136
2964.5E24661674M82941O26030q7814L52897J104851R66988N74760N90706R81293P12700
2974.1E30967026L66134J78566N04189M58641P8735K48375L16010M95910N42450M80538
2983.8E34636574K95639j9341j07765K1820n8975j32332J47896M68330N59807j66511
2993.4E35645142J07803K92549m26483j06697n14832o88324m63600m51507M6386l7231
3003.1E33403206k76680n53398m03404k26784m83094o78024q07075l45383J06583l17307
$$ y = [510171738, 510676155, 511278801, 511910057, 512602119, 513278198, 514138374, 514879379, 515532570, 516113548, 516576958, 517175636, 517390862, 517514420, 517823219, 518384666, 519247437, 520131760, 520242119, 519803963, 520346680, 520818405, 520970268, 521495781, 521913033, 521925011, 521800079, 522481194, 523310852, 524076538, 524661674, 525144615, 525770645, 525682831, 526035728, 527140579, 528107567, 528682327, 529273033, 530254326, 530967026, 531333160, 531511726, 532015915, 532474556, 532553291, 532801666, 533117676, 533613586, 534156036, 534636574, 534932213, 534912872, 534805107, 534826927, 534767952, 534635620, 534783516, 535251846, 535811653, 535645142, 535752945, 536045494, 535619011, 535512314, 534997482, 534309158, 533845558, 533394051, 533440437, 533403206, 533126526, 532573128, 532169724, 531942940, 531459846, 530781822, 529974747, 529629364, 529735947, 529418640]
3012.7E29418640r08241m86870k42157m20761o65360q63418m46243l41416k29149p37533
3022.4E24077492p30019l0784p78466q21190m99496n72815n51453r16862p41615l74375
3032E18060417m79469q06503p72705m81453n50003o60477n87807n73196n68924p16210
3041.6E11863670p25898n95780j000328p66449m64210o00548m30260n32455n89752
3050.3E06157990r21746r66186p99637q41179o67419p35627n74112m98542m92745o64139
3060D98996658o38961m16604n74340n47867r48715o10543k92434q97866r49516q51097
3069.6D92268715k85530K24228k49863j127434j114731m81376l33405m61197n17349
3078.3D87922058m97780p38640p34138p46307l91846l83682q62046l97682n02434m80346
$$ y = [529418640, 528510399, 528023529, 527781372, 527360611, 526695251, 525831833, 525385590, 525044174, 524815025, 524077492, 523347473, 523316689, 522538223, 521717033, 521217537, 520644722, 520093269, 519176407, 518434792, 518060417, 517580948, 516774445, 516001740, 515520287, 514970284, 514309807, 513722000, 513148804, 512579880, 511863670, 511137772, 510541992, 509541664, 508775215, 508311005, 507710457, 507280197, 506747742, 506157990, 505236244, 504270058, 503470421, 502629242, 501961823, 501226196, 500652084, 500153542, 499660797, 498996658, 498357697, 497941093, 497366753, 496818886, 495870171, 495259628, 494967194, 494069328, 493119812, 492268715, 491983185, 492207413, 491957550, 490830116, 489715385, 489234009, 488900604, 488439407, 487922058, 487424278, 486685638, 485951500, 485205193, 484813347, 484429665, 483567619, 483169937, 482667503, 482187157]
3087.9D82187157n34211p74345n82085n08651j95618q16536o78482p61032j274719
3096.6D76061478k61269j70441k95829m84238n71365n60418j045227p63054n21507
3105.3D71388130o77528n04341R4566l34244j225433j429825q39310J63727k68822
3114D66366920q96682j047058o76651j93138n98526q08793p41806n50689p19033q57811
3123.6D59276733o08024o47278r09576p43103m39492q38699o72188o64368j143875
3132.3D52610130j306266o14968L85933l27682o08788k44598n77584j052856j152153
3141D47111168o34537o97899p39326q36678o50673m72679n65452k39983q12912r81483
3150.6D40479546p47452m74777m44527j228752j231575p97425m35028o58645p22847
$$ y = [482187157, 481652946, 480878601, 480296516, 479787865, 479592247, 478775711, 478097229, 477336197, 476061478, 475800209, 475629768, 475333939, 474849701, 474278336, 473717918, 472672691, 471909637, 471388130, 470710602, 470206261, 470300827, 469966583, 468741150, 467311325, 466472015, 466635742, 466366920, 465470238, 464423180, 463746529, 463553391, 462954865, 462146072, 461404266, 460853577, 460134544, 459276733, 458668709, 458021431, 457111855, 456368752, 455929260, 455090561, 454418373, 453754005, 452610130, 451303864, 450688896, 451074829, 450747147, 450138359, 449893761, 449316177, 448263321, 447111168, 446476631, 445778732, 445039406, 444202728, 443552055, 443079376, 442513924, 442273941, 441461029, 440479546, 439732094, 439257317, 438812790, 437584038, 436352463, 435555038, 435120010, 434461365, 433738518]
3159.3D33738518n34935n70221m92096j164971j151771n33485o18592p92732o92482
3168D27187233n26314m76951o97327p99675o81686j113968n45807k6818n52139j025429
3177.6D20741119j566085o99730m01421n63316j52550o10428j154976j449127q49647
3186.3D13293839l50571l29971m73710p32154q03833r77211n60799o54831o90384q04405
3195.9D06915970q13942J8997p74383j118508o26335p68890n28984m84848o63071k70615
3205.6D00885391l33786j413841r66301k55737o56472m98695n24292n61142n99403
3214.3C95075722o28433o19431p29561m96712o20193q33626p37228n60036m73518o68068
3223.9C88708916p88040n86129m58870m19807m61540r75838j059151j63994J74981
$$ y = [433738518, 433203583, 432633362, 432141266, 430976295, 429824524, 429291039, 428672447, 427879715, 427187233, 426660919, 426183968, 425486641, 424686966, 424005280, 422891312, 422345505, 422318687, 421766548, 420741119, 419175034, 418475304, 418073883, 417510567, 417358017, 416747589, 415592613, 414143486, 413293839, 412943268, 412613297, 412139587, 411407433, 410603600, 409626389, 409065590, 408410759, 407720375, 406915970, 406102028, 406121025, 405346642, 404228134, 403601799, 402832909, 402303925, 401819077, 401156006, 400885391, 400551605, 399137764, 398171463, 397915726, 397259254, 396760559, 396236267, 395675125, 395075722, 394447289, 393827858, 393098297, 392601585, 391981392, 391147766, 390410538, 389850502, 389376984, 388708916, 387920876, 387334747, 386875877, 386456070, 385994530, 385018692, 383959541, 383795547, 383970528]
3232.6C83970528r43528j165847l73536k11448k57759q52852q42667m73175l59573
3241.3C78490143m26521q38852j71471j91727o31027o52313j032105n65300j04103
3249.9C73876724k89345q10890m99649k46429n40200k29148m04053m70009p24068p63130
3259.6C68899803m25415n61600m11262n54047m36668m48036n10445q1520l51257m98505
3269.2C64621048j01814M5891m81110n92384l44277m62875k21787n16548p05414k48184
3278.9C60992546m00276o39038p71942n55992J94702J37710l62968n31807o31333l81011
3288.5C57050591k75612l15628j67733j64375j21841k60621n86433q29620j110878
3297.2C53217850q64067k95182j71547L74871J80473q94318m64439j46294m87098o20995
$$ y = [383970528, 383027000, 381861153, 381487617, 381276169, 381018410, 380165558, 379322891, 378849716, 378490143, 378063622, 377224770, 377053299, 376861572, 376230545, 375578232, 374546127, 373980827, 373876724, 373587379, 372776489, 372276840, 372030411, 371490211, 371261063, 370857010, 370387001, 369662933, 368899803, 368474388, 367912788, 367501526, 366947479, 366510811, 366062775, 365552330, 365470810, 365119553, 364621048, 364519234, 364565125, 364084015, 363491631, 363147354, 362684479, 362462692, 361946144, 361240730, 360992546, 360592270, 359953232, 359181290, 358625298, 358820000, 358957710, 358594742, 358062935, 357431602, 357050591, 356774979, 356459351, 356291618, 356127243, 356005402, 355744781, 355158348, 354328728, 353217850, 352353783, 352058601, 351887054, 352261925, 352442398, 351548080, 351083641, 350937347, 350450249, 349829254]
3306.8C49829254o16951k38266l24173n06363p75566n55534k51999q26912o01273m19616
3316.5C44712601p88727m82025J1368j91880m73442m37507p21436o94694m50097k73208
3326.1C40210953o38848j475677r86290k69432n83534o77185n55458p30591n85823
3334.8C33708115m48952o62880q67233o07796m81720j055412o37551l24096p89223
3343.5C27833252p96089o85234k74849n38445o55288n01900p74765n10864n50232m14544
3353.1C22131042q5372j79711n46150p40662n11474k53525j04103o02284n16529k59571
3362.8C18331661k34070k17838q69179p01942m64630j40324j74847j046848n47924
3371.4C13934059J14021j36032m56924m70200m97722m03767j55067m39034n02987J6136
$$ y = [349829254, 349212303, 348974037, 348649864, 348143501, 347367935, 346812401, 346560402, 345733490, 345132217, 344712601, 343923874, 343441849, 343453217, 343261337, 342787895, 342350388, 341628952, 340934258, 340484161, 340210953, 339572105, 338096428, 337110138, 336840706, 336257172, 335579987, 335024529, 334293938, 333708115, 333259163, 332596283, 331729050, 331121254, 330639534, 329584122, 328946571, 328622475, 327833252, 327037163, 326351929, 326077080, 325538635, 324883347, 324381447, 323606682, 323095818, 322545586, 322131042, 322045670, 321865959, 321319809, 320579147, 320067673, 319814148, 319710045, 319107761, 318591232, 318331661, 318097591, 317879753, 317010574, 316308632, 315844002, 315703678, 315528831, 314481983, 313934059, 314048080, 313912048, 313455124, 312984924, 312487202, 312083435, 311928368, 311489334, 310986347, 311002483]
3381.1C11002483O3706n16625l75480l39089m22992J5678k85950j30558K38323k87036
3390.7C08962460j057339p93991L92818L92704j93863m39872O1035K84881j29776l13167
3400.4C07165890l17745Q1558l81928p83558j4763L01476Q0032j07345l35903l23868
3410C05363846J59511K55337J90792J53504l26176o09608L5610M93050J29376J87416
3419.7C06032658l64876l48854M38289K2965j0090J52969K68307P7667j44844N57766
3429.3C06681957R57775r155r52892N7964O47125M19484L65257M08897P58057L98254
3439C09732723K21119J77345J75095k670K03342P20387L87935L62568j54857O19583
3448.6C12442570J532631M77790l08399L5706O65569J49517P05452J213265R3135K2202
$$ y = [311002483, 311066189, 310549564, 310174084, 309834995, 309412003, 309427681, 309141731, 309011173, 309249496, 308962460, 307905121, 307111130, 307503948, 307896652, 307702789, 307262917, 307323952, 307608833, 307479057, 307165890, 306848145, 306929703, 306547775, 305764217, 305749454, 306050930, 306130962, 306023617, 305687714, 305363846, 305523357, 305778694, 305969486, 306122990, 305796814, 305187206, 305222816, 305715866, 305845242, 306032658, 305667782, 305318928, 305757217, 305780182, 305770092, 305923061, 306191368, 306269035, 306124191, 306681957, 307639732, 307630577, 306677685, 306735649, 307382774, 307802258, 308167515, 308576412, 309334469, 309732723, 309953842, 310131187, 310306282, 310303612, 310506954, 311227341, 311615276, 311977844, 311822987, 312442570, 313975201, 314452991, 314144592, 314180298, 314845867, 314995384, 315700836, 316914101, 317007236, 317029438]
3458.2C17029438N33257J251239P38087p8411M65412J134167J088180L61328L77579
3466.9C22900276P48787P21283K62680N41954P72095M32358J206131R62371M43078
3475.6C28991013O24923M87328P33795R83658J180839Q65364r3116J96190J372184
3484.3C35342178J112023Q81004Q70285J09139J95350P39708J123963Q67347J002999
3493C42243996J371345J219101O04324P4273J226806J334458R27467N14488O40793
3501.6C50157051J284409J41525M42810P68127J151238J564255J257896N90248n50117
3510.3C56807442J028709J367531J033897J203537J077767J393051R00078J128845
3518C65940857P26929P42492J125679J186905J338501J40305Q17108J098862J255417
$$ y = [317029438, 317562695, 318813934, 319552021, 319473610, 319939022, 321073189, 322161369, 322522697, 322900276, 323649063, 324370346, 324633026, 325174980, 325947075, 326379433, 327585564, 328547935, 328991013, 329615936, 330103264, 330837059, 331820717, 333001556, 333866920, 333773804, 333969994, 335342178, 336454201, 337335205, 338205490, 338314629, 338509979, 339249687, 340373650, 341240997, 342243996, 343615341, 344834442, 345438766, 345513039, 346739845, 348074303, 349001770, 349516258, 350157051, 351441460, 351582985, 352025795, 352793922, 353945160, 355509415, 356767311, 357357559, 356807442, 357836151, 359203682, 360237579, 361441116, 362518883, 363911934, 364812012, 365940857, 366667786, 367410278, 368535957, 369722862, 371061363, 371201668, 372018776, 373117638, 374373055]
3526.7C74373055J316261O00700R29566J215400J538925J086350J077080J018753J690597
3535.4C84846687J207581n4436J748848J564674J132699J107482J384049J548729P72934
3544.1C95259247Q78753Q11425J787147O41098J431618J997070J409836K341156K69966
3552.7D06827316J221810J449814J505241J987572P20176K334862J826744J398506
3560.5D19272041J250916J820030J722679O74095L714905J463852N47066M47311m83970
3569.1D30428925L488426K451591J972580K004471J711273J162453J487198J873474
3576.9D46580391R37385K995224J836854J046028K195472K393952K303886R84345L573570
3585.5D64847107K224922m51584J614456k06565K788696L444023L657112J475029O34918
$$ y = [374373055, 375689316, 376290016, 377219582, 378434982, 379973907, 381060257, 382137337, 383156090, 384846687, 386054268, 385999832, 387748680, 389313354, 390446053, 391553535, 392937584, 394486313, 395259247, 396138000, 396949425, 398736572, 399377670, 400809288, 402806358, 404216194, 406557350, 406827316, 408049126, 409498940, 411004181, 412991753, 413711929, 416046791, 417873535, 419272041, 420522957, 422342987, 424065666, 424739761, 428454666, 429918518, 430465584, 430912895, 430428925, 433917351, 436368942, 438341522, 440345993, 442057266, 443219719, 444706917, 446580391, 447517776, 450513000, 452349854, 453395882, 455591354, 457985306, 460289192, 461273537, 464847107, 467072029, 466620445, 468234901, 468028336, 470817032, 474261055, 477918167, 479393196, 480028114]
3594.2D80028114L129387n56984K746010M240112J586914K698212J079750J629486
3601.9D96581001K582474J862907K454987L331604K833252N5237L524818L05901J94969
3610.6E13727150P175446J448783j426124L855209J45836M108887M225197J104278
3618.3E34364662K900315l66021J265869L837014L148307L062363L691864K739716
3626E54644089J919479N158615P05223p747307M669991N726624N099639J748391L65753
3634.7E72290497L330765L151512K927093J735764J402092K390060K730408K199211
3642.4E92157402J810570K588272L482094N506820m13971l215408N078392j39465j22185
3651.1F06732521J924362N026589M493599L617439L991394o405563K769775O204071
$$ y = [480028114, 483157501, 482600517, 485346527, 489586639, 491173553, 493871765, 494951515, 496581001, 499163475, 501026382, 503481369, 506812973, 509646225, 509701462, 513226280, 513532181, 513727150, 520902596, 522351379, 520925255, 524780464, 524926300, 529035187, 533260384, 534364662, 537264977, 536898956, 538164825, 542001839, 545150146, 548212509, 551904373, 554644089, 556563568, 561722183, 562427406, 554680099, 559350090, 565076714, 570176353, 571924744, 572290497, 575621262, 578772774, 581699867, 583435631, 584837723, 587227783, 589958191, 592157402, 593967972, 596556244, 600038338, 605545158, 605131187, 601915779, 606994171, 606854706, 606732521, 608656883, 613683472, 618177071, 621794510, 625785904, 619380341, 622150116, 628354187]
3658.8F28354187J639214J638412J019211K264252J836242J824990J890182Q96988
3666.5F41363678M280853K182999l97034P86286n990296L409729Q575516Q887100k563019
3675.2F60535812j8682861N513611Q075790M659653j679306L13110L335877K528534
3682.9F64600220J560058L73307M02374L842544O231842q021163l525162O736679n467987
3691.6F66732712J011886M999390O43158K049637L00598p12204J612320N11551K083893
3700.3F79232941L190994m311600j774139L838196R12551M03061J024399L027573L095474
3709F88639450p451630L343430M151688j1834259M035415N364075J038513J24588J503678
3717.7F88914948Q96072k939758P22351N399322k751236l937378N033951N84488p66754
$$ y = [628354187, 629993401, 631631813, 632651024, 634915276, 636751518, 638576508, 640466690, 641363678, 645644531, 647827530, 647430496, 648216782, 642226486, 645636215, 654211731, 663098831, 660535812, 641852951, 647366562, 655442352, 660102005, 658422699, 658735809, 662071686, 664600220, 666160278, 666533585, 666935959, 670778503, 677010345, 668989182, 665464020, 672200699, 666732712, 667744598, 672743988, 673387146, 675436783, 675737381, 675025177, 676637497, 677149048, 679232941, 682423935, 678112335, 676338196, 680176392, 681088943, 681492004, 682516403, 685543976, 688639450, 681187820, 684531250, 688682938, 676848679, 680884094, 686248169, 687286682, 687411270, 688914948, 689811020, 686871262, 687593613, 692992935, 690241699, 686304321, 691338272, 691922760, 691156006]
3726.3F91156006k058945J88828L481750J239395N657196k361297p763138O894455
3734F96434250J50604q870392j74637L693848O59409K386017L412399l540421K944947
3742.7F97096024J0498504j0324325j4226990R907226M877930M540863l127441j0129547
3750.4F89112244R628372n276032m799957N988159L894730L358917m492569J468964
3758.2F98882828M510803o916504j208877L639984J184539L09983L353195k655106
3765.9G01100845m311828M087295M968643p04498r336166J753158L425370M49981Q71964
3774.5G02304764j14746N57556K58331K957230K23388p327041K097931J630783N75104
3783.2G03163300K147445k513885r54743Q77991N04532J051636J48544K57111n90516
$$ y = [691156006, 689097061, 689285889, 692767639, 694007034, 699664230, 697302933, 689539795, 696434250, 696584854, 687714462, 687539825, 691233673, 691893082, 694279099, 697691498, 694151077, 697096024, 707594528, 697270203, 683043213, 692950439, 697828369, 702369232, 699241791, 689112244, 698740616, 693464584, 688664627, 694652786, 698547516, 701906433, 697413864, 698882828, 703393631, 696477127, 695268250, 698908234, 700092773, 700402756, 703755951, 701100845, 696789017, 700876312, 705844955, 705140457, 695804291, 697557449, 700982819, 701432800, 702304764, 702190018, 702747574, 703005905, 705963135, 706186523, 698859482, 700957413, 702588196, 703163300, 705310745, 702796860, 701842117, 702720108, 703224640, 704276276, 704424820, 704681931, 704091415]
3791.9G04091415r7427M59518R91211K987900l048630l961715K310333M183731O035004
3800.6G13951340p523880r891434M548721K578278L953094L316422r665909k524567
3808.3F98742065M639206J819229P09382J043090l7918J347657N405654j750412j3934097
3817F97983856M328690N846634L757095N7220j5093383L008194N502395J997376K063827
3825.7G09451904n61828l923493q6822J481323L071671J953964p175827K015533N891724
3834.3G12118149n704422q91113N687713q517914j977234Q042832m971237k73667O264267
3843G09777374l991470l270264L879395J405182J24817J694030p22961J601715N008469
3851.7G15506287n820084L11661j3115998O19202R867706q10241j367035K652283J859283
$$ y = [704091415, 703993988, 704453506, 705444717, 708432617, 705383987, 701422272, 703732605, 707916336, 713951340, 706427460, 696536026, 701084747, 703663025, 707616119, 710932541, 701266632, 698742065, 703381271, 705200500, 705909882, 706952972, 706915054, 708262711, 713668365, 711917953, 697983856, 702312546, 708159180, 711916275, 711973495, 696880112, 699888306, 705390701, 707388077, 709451904, 708890076, 704966583, 704879761, 706361084, 709432755, 711386719, 704210892, 706226425, 712118149, 706413727, 705522614, 711210327, 702692413, 700715179, 708758011, 703786774, 703513107, 709777374, 705785904, 702515640, 706395035, 707800217, 707925034, 709619064, 708896103, 710497818, 715506287, 709686203, 709997864, 696881866, 697501068, 707368774, 706558533, 705191498, 707843781, 709703064]
3860.4G09703064J980972m823532l4714M859314o558685l854523M545746N559006M334946
3869.1G15711594j0994110o686631N322647N556412K131043q769074J628189M485092
3876.8G08385162M68674J630631K748642n641938n323105N299454O97479Q52814L229065
3885.4G12346878j1224060J994781M075394J251984M174804j758804q720550J578369
3893.2G03718796L845215l70865P93991K13928J603928K245407p263489L419800L86886
3901.8G08593597l906097M257736l406601o08749J17721K12784K198944o2332M29459
3910.5G07826462j32370O2103M17099p58133N22461J543198k854157l008728L566513
3919.2G07184448K98767l107910J966400J819153O63529k278214k600174J431351J820297
$$ y = [709703064, 711684036, 706860504, 706825790, 711685104, 705126419, 701271896, 705817642, 711376648, 715711594, 704717484, 698030853, 703353500, 708909912, 711040955, 702271881, 703900070, 708385162, 708853836, 710484467, 713233109, 707591171, 702268066, 707567520, 708264999, 709117813, 712346878, 701122818, 703117599, 707192993, 708444977, 712619781, 710860977, 702140427, 703718796, 707564011, 707193146, 707987137, 708201065, 709804993, 712050400, 704786911, 708206711, 708593597, 704687500, 708945236, 705538635, 704929886, 705047607, 705260391, 707459335, 707397003, 707826462, 707694092, 707756195, 708173294, 707415161, 707937622, 709480820, 706626663, 703617935, 707184448, 707483215, 704375305, 706341705, 708160858, 708824387, 706546173, 703945999, 705377350, 707197647]
3927.9G07197647J783371j071548j261979J438065k154541n82886J564408n48020o0959
3936.6G06303558J60218m81873p42569k54593J953736J135406k982483j67389J146393
3945.2G06070404N87387R85031j954345L38134M72870j729965J418076J95388k39181
3953.9G06143799L54538J5030n1270m31137L86124p65305O43616M49753j609040M72794
3963.6G05608902L19595n3940j58920k47574M74701j41601l87802N99899K40784m83628
3973.2G05770416M65164N2186j10627k09655n07584P6218k02866M38232Q07877M47693
3982.8G07027054M6005j30310m56314p60040K3803L4943L43857M2648P1488M51583
3992.5G06694717l4713P7896j072083l13339Q28857k2201n6152K90374
$$ y = [707197647, 708981018, 707909470, 706647491, 708085556, 705931015, 705348129, 706912537, 706364517, 706303558, 706463776, 705981903, 705239334, 704984741, 706938477, 708073883, 705091400, 704924011, 706070404, 706657791, 707642822, 705688477, 706026611, 706499481, 704769516, 706187592, 706382980, 706143799, 706498337, 706513367, 706462097, 706030960, 706417084, 705651779, 706295395, 706745148, 705136108, 705608902, 705928497, 705874557, 705715637, 705468063, 705942764, 705801163, 705413361, 706013260, 706254044, 705770416, 706235580, 706287766, 706177139, 705967484, 705459900, 705536118, 705333252, 705771484, 706579361, 707027054, 707073059, 706942749, 706486435, 705726395, 705750198, 705785141, 706128998, 706171646, 706243134, 706694717, 706660004, 706737900, 705665817, 705352478, 706181335, 706159134, 706102982, 706393356]
4000.2G06393356
$$ y = [706393356]
##END=$$ End of the data block
