##TITLE=$$ Begin of the data block
##JCAMP-DX=5.00 $$ ACD/SpecManager v 10.08
##SPECTROMETER/DATA SYSTEM=Varian
##DATE=08 Jan 2013 14:52:18
##DATA TYPE=INFRARED SPECTRUM
##DATA CLASS=XYDATA
##ORIGIN=
##OWNER=
##NPOINTS=3735
##FIRSTX=399.26403809
##LASTX=4000.35498047
##MAXX=4000.35498047
##MINX=399.26403809
##MAXY=78.31848907
##MINY=47.55717468
##XFACTOR=1.0000000000
##YFACTOR=0.000000100000000
##FIRSTY=68.40406799
##DELTAX=0.96440572
##XUNITS=1/CM
##YUNITS=TRANSMITTANCE
##XYDATA=(X++(Y..Y))
399.3F84040680J2855453n138549j1595917l623963L254319k442017m429092p391434
$$ 684040680 696896133 691757584 680161667 676537704 679792023 677350006 672920914 665529480
407F65529480m629135P270050J0736542K282638J547470M630280l125992r550018r267350
$$ 665529480 660900345 668170395 678906937 681189575 682737045 687367325 684241333 674691315 665423965
415.7F65423965l156204m265747j7384567J4079208K0398789N224991Q84704n808716
$$ 665423965 662267761 658002014 640617447 654696655 675095444 680320435 681205139 675396423
423.4F75396423m917450m850082l894272j015777M307632P151184J2485886J4002990
$$ 675396423 670478973 665628891 661734619 660718842 665026474 672177658 684663544 698666534
431.1F98666534o626052j6464005j0420837p91626K625198l560638l540574K150803
$$ 698666534 692040482 675576477 665155640 664364014 666989212 663428574 659888000 662038803
438.8F62038803Q897171Q750305M367752j746521q204879j2461167r083099j355362
$$ 662038803 670935974 679686279 684054031 682307510 674102631 661641464 652558365 651203003
446.5F51203003N605545J2045059J3541184N453338j033172o900177q561554p602921
$$ 651203003 656808548 668853607 682394791 687848129 686814957 679914780 671353226 663750305
454.2F63750305m968796J065445k13470R13391J4211044J1316223l345184j1197204
$$ 663750305 658781509 659846954 659633484 660546875 674757919 686074142 682728958 671531754
462F71531754q988419p728272q25576L488693Q05969M15421M688720R471741P298737
$$ 671531754 662543335 654815063 653989487 657478180 658284149 658699570 663388290 672860031 680158768
470.6F80158768M959q472824j1599655n853348K195129N56641l62320Q340759O319199
$$ 680158768 680163727 671690903 660091248 654237900 656433029 656989670 656627350 664968109 671287308
479.3F71287308K037048k847748o383972o232071q080520l48511N023498M817658N494995
$$ 671287308 673324356 670476608 664092636 657860565 649780045 649431534 654455032 659272690 664767685
488F64767685P848434O865921p46612r399414j2691727p264480P5988L471833O254730
$$ 664767685 672616119 679482040 678735428 669336014 656644287 649379807 649455795 652927628 659182358
496.7F59182358P462616M351120K570266L228913m635468j6024093n169678J841659
$$ 659182358 666644974 670996094 673566360 676795273 672159805 656135712 650966034 652807693
504.4F52807693j728363j385345O981888J1504364M552231k577439n875778p462997
$$ 652807693 651079330 649693985 656675873 668180237 672732468 670155029 664279251 656816254
512.1F56816254m888077l547363k24991M300232L907165N289994N324249o08216l647689
$$ 656816254 651928177 648380814 648155823 652456055 656363220 661653214 666977463 666369247 662721558
520.8F62721558m182358p445145m584350r34678o22787O586380P925262M405213J998215
$$ 662721558 658539200 651094055 646509705 645575027 644952240 651538620 659463882 663869095 665867310
529.5F65867310m108353o159287n127410m976273k674561J324616N366211O980285
$$ 665867310 661758957 655599670 650472260 645495987 642821426 644146042 649512253 656492538
537.2F56492538O791459K065200k347564n174485p976226n097504j526489O20498L404236
$$ 656492538 663283997 665349197 663001633 657827148 649850922 644753418 643226929 643847427 647251663
545.9F47251663O025009O667405K451858j570129m349060m847413n646972m607849
$$ 647251663 653276672 659944077 662395935 660825806 656476746 651629333 645982361 641374512
553.6F41374512J011429L522110N346756N391616L468552j50375m855881n315628n326691
$$ 641374512 642385941 645908051 651254807 656646423 660114975 659964600 655108719 649793091 644466400
562.3F44466400m494667j062698M327049O808014M498520K580566J506806j320343
$$ 644466400 639971733 638909035 643236084 650044098 654542618 657123184 658629990 657309647
570F57309647n115357n104294l435745k539062J328277M346543P145233M442596K25983
$$ 657309647 652194290 647089996 643654251 641115189 642443466 646790009 653935242 658377838 658603821
578.6F58603821o13327m233322o563492l811264j042786J287232M460372N950089M114990
$$ 658603821 657990494 653757172 647193680 643382416 642339630 643626862 648087234 654037323 658152313
587.3F58152313K295990j410827n772019n717239l914109j647033J5335L008346O502152
$$ 658152313 660448303 659037476 653265457 647548218 643634109 641987076 642002411 645010757 651512909
596F51512909O392288K749710j518402m539795n886764n020981k292633Q97064K895126
$$ 651512909 657905197 660654907 659136505 654596710 648709946 643688965 641396332 642293396 645188522
604.7F45188522N459671N482178J608505p33566k591171n416489m763107k577515r05762
$$ 645188522 650648193 656130371 657738876 657005310 654414139 648997650 644234543 641657028 640751266
613.4F40751266J288071L534088M681015J357575P6370K21481m869461n409698j501694
$$ 640751266 642039337 645573425 650254440 651612015 651688385 651909866 647040405 641630707 640129013
622F40129013l35922J904754M581833N760727L791046R95865j470413m450912m487152
$$ 640129013 639793091 641697845 646279678 652040405 655831451 656827316 655356903 650905991 646418839
630.7F46418839k708359n30701K644119M024353N077439N119934L026886k29950l790589
$$ 646418839 643710480 643179779 645823898 649848251 654925690 660045624 663072510 662842560 659051971
639.4F59051971m139022m040757k893371K02331K122040N100479N691757L161850k75497
$$ 659051971 654912949 650872192 647978821 648181152 650303192 655403671 661095428 664257278 663981781
648.1F63981781m413834n285339m283829l180771Q2169L311691N327912O151962M361343
$$ 663981781 659567947 654282608 649998779 646818008 646900177 650211868 655539780 661691742 666053085
656.8F66053085K12097k854232m099961l837967l495559j561508J765823M332504P232437
$$ 666053085 666265182 663410950 659310989 655473022 651977463 650415955 652181778 656514282 663746719
665.4F63746719M986420n569382l4032707J0540962J0814591N00183k317810k9831
$$ 663746719 668733139 663163757 629131050 639672012 650486603 650986786 648668976 648639145
673.2F48639145M906464P559280N419464L766861j538010m513397m171066n300293
$$ 648639145 653545609 661104889 666524353 670291214 668753204 664239807 660068741 654768448
680.9F54768448k805176L92838M193801N933533M958420N098495K770997k130280o040649
$$ 654768448 651963272 652356110 656549911 662483444 667441864 672540359 675311356 673181076 667140427
689.6F67140427n073700l245011j443481L296661N880585N995178N153656K560730
$$ 667140427 662066727 658821716 657378235 660674896 666555481 672550659 677704315 680265045
697.3F80265045o77643l706360m278793l826218l206710n45121L721238O475906O264343
$$ 680265045 679587402 675881042 671602249 667776031 664569321 664024200 667745438 674221344 680485687
705.9F80485687L893967O12945k326126n082855n861282k961273P40051K500915M272461
$$ 680485687 684379654 684992599 682666473 677583618 671722336 668761063 669501114 672002029 676274490
714.6F76274490N809098M595489K313233j383362n967636o352921k677231J25504J796570
$$ 676274490 682083588 686679077 688992310 687608948 681641312 675288391 672611160 672736664 674533234
723.3F74533234L627319N360794N275879L295441L60717l731842m996490l478241k341156
$$ 674533234 678160553 683521347 688797226 692092667 692453384 688721542 683725052 680246811 677905655
732F77905655n1193J986618N248489O939850M279785J047669k455597m110642m664535
$$ 677905655 677854462 679841080 685089569 692029419 696309204 697356873 694901276 690790634 686126099
740.7F86126099l345261o31943J517792M673843N157547L660431J806641m68216k552872
$$ 686126099 682780838 682148895 683666687 688340530 693498077 697158508 698965149 698496933 695944061
749.3F95944061m259948k955170m53797J933213K532959K872543M004822K753525M15954
$$ 695944061 691684113 688728943 688275146 690208359 692741318 695613861 699618683 702372208 702788162
758G02788162j713714l151093l583221j663132K12173J993027L998566L504028K799606
$$ 702788162 701074448 697923355 694340134 692677002 692889175 694882202 698880768 702384796 705184402
766.7G05184402J226883m51202k915192m635086k564392o72912J363144K931213L886413
$$ 705184402 706411285 705960083 703044891 698409805 695845413 695172501 696535645 699466858 703353271
775.4G03353271K991486P46079o28510k995529l071365k237626j295395Q53959K750396
$$ 703353271 706344757 707090836 706462326 703466797 700395432 698157806 696862411 697716370 700466766
784.1G00466766M481202L964386J365737q63952k118225l115692k033158j351394k24152
$$ 700466766 704947968 708912354 710278091 709414139 707295914 704180222 702147064 700795670 700571518
792.7G00571518L235931L702622K866592J762085k41928k329712l363266l005295k276611
$$ 700571518 703807449 707510071 710376663 712138748 711896820 709567108 706203842 703198547 700921936
801.4G00921936L10593J560135J952743K673340K495193J423722j512833l973770m457245
$$ 700921936 701232529 702792664 704745407 707418747 709913940 711337662 709824829 705851059 701393814
810.1G01393814l151779j986389J39007J878510K768631L505249J234970q89359k899017
$$ 701393814 698242035 696255646 696394653 698273163 701041794 704547043 705782013 704892654 701993637
818.8G01993637l801269k774888j429672N19104K297669M855423M680786K710342N51148
$$ 701993637 698192368 695417480 693987808 694506912 696804581 701660004 706340790 709051132 709602280
827.5G09602280k141037j658554j015625r29261P95060L716049M822540L768005K547455
$$ 709602280 707461243 705802689 704787064 703857803 704652863 708368912 713191452 716959457 719506912
836.1G19506912J294861k46124k655411k609253j280823O25382K008133L127670M958115
$$ 719506912 720801773 720555649 717900238 715290985 714010162 714635544 716643677 719771347 724729462
844.8G24729462L436203J462173l90854j698227k767105k755966p26700r2850K182084
$$ 724729462 728165665 729627838 729236984 727538757 724771652 722015686 721288986 721196136 723378220
853.5G23378220M232025M941025L752594Q50219j410446l329163k466430k082062k57568
$$ 723378220 727610245 732551270 736303864 737154083 735743637 732414474 729948044 727865982 727608414
862.2G27608414K803650M106521L835831K384949J747894j718216m198914n031890
$$ 727608414 730412064 734518585 738354416 740739365 742487259 740769043 736570129 731538239
869.9G31538239n063706l019791q33664K255021K830200K003403J735153K00348k160416
$$ 731538239 726474533 723454742 722621078 724876099 727706299 729709702 731444855 731645203 729484787
878.6G29484787k933426j867676j370697r8800J873321M469605M593506K325134P49740
$$ 729484787 726551361 724683685 723312988 723214188 725087509 729557114 734150620 736475754 737225494
887.3G37225494k121200l770752m097443l309707j286545R31854K817154L299103K655258
$$ 737225494 735104294 731333542 727236099 723926392 722639847 723571701 726388855 729687958 732343216
895.9G32343216J300888n03922k957534l610916l287812k498092l51029K013474L757477
$$ 732343216 733644104 733140182 730182648 726571732 723283920 720785828 720434799 722448273 726205750
904.6G26205750L577194L364639J278763k041931k471238k374725k345123o24695J799240
$$ 726205750 729782944 733147583 734426346 732384415 729913177 727538452 725193329 724568634 726367874
913.3G26367874K772751L580780K682800P82242j052856l819351m217454l307724r20639
$$ 726367874 729140625 732721405 735404205 736186447 735133591 731314240 727096786 723789062 722868423
922G22868423j30081M25034K487488J473083K42157j464920l192673m016571l774872
$$ 722868423 722738342 723163376 725650864 727123947 727366104 725901184 722708511 718691940 714917068
930.7G14917068l167572j978988O86722J236038K792129K704773j82571j296616k868881
$$ 714917068 711749496 709770508 710457230 711693268 714485397 717190170 717007599 715710983 712842102
939.3G12842102l727798l387299j751404j84021J401596K308884J246414N61905m57153
$$ 712842102 709114304 705727005 703975601 703791580 705193176 707502060 708748474 709310379 708853226
948G08853226q91953k229919l050919j861419l80250J431046J645966J916961R09500
$$ 708853226 707961273 705731354 702680435 700819016 700438766 701869812 703515778 705432739 706342239
956.7G06342239p42340j509018l253555l381958k845459k144012j29548J779023J399994
$$ 706342239 705599899 704090881 700837326 697455368 694609909 692465897 692336349 694115372 695515366
965.4F95515366k24076o83593j840744k419510j893692k300644k123490r34753n28641
$$ 695515366 695291290 694607697 692766953 690347443 688453751 686153107 684029617 683094864 682566223
974.1F82566223l15780J52p42721j887436k922669k864151k535858l315735k952499
$$ 682566223 682250443 682250595 681507874 679620438 676697769 673833618 671297760 667982025 665029526
982.7F65029526j552735p56530n16968j366806k130890k739105l577423l228455l078690
$$ 665029526 663476791 662720261 662203293 660836487 658705597 655966492 652389069 649160614 646081924
991.4F46081924l205871k122498r25064p40585n79949l65829j386414k684669l021469
$$ 646081924 642876053 640753555 639828491 639087906 638507957 638142128 636755714 634071045 631049576
1000.1F31049576k712364k247544j265564o65779l83415m24042j178665j154671j794281
$$ 631049576 628337212 626089668 624824104 624158325 623774910 623350868 622172203 621017532 619223251
1008.8F19223251k086486k153435k320862j012116j07345j89552j094475l71437j148644
$$ 619223251 617136765 614983330 612662468 611650352 611543007 611353455 610258980 609887543 608738899
1017.5F08738899l099632k228012k256813j819763j379052j400604j089363p85293
$$ 608738899 605639267 603411255 601154442 599334679 597955627 596555023 595465660 594680367
1025.2E94680367j84403q70705j763115k529449j815796j388206j370049q04748k91672
$$ 594680367 594495964 593625259 591862144 589332695 587516899 586128693 584758644 583953896 583662224
1033.8E83662224P40738K54097R79728J097031O11076N26390k56500N38216P60231
$$ 583662224 584402962 584657059 585636787 586733818 587344894 587871284 587614784 588153000 588913231
1042.5E88913231J600685J788483N04799K28462r3651n11055j258774k353592k314605
$$ 588913231 590513916 592302399 592807198 593035660 592942009 592430954 591172180 588818588 586503983
1051.2E86503983q96454o06194O19888J343613n07507j071396j354981r87243p46803
$$ 586503983 585607529 585001335 585621223 586964836 586457329 585385933 584030952 583043709 582296906
1059.9E82296906p7210M98924N14717K495156L402977K631263J339379R55086L36074
$$ 582296906 582219696 582718620 583233337 585728493 589131470 591762733 593102112 594057198 594393272
1068.6E94393272l66211k31704o45867o99081L06282J497231J484565K190171R64012
$$ 594393272 594027061 593795357 593149490 592450409 592756691 594253922 595738487 597928658 598892670
1077.2E98892670q29964r76906j735611k82974K37923Q18786J648789Q98666J538887
$$ 598892670 598062706 597085800 595350189 595067215 595305138 596123924 597772713 598671379 600210266
1085.9F00210266K089653J330757l23143K55585J69525p09038m6310O46553J936073
$$ 600210266 602299919 603630676 603307533 603563118 603732643 603023605 602977295 603623848 605559921
1094.6F05559921J855088J786842J249542R73206q7776j572266q31719q80317R04312
$$ 605559921 607415009 609201851 610451393 611424599 611336823 609764557 608932838 608052521 608956833
1103.3F08956833J942520J434250J550255J307602J151733q84247j968422j350403
$$ 608956833 610899353 612333603 613883858 615191460 616343193 615458946 613490524 612140121
1111F12140121k20718j2741M43611K038918J841545K083092J117553K4910k66571r77897
$$ 612140121 611919403 611906662 612350273 614389191 616230736 618313828 619431381 619456291 619189720 618211823
1120.6F18211823j075707j077614k04620N42641K060585J831855Q72040J219292K09999
$$ 618211823 617136116 616058502 615853882 616396523 618457108 620288963 621161003 622380295 622590294
1129.3F22590294K18811K89230N91355Q76846J031189K466431K720604K325744K079621
$$ 622590294 622809105 623098335 623689690 624566536 625597725 628064156 630784760 633110504 635190125
1138F35190125J660537J64223j042137k55585L79448N06210N54428Q19130Q17299Q68912
$$ 635190125 636850662 637014885 635972748 635717163 636096611 636602821 637157249 637976379 638793678 639662590
1147.6F39662590J256523L59879q63037j395226j276627n73387k19230M86869J176835
$$ 639662590 640919113 641278992 640415955 639020729 637744102 637170715 636951485 637438354 638615189
1156.3F38615189O13632J25389k57492n76744j054192j678161m48456N04493Q07000
$$ 638615189 639228821 639354210 639096718 638519974 637465782 635787621 635339165 635843658 636650658
1165F36650658J389236J731148K680359K370682J369628P31430R79462J498108J334763
$$ 636650658 638039894 639771042 642451401 644822083 646191711 646923141 647902603 649400711 650735474
1173.7F50735474J533966J903305K357406K146988K076493K101516J357880J077957
$$ 650735474 652269440 654172745 656530151 658677139 660753632 662855148 664213028 665290985
1181.4F65290985J059494J041718P15866M47921J411820J966476J416855P86743M45633
$$ 665290985 666350479 667392197 668108063 668555984 669967804 671934280 673351135 674137878 674583511
1190.1F74583511M85077q4152n94482n84412l53165r2849k84272l11889j53580J88370
$$ 674583511 675068588 674984436 674389954 673805542 673452377 673359528 673075256 672763367 672609787 672798157
1199.7F72798157L60641m35333j447296o85120R4300n64805o82678o32248M3106J72882
$$ 672798157 673158798 672723465 671276169 670591049 670685349 670120544 669437866 668805618 668848724 669021606
1209.4F69021606l28750K15759J41678j52741k29568l89709n95017k13852M35944q3084
$$ 669021606 668692856 668908615 669050293 668897552 668667984 668278275 667683258 667469406 667905350 667822266
1219F67822266l65143j35651M1428q3771j95084j06124m39377m82712l04108k66800
$$ 667822266 667457123 667321472 667362900 667279129 667084045 666977921 666538544 666055832 665751724 665484924
1228.6F65484924m59518k87323j82572k26440O6299R995R9564l82920o77871k79236
$$ 665484924 665025406 664738083 664555511 664329071 664395370 664405365 664504929 664122009 663444138 663164902
1238.3F63164902l03421n4627r5062j35193L46222N80215L77427l0747p33032j206436
$$ 663164902 662861481 662806854 662711792 662576599 662922821 663503036 663880463 663849716 663116684 661910248
1247.9F61910248o28052l92456j29089M54101J96152J51062M25644O9580k29187k16751
$$ 661910248 661282196 660889740 660760651 661214752 661410904 661561966 661987610 662057190 661828003 661611252
1257.6F61611252n19333m35028j54343L968M57992P25479P38373N45578M23279J70288
$$ 661611252 661091919 660656891 660502548 660506516 660964508 661689987 662428360 662973938 663397217 663567505
1267.2F63567505l2349L61862L24707J50300N13305J340943J253585M78440O23703
$$ 663567505 663535156 663897018 664221725 664372025 664885330 666226273 667479858 667958298 668582001
1275.9F68582001N82123L80401M0207k8534L38669N69763R83124P28073R66492J387558
$$ 668582001 669164124 669544525 669584732 669556198 669894867 670464630 671447754 672175827 673142319 674529877
1285.5F74529877J134491P18612j8005j28326K8610L28064J69296L01819J039429P79190
$$ 674529877 675664368 676382980 676364975 676236649 676265259 676593323 676762619 677064438 678103867 678883057
1295.2F78883057J31836K39715N29862k17820o56890m13895j26648m349J21384K25601
$$ 678883057 679014893 679254608 679784470 679566650 678909760 678495865 678369217 678364868 678486252 678711853
1304.8F78711853J13678J58920l87954m47464o58036r47113n74264j104508j067962
$$ 678711853 678825531 678984451 678596497 678149033 677490997 676543884 675969620 674865112 673797150
1313.5F73797150p7M94385j39160P6523K19040k41852P69577O65054L23563m4785m5242
$$ 673797150 673797073 674291458 674152298 674228821 674447861 674206009 674975586 675640640 675964203 675919418 675874176
1324.1F75874176P49817M63943M20990L51258Q2321n20935o14700k34681k46887j07956
$$ 675874176 676623993 677087936 677508926 677860184 677942505 677421570 676806870 676572189 676325302 676217346
1333.8F76217346n55496n53360l31802k47651l72619o98624l37601J031724J715927
$$ 676217346 675661850 675108490 674776688 674529037 674156418 673457794 673120193 674151917 675867844
1342.4F75867844M51278p2479J48773P8202Q7890j55411L14331L44162O65970J22986
$$ 675867844 676319122 676246643 676395416 676473618 676561508 676406097 676720428 677064590 677730560 677853546
1352.1F77853546n98221l95965o35147m90799p61872l26461l02506q0566K32544k95487
$$ 677853546 677255325 676859360 676224213 675733414 674971542 674645081 674342575 674262009 674494553 674199066
1361.7F74199066m86832j710128J41906N722r83886n89905j446152l21045Q86307L98941
$$ 674199066 673712234 672002106 672144012 672149734 671165848 670575943 669129791 668808746 669695053 670093994
1371.4F70093994l73764q75778j417084p76977M56161k32315o26755j09176K56424
$$ 670093994 669720230 668844452 667427368 666650391 667106552 666874237 666247482 666138306 666394730
1380.1F66394730j11847m69437j333771k270889j126938k9602m89502r27276J256942
$$ 666394730 666282883 665813446 664479675 662208786 661081848 661052246 660562744 659635468 660892410
1388.7F60892410J303635N27267O84967m30679j141586k876587k688141m84848j384811
$$ 660892410 662196045 662723312 663408279 662977600 661836014 658959427 656271286 655786438 654401627
1397.4F54401627j646653k588882m25110Q95386r4071n49850q82416k589874k655487
$$ 654401627 652754974 650166092 649740982 650636368 650542297 649992447 649110031 646520157 643864670
1406.1F43864670j588516j984253j483536q96416l56369j10588j49231J21384r86595
$$ 643864670 642276154 640291901 638808365 637911949 637555580 637444992 637295761 637417145 636430550
1414.8F36430550j466751j800614k114601j410179l859749J483841K995110J538276
$$ 636430550 634963799 633163185 631048584 629638405 625778656 627262497 630257607 631795883
1422.5F31795883N48668q09402k64817J3085r39942q74481r91363k11754J697502K120399
$$ 631795883 632344551 631535149 631270332 631283417 630343475 629468994 628477631 628265877 629963379 632083778
1432.1F32083778J582985J335869J208649K46239k614937p8163J837120J153297J433296
$$ 632083778 633666763 635002632 636211281 636457520 633842583 633764420 635601540 636754837 638188133
1440.8F38188133J713066J551438J562805P97195N76401o08215j249390j158447N78461
$$ 638188133 639901199 641452637 643015442 643812637 644389038 643780823 642531433 641372986 641951447
1449.5F41951447J548538O21795J427231J414795J266556N55115j367188k887802j938629
$$ 641951447 643499985 644121780 645549011 646963806 648230362 648785477 647418289 644530487 642591858
1458.2F42591858L298950K190247K368545K187500K091217K416992q92715P02057J249695
$$ 642591858 645890808 648081055 650449600 652637100 654728317 657145309 656252594 656954651 658204346
1466.8F58204346L59115N82276P51190J593246M03138K09960L267670M661637L037261
$$ 658204346 658563461 659145737 659896927 661490173 661893311 662103271 665370941 670032578 673069839
1475.5F73069839K66877N52597Q02841L43857N82428P51266J781616K517853K109223
$$ 673069839 673336716 673889313 674692154 675036011 675618439 676369705 678151321 680669174 682778397
1484.2F82778397Q73718M20685j231003j736908n9052k838592J13449L509293K440261
$$ 682778397 683652115 684072800 682841797 681104889 681045837 678207245 678320694 681829987 684270248
1492.9F84270248J168595Q51440j44729m565506O81152j270981k795563P24793l64685
$$ 684270248 685438843 686290283 686145554 681580048 682261200 680990219 678194656 678919449 678554764
1501.6F78554764N52139J415482J547012K78320q574600n983353L806839J831742O3019
$$ 678554764 679106903 680522385 682069397 682347717 673773117 667789764 671596603 673428345 673491364
1510.2F73491364J762542L14331M15650J735153j63040j360474l257294j867065K047501
$$ 673491364 675253906 675568237 675983887 677719040 677556000 676195526 672938232 671071167 673118668
1518.9F73118668J036377m118042n219269L335647M018021K574692r05609m01764l62778
$$ 673118668 674155045 670037003 664817734 668153381 672171402 674746094 673840485 673438721 673075943
1527.6F73075943j372147L83301M55856K34452K83203n58243j382141K421341J403427
$$ 673075943 671703796 672087097 672542953 672777405 673060608 672502365 671120224 673541565 674944992
1536.3F74944992m11911o59561r043884p306137O016235J948318L55301L209458J939315
$$ 674944992 674533081 673873520 664829636 657523499 663539734 665488052 665843353 669052811 670992126
1545F70992126M40217K029190j89286p11822k401505j265411K819900J802369J237564
$$ 670992126 671432343 673461533 673272247 672560425 670158920 668893509 671713409 673515778 674753342
1553.6F74753342k572632M24042K465515P78274p452774j4189529P358093N426102
$$ 674753342 672180710 672604752 675070267 675848541 668395767 654206238 661564331 666990433
1561.4F66990433L593902J559296N42755j150818r45663j95389j747208k653427p632293
$$ 666990433 670584335 672143631 672686386 671535568 670589905 670394516 668647308 665993881 658361588
1570F58361588J884155J648483m95834P9727m13590j188812r288025M62342k79465
$$ 658361588 660245743 661894226 661398392 661478119 661064529 659875717 650587692 651050034 650770569
1578.7F50770569k276993k150116j995163k41318j598205o22177j715546k368317k676200
$$ 650770569 648493576 646343460 644348297 644106979 642508774 641886597 640171051 637802734 635126534
1587.4F35126534l779946k657127l465538j217842j755371p48787q36754k170067j319695
$$ 635126534 631346588 628689461 625223923 624006081 622250710 621501923 620665169 618495102 617175407
1596.1F17175407k810669j949806l574066k221947k015342j814957n48935j312904
$$ 617175407 614364738 612414932 608840866 606618919 604603577 602788620 602239685 600926781
1603.8F00926781M23584j276665j269264l134499k186165j641082k576447O9084q97293
$$ 600926781 601350365 600073700 598804436 595669937 593483772 591842690 589266243 589335327 588438034
1612.5E88438034M68254p91626M92897p83996p449799K436485m55055n15289j380921
$$ 588438034 588906288 588114662 588607559 587823563 580373764 582810249 582355194 581839905 580458984
1621.1E80458984L05176n59540j330604K526321N16167J248016k275810j706886O828
$$ 580458984 580764160 580204620 578874016 581400337 581916504 583164520 580888710 579181824 579188652
1629.8E79188652k49786N01747L08647K368011R89914k878112o21338K138977N02319
$$ 579188652 578938866 579440613 579749260 582117271 583107185 580229073 579607735 581746712 582249031
1638.5E82249031M15535R65347l19442J505699J127701K989845K542114k033577q25157
$$ 582249031 582664566 583629913 583310471 584816170 585943871 588933716 591475830 589442253 588617096
1647.2E88617096j308861K919541J621780K088890J925392n087089j790238N863915
$$ 588617096 587308235 590227776 591849556 593938446 595863838 590776749 588986511 594850426
1654.9E94850426N409507K383194J687928K48413L88374J129189J347007J409150J087074
$$ 594850426 600259933 602643127 604331055 604579468 604967842 606097031 607444038 608853188 609940262
1663.6F09940262L947143K799225K379837J907158R86748j725426o60019L082199K080574
$$ 609940262 613887405 616686630 619066467 620973625 621960373 620234947 619574928 622657127 624737701
1672.3F24737701L967057M170799K021484J027680K829704K440796R28421M83932j17721
$$ 624737701 628704758 632875557 634897041 635924721 638754425 641195221 642123642 642607574 642489853
1680.9F42489853L325729L842011m55704j064453N211487N754928K583466J35574J415482
$$ 642489853 645815582 649657593 649201889 648137436 653348923 659103851 661687317 661822891 663238373
1689.6F63238373R08584K007142K847976L129425L915863L423233l463974L088227
$$ 663238373 664146957 666154099 669002075 672131500 676047363 679470596 676006622 679094849
1697.3F79094849M113998L123856j934433m771729O538086M870758L166275J796112
$$ 679094849 683208847 686332703 684398270 679626541 686164627 691035385 694201660 695997772
1705F95997772J658554O07376J875458K214966l70712n72968J205292J725998J974945
$$ 695997772 697656326 698263702 700139160 702354126 701983414 701410446 702615738 704341736 706316681
1713.7G06316681O332M28238L155060R8343m778366L691559K611084P51190N04303
$$ 706316681 706323013 706751251 709906311 710004654 705226288 708917847 711528931 712280121 712784424
1722.4G12784424P90329J925583K568664J999588J038742K90375m28162l020324j231461
$$ 712784424 713574753 715500336 718069000 720068588 721107330 721397705 720969543 717949219 716717758
1731.1G16717758K057343J659164q85467j556931N351715M134674P77817N95779k629623
$$ 716717758 718775101 720434265 719548798 717991867 723343582 727478256 728256073 728851852 726222229
1739.8G26222229k570724K858810J470642K39792K188797L749618K270585P69805l1738
$$ 726222229 723651505 726510315 727980957 728220749 730409546 734159164 736429749 737199554 737167816
1748.4G37167816j552505J740188j335678k23160M406205L480453L317566K381897
$$ 737167816 735615311 737355499 736019821 735796661 740202866 743683319 747000885 749382782
1756.2G49382782p67136L65601O48346m18549j14898k984925N99823L904801L005218
$$ 749382782 748615646 748981247 749629593 749211044 749096146 746111221 746711044 750615845 753621063
1764.8G53621063K516785K222214P91855l406907j37634Q27866l025055k329865J569290
$$ 753621063 756137848 758360062 759151917 755745010 755607376 756435242 753410187 751080322 752649612
1773.5G52649612M574738K866669O94122J876068Q087p29904j580429k294312L67356
$$ 752649612 757224350 760091019 760785141 762661209 762669296 761939392 760358963 758064651 758432007
1782.2G58432007J349182J510010J439132K399369K151642K35443j113358j136093
$$ 758432007 759781189 761291199 762730331 765129700 767281342 767516785 766403427 765267334
1789.9G65267334k807236k455215j900177K030029M524307K483292J345825J404419
$$ 765267334 762460098 760004883 758104706 760134735 764659042 767142334 768488159 769892578
1797.6G69892578O90842j719895l187255m64402j302185R20258K791519K498856K224731
$$ 769892578 770583420 768863525 765676270 765211868 763909683 764829941 767621460 770120316 772345047
1806.3G72345047J031418l11279r26819j320877l301163j075974R18503J642609K664795
$$ 772345047 773376465 773065186 772138367 770817490 767516327 766440353 767358856 769001465 771666260
1815G71666260K011184K008057K42310q03299j155625k281341r99985r31320Q71582
$$ 771666260 773677444 775685501 775927811 775124512 773968887 771687546 770687561 769756241 770627823
1823.7G70627823J746521O79550K193146K051010L21655k158584m303055l81775P47604
$$ 770627823 772374344 773053894 775247040 777298050 777619705 775461121 771158066 770776291 771523895
1832.3G71523895k14309J235199K410583K025833J347656J68457M3717j684342j988372
$$ 771523895 771309586 772544785 774955368 776981201 778328857 778497314 778541031 776856689 774868317
1841G74868317k073517o32172M71573j131668L993454L408203O72989k54135o01196
$$ 774868317 772794800 772162628 772634201 771502533 775495987 778904190 779577179 779323044 778721848
1849.7G78721848j306916k423553j197129J43738J436997K250213K264710J576843
$$ 778721848 777414932 774991379 773794250 773937988 775374985 777625198 779889908 781466751
1857.4G81466751k23083j166840j772614j783142j778793l09524J085128J302567J759949
$$ 781466751 781243668 780076828 778304214 776521072 774742279 774432755 775517883 776820450 778580399
1866.1G78580399J274795J259766j202393k458267l65067q15124j129303k38800J384582
$$ 778580399 779855194 781114960 779912567 777454300 777089233 776274109 775144806 774906006 776290588
1874.8G76290588J859208K315826J599426L81012p32956k251968j866379j915588o86875
$$ 776290588 778149796 780465622 782065048 782446060 781713104 779461136 777594757 775679169 774992294
1883.4G74992294Q01163J656494K429047J937256J368637j127243l179474q62885o07910
$$ 774992294 775793457 777449951 779878998 781816254 783184891 782057648 778878174 778015289 777407379
1892.1G77407379j126861j60218N35050J461029K730407J602707N63202o35681k077942
$$ 777407379 776280518 776120300 776655350 778116379 780846786 782449493 783012695 782377014 780299072
1900.8G80299072j997986j702117n55039M85230J846542K023544J216583N22461m88281
$$ 780299072 778301086 776598969 776043930 776529160 778375702 780399246 781615829 782138290 781650009
1909.5G81650009j336899j645736r45588j118927j08795J120301J999969K323837o00967
$$ 781650009 780313110 778667374 777721786 776602859 776494064 777614365 779614334 781938171 781337204
1918.2G81337204m54636K02942j083297j467820k369690n82885J431656K048416J865768
$$ 781337204 780882568 781085510 780002213 778534393 776164703 775581818 777013474 779061890 780927658
1926.8G80927658J534805M19693q48083j507263k040940j331253o17981L22342Q68912
$$ 780927658 782462463 782882156 782034073 780526810 778485870 777154617 776536636 776858978 777727890
1935.5G77727890J525345J748199P63321K36511j104202j467666k405854k397613Q53958
$$ 777727890 779253235 781001434 781764755 782001266 780897064 779429398 777023544 774625931 775479889
1944.2G75479889J414795J434936J507721J389389M60129o96030j435470j602631j187668
$$ 775479889 776894684 778329620 779837341 781226730 781686859 780990829 779555359 777952728 776765060
1952.9G76765060q55331J53961J389466K054061J562500P12433n56030j814270j853790
$$ 776765060 775909729 776063690 777453156 779507217 781069717 781782150 781226120 779411850 777558060
1961.6G77558060j683884o63986J9913Q37707J569138Q98285J205749Q97293n05371
$$ 777558060 775874176 775210190 775230103 776067810 777636948 778535233 779740982 780638275 780132904
1970.2G80132904j561737j717758j585770o39191P96509J308747J775817J474152O27823
$$ 780132904 778571167 776853409 775267639 774628448 775424957 776733704 778509521 779983673 780611496
1978.9G80611496o00739j512069j766587j768722p34406R4300J173858J985627J762924
$$ 780611496 780010757 778498688 776732101 774963379 774228973 774323273 775497131 777482758 779245682
1987.6G79245682O33926m90188k99530j483078k887421j697083k3574J397094J758423
$$ 779245682 779879608 779389420 779089890 777606812 774719391 773022308 772998734 774395828 776154251
1996.3G76154251J613083J228027K52152p71179j181183j957321j930771q43888J79902
$$ 776154251 777767334 778995361 779247513 778476334 777295151 775337830 773407059 772563171 772743073
2005G72743073J542968J853943J395035O16226l51105r66720j414108j755906j694641
$$ 772743073 774286041 776139984 777535019 778151245 777800140 776833420 775419312 773663406 771968765
2013.6G71968765k04391J225128J704788J522446J024704N87616n14984j551361k347031
$$ 771968765 771764374 772989502 774694290 776216736 777241440 777829056 777314072 775762711 773415680
2022.3G73415680j877976q86230K05612J530533J791000J686783J002274q1101q84933
$$ 773415680 771537704 770651474 770857086 772387619 774178619 775865402 776867676 776786575 775901642
2031G75901642j803589k251358j527100j65405J198731J818466J376648J049881M12292
$$ 775901642 774098053 771846695 770319595 770154190 771352921 773171387 774548035 775597916 776010208
2039.7G76010208p58362k000198j980820j166534r38263M94995J556091J814194J584168
$$ 776010208 775251846 773251648 771270828 770104294 769166031 769661026 771217117 773031311 774615479
2048.4G74615479M35333j70517j173096k050934k184295j283799J16806J040192J792526
$$ 774615479 775050812 774880295 773707199 771656265 769471970 768188171 768304977 769345169 771137695
2057G71137695J740952J294556L69262o02188j427917k118988j785737p90557N32379
$$ 771137695 772878647 774173203 774542465 773940277 772512360 770393372 768607635 767817078 768349457
2065.7G68349457J340103J788711J486664O97174k79235j131211j503830j868591j012573
$$ 768349457 769689560 771478271 772964935 773662109 773382874 772251663 770747833 768879242 767866669
2074.4G67866669k47040P21435J617127J281509J322556M27627r12933j562195j673584
$$ 767866669 767619629 768341064 769958191 771239700 772562256 772989883 772076950 770514755 768841171
2083.1G68841171j583481q51364P82700J534653J728439J419907N81970n28794j384582
$$ 768841171 767257690 766406326 767189026 768723679 770452118 771872025 772453995 771925201 770540619
2091.7G70540619j616211j429672q62198m24118J007385K021637J471024Q04672L2043
$$ 770540619 768924408 767494736 766632538 766208420 767215805 769237442 770708466 771513138 771545181
2100.4G71545181q67767j480789j631623j681366m98123Q10013J121521J417084J352920
$$ 771545181 770677414 769196625 767565002 765883636 765385513 766195526 767317047 768734131 770087051
2109.1G70087051Q91800m2190r67636j990891k088165r61075J92490J099624J375962
$$ 770087051 770978851 770936661 769969025 767978134 765889969 764928894 765121384 766221008 767596970
2117.8G67596970J590042R82895K8686r83505j717224j517792j197815J2055N19027
$$ 767596970 769187012 770169907 770198593 769215088 767497864 765980072 764782257 764794312 765313339
2126.5G65313339J179657J837158J126252M31442p34940j173095j760102j879806p54776
$$ 765313339 766492996 768330154 769456406 769887848 769152908 767979813 766219711 764339905 763585129
2135.1G63585129M9667J272278J756287J448593Q23440k77633j257096j523132j218033
$$ 763585129 763634796 764907074 766663361 768111954 768935394 768657761 767400665 765877533 764659500
2143.8G64659500o66504K18430O01730J168137J674957J260147M6921j064453j237030
$$ 764659500 763992996 764211426 764813156 765981293 767656250 768916397 768963318 767898865 766661835
2152.5G66661835j387558j187516l81088N58396J055069J556167J463623O19736k55051
$$ 766661835 765274277 764086761 763705673 764264069 765319138 766875305 768338928 768958664 768703613
2161.2G68703613j902618j922379r44290n58166J22680O18286J239167J708374J531677
$$ 768703613 766800995 764878616 763934326 763376160 763498840 764117126 765356293 767064667 768596344
2169.9G68596344M69894q52661j903686j777802q88061l05634N61066J151962J926651
$$ 768596344 769066238 768213577 766309891 764532089 763644028 763338394 763899460 765051422 766978073
2178.5G66978073J281891L09448j48773j814041j884308j105881n31387M7073J327744
$$ 766978073 768259964 768569412 768420639 766606598 764722290 763616409 763085022 763132095 764459839
2187.2G64459839K120209J040344P38067J54801q25882j818619j872558q79059l26004
$$ 764459839 766580048 767620392 768358459 768513260 767687378 765868759 763996201 763117142 762791138
2195.9G62791138R44290J569214J586532J269913N23529n08194j534653j740646j649780
$$ 762791138 763735428 765304642 766891174 768161087 768684616 768176422 766641769 764901123 763251343
2204.6G63251343n93415K04239J194229J889191J604767R55124l50952p94831j797714
$$ 763251343 762657928 762862167 764056396 765945587 767550354 768505478 768154526 767359695 765561981
2213.3G65561981j776199q08792l55149R83811J522217J750946J300354M06723n12696
$$ 765561981 763785782 762976990 762621841 763605652 765127869 766878815 768179169 768585892 768073196
2221.9G68073196j939544j993637j187744p23343P9574J509705J731643J611863J263504
$$ 768073196 766133652 764140015 762952271 762228928 762308502 763818207 765549850 767161713 768425217
2230.6G68425217k04697j157608j596146j635666j654281m76837R45511J378479J730423
$$ 768425217 768220520 767062912 765466766 763831100 762176819 761699982 762645493 764023972 765754395
2239.3G65754395J131362L88566l20969j244660j865310j713257q89130N35813J509018
$$ 765754395 766885757 767274323 766953354 765708694 763843384 762130127 761240997 761776810 763285828
2248G63285828J224823J616974R95178p34253j416092j460724j591568j442566j74026
$$ 763285828 764510651 766127625 767122803 766388550 764972458 763511734 761920166 760477600 760303574
2256.7G60303574P95669J767273J921082J289138M52881j137466j813583j959839j658936
$$ 760303574 761099243 762866516 764787598 766076736 766529617 765392151 763578568 761618729 759959793
2265.3G59959793r94110M92859J281814J429902K072906R92813k80533j265258j630936
$$ 759959793 758965683 759458542 760740356 762170258 764243164 765235977 764955444 763690186 762059250
2274G62059250j681748j286010j3047P84378J759568J558304J413345N96542n47104
$$ 762059250 760377502 759091492 759078445 759862823 761622391 763180695 764594040 765190582 764643478
2282.7G64643478j182479k106095j574173j375503J93863P42034P99408J415940M04815
$$ 764643478 763460999 761354904 759780731 758405228 758599091 759341125 760140533 761556473 761961288
2291.4G61961288J44730j941070k526551k081299j497879j38168n3787J279526K42004
$$ 761961288 762106018 760164948 757638397 755557098 754059219 753921051 753867264 755146790 755388794
2300G55388794M79202l1509j587525j156463k486267k229309k724152j092300L16925
$$ 755388794 755867996 755836487 754248962 753092499 750606232 748376923 745652771 744560471 744877396
2308.7G44877396L84445Q08410q70132l65524k426911k007141j615448k501297p74460
$$ 744877396 745261841 746070251 745200119 744834595 742407684 740400543 738785095 736283798 735509338
2317.4G35509338k119522m09698j034088j025467l66669k362823k338181l181000j844482
$$ 735509338 733389816 732980118 731946030 730920563 730553894 728191071 725852890 722671890 720827408
2326.1G20827408k476578l89481N34668K02103Q30231r82666L69797j387482o66351
$$ 720827408 718350830 717961349 718496017 718698120 719528351 718545685 718915482 717528000 716861649
2334.8G16861649k168808k395707P84684q26035N18265k49634N87387j9913J20316
$$ 716861649 714692841 712297134 713081818 712255783 712774048 712524414 713111801 713091888 713212204
2343.4G13212204K37427m77677L426361M649201O760712K862396k749787l923721n183563
$$ 713212204 713449631 712971954 716398315 721047516 727808228 730670624 727920837 723997116 718813553
2352.1G18813553m993515m637985m670334m579163m907837k017898P7133R21249J918640
$$ 718813553 713820038 709182053 704511719 699932556 695024719 693006821 693083954 694005203 695923843
2360.8F95923843J282349j838531Q80279J457825N58548K654876K757187L754502L681488
$$ 695923843 697206192 695367661 696247940 697705765 698264313 700919189 703676376 707430878 711112366
2369.5G11112366M386902M180831L663407L249435K458039J890564J449508K456360
$$ 711112366 715499268 719680099 723343506 726592941 729050980 730941544 732391052 734847412
2377.2G34847412K903137L840714M009170L260956K651138J830674J231765M1581r7809
$$ 734847412 737750549 741591263 745600433 748861389 751512527 753343201 754574966 754616547 754518738
2385.9G54518738j47248J12839J368027J442795J121826Q11615M5853j097107j243973
$$ 754518738 754371490 754484329 755852356 757295151 758416977 759228592 759274445 758177338 756933365
2394.6G56933365j186600j272583k74124P02744J141357R96094J018448M96597k48566
$$ 756933365 755746765 754474182 754200058 754902802 756044159 757040253 758058701 758555298 758306732
2403.2G58306732j017685j756668j058349p38907j26877Q87604J288681J229248M97131
$$ 758306732 757289047 755532379 754474030 753735123 753608246 754495850 755784531 757013779 757510910
2411.9G57510910P6752o12183j417923j624756q22982k32926J10703J133728J129837
$$ 757510910 757587662 756975479 755557556 753932800 753109818 752876892 752987595 754121323 755251160
2420.6G55251160P93304K32086o27670j042175j252747j417541q45948N43061R21478
$$ 755251160 756044464 756276550 755648880 754606705 753353958 751936417 751090469 751633530 752555008
2429.3G52555008J351089J229020Q9035k96479q33816j231384j367875j320953m61807
$$ 752555008 753906097 755135117 755224152 754927673 754093857 752862473 751494598 750173645 749711838
2438G49711838Q24127J307449J060028P78199K44827j43204j061401j592941j335526
$$ 749711838 750535965 751843414 752903442 753681641 753926468 753783264 752721863 751128922 749793396
2446.6G49793396r11255K95715R41468R01489J006165Q37402l357q53882j638870k089386
$$ 749793396 748882141 749177856 750119324 751020813 752026978 752864380 752861023 752007141 750368271 748278885
2456.3G48278885q28018M42276M40750R05838J706467R61227j62659n91278j345978
$$ 748278885 747450867 747893143 748333893 749239731 750946198 751907425 751744766 751153488 749807510
2465G49807510j655960j280365o80389J04065P27997J104507J498184J006928k00577
$$ 749807510 748151550 746871185 746190796 746294861 747022858 748127365 749625549 750632477 750431900
2473.6G50431900q59222j574860j590729j282272n57556O36978J101227J710891J043778
$$ 750431900 749572678 747997818 746407089 745124817 744567261 745204239 746305466 748016357 749060135
2482.3G49060135p1259o84127j481476j550522j264343n09186O8207R17053J325149
$$ 749060135 748988876 748304749 746823273 745272751 744008408 743499222 743567429 744484482 745809631
2491G45809631P88498N61142m29535j219406j541748j388931n20630j24207L69721
$$ 745809631 746598129 747159271 746729736 745510330 743968582 742579651 742059021 741934814 742304535
2499.7G42304535J013260J139450R32083L26157o94733j374054j988602j433716j31683
$$ 742304535 743317795 744457245 745389328 745715485 745020752 743646698 741658096 740224380 740092697
2508.3G40092697J89591P55996Q97599J087570O76193o27518q11157j274795j129532
$$ 740092697 740282288 741038284 741935883 743023453 743699646 743072128 742260971 740986176 739856644
2517G39856644o26068o00357L94668J134338R02939O04630M23508l06016j245574j746521
$$ 739856644 739230576 738630219 739024887 740159225 741062164 741666794 742090302 741784286 740538712 738792191
2526.7G38792191j253205m35180j85776O38428J451644J077195K91671l90625j132125
$$ 738792191 737538986 737103806 736918030 737556458 739008102 740085297 740376968 739986343 738854218
2535.4G38854218j186524r64355p03583j4649L32566R65728J191788P75223J11160
$$ 738854218 737667694 736703339 735999756 735985107 736317673 737283401 738475189 739250412 739361572
2544G39361572p77206j112442j313324q90045o84357k25067Q64410J065445Q77991
$$ 739361572 738584366 737471924 736158600 735268555 734584198 734359131 735223541 736288986 737166977
2552.7G37166977J75705m55628q74099r54132j173554j147156K8687K09885P92999
$$ 737166977 737342682 736887054 736012955 735058823 733885269 732738113 732766800 732976685 733769684
2561.4G33769684J691360Q05435m96902j157837j123352r01489n08194k86408o4239
$$ 733769684 735461044 736266479 735769577 734611740 733488388 732586899 732078705 731792297 731728058
2570.1G31728058M78058Q75854P57294L69339k34146j151200r98764q23288q55407
$$ 731728058 732206116 733081970 733839264 734208603 733974457 732823257 731824493 731001205 730145798
2578.7G30145798j85929M19464R47342R10874M96979l85743r98611j158600j405945
$$ 730145798 729959869 730379333 731326675 732237549 732734528 732348785 731350174 730191574 728785629
2587.4G28785629p67135J220L43476M34265Q72574Q14361j81503m76227o99081j035614
$$ 728785629 728018494 728019714 728363190 728797455 729670029 730484390 730302887 729826660 729127579 728091965
2597.1G28091965j042481p36694k10877O23017J319732P42875k16980l60413k24991
$$ 728091965 727049484 726312790 726101913 726724930 728044662 728787537 728570557 728210144 727985153
2605.7G27985153r81293j446304q71506k48947K28958P85141J143265L65906j22147
$$ 727985153 727003860 725557556 724686050 724437103 724666061 725451202 726594467 726960373 726838226
2614.4G26838226m60663j251068j035461o49948o04553k97013O56052J021118P39670
$$ 726838226 726377563 725126495 724091034 723441086 722836533 722539520 723195572 724216690 724956360
2623.1G24956360M93927l24631q66318j244125j343460r51996j83487M85230P42111
$$ 724956360 725450287 725125656 724259338 723015213 721671753 720719757 720536270 721021500 721763611
2631.8G21763611Q79288K83355j8539o78482j138611o28738j119080p03430N85098
$$ 721763611 722642899 722926254 722907715 722229233 721090622 720461884 719342804 718639374 719224472
2640.5G19224472O14166L49350N04761K51389m96445j029587j302032j154328p16781
$$ 719224472 719838638 720187988 720692749 720944138 720447693 719418106 718116074 716961746 716244965
2649.1G16244965R5596O87942P01905N88073L17307j06125q68225r20258n71823o95953
$$ 716244965 716340561 717028503 717730408 718318481 718635788 718529663 717661438 716741180 716169357 715473404
2658.8G15473404p44095m87671L14484J008224J038819L77578n22613j156616j324158
$$ 715473404 714729309 714241638 714556122 715564346 716603165 716980743 716458130 715301514 713977356
2667.5G13977356j121445m59060N06286N43900O21414P46155K12249n8898o22025j104660
$$ 713977356 712855911 712396851 712903137 713447037 714068451 714814606 715026855 714967957 714345932 713241272
2677.1G13241272q86154p34940q57544k45056O15311Q78677R94034L36533n54810j234970
$$ 713241272 712355118 711620178 710762634 710517578 711132889 712011566 713005600 713342133 712787323 711552353
2686.8G11552353j558838r22241k62222O3934N35126Q99887P57446M21143l00217j109924
$$ 711552353 709993515 709071274 708809052 708872986 709408112 710307999 711065445 711486588 711186371 710076447
2696.4G10076447j206055q25043n84564n52292R8267R44595J179428P11136N1117o82984
$$ 710076447 708870392 708045349 707460785 706908493 707006760 707951355 709130783 709841919 709893036 709210052
2706G09210052j241455q64868j024246j198196k35901O39648Q24661O49567L48435
$$ 709210052 707968597 707103729 706079483 704881287 704645386 705285034 706109695 706759262 707107697
2714.7G07107697j79062k14768o66122j441498j157608j12228N89065L15247O85119
$$ 707107697 706928635 706713867 706047745 704606247 703448639 703336411 703925476 704240723 704925842
2723.4G04925842P93457L07236k15225j235810j216659r14993n61753R9717P28607
$$ 704925842 705719299 706026535 705811310 704575500 703358841 702443848 701882095 701981812 702710419
2732.1G02710419O83975Q5678M62341J45493o44455r38644j089936q03375l03879K58179
$$ 702710419 703394394 703480072 703942413 704087906 703443451 702504807 701414871 700611496 700307617 700565796
2741.7G00565796N38635J213074Q97598l83606l83148l59497r54514r57794n35431
$$ 700565796 701104431 702317505 703215103 702831497 702448349 702088852 701134338 700176544 699641113
2750.4F99641113m42352K57645R30862Q16650M86451m17633o49720n52368j077728
$$ 699641113 699198761 699456406 700387268 701203918 701690369 701272736 700623016 700070648 698992920
2759.1F98992920r21173j3199K62985J17417L51715N28946O41250j28021j192322j202011
$$ 698992920 698071747 698058548 698321533 698438950 698790665 699319611 699960861 699832840 698640518 697438507
2768.7F97438507p30133o1951L61100L58810K62299N59845N13839n05142j294403j194153
$$ 697438507 696708374 696646423 697007523 697366333 697628632 698188477 698702316 698197174 696902771 695708618
2778.4F95708618o45828m29535k83966J09482N94864P63855L28598k37275m60662p52259
$$ 695708618 695062790 694633255 694349289 694458771 695053635 695817490 696146088 695908813 695448151 694695892
2788F94695892j211090o45675l58277l68576J86920L06702N83496K22092m38996o97403
$$ 694695892 693484802 692839127 692480850 692112274 692299194 692605896 693189392 693411484 692972488 692275085
2797.7F92275085r73739r99985p80182k2278J60065K10800M95682M10843j05591r34830
$$ 692275085 691301346 690301361 689521179 689498901 689658966 689869766 690365448 690776291 690670700 689735870
2807.3F89735870p55844o49338r07440q75015l74680N45578L89939l510K5177m00314
$$ 689735870 688980026 688330688 687423248 686548233 686173553 686719131 687109070 687105560 687130737 686730423
2816.9F86730423j111755j277237j092224q70133l18069K64129M71802J48850K2811
$$ 686730423 685618668 684341431 683249207 682379074 682061005 682325134 682796936 682945786 682968597
2825.6F82968597n93109j291427j195145j249084n29786P4540k81830m74701k00119
$$ 682968597 682375488 681084061 679888916 678639832 678110046 678184586 677902756 677428055 677227936
2834.3F77227936N4550n00031j047134j083527j305618j730728j596069j752167j638336
$$ 677227936 677282486 676782455 675735321 674651794 673346176 671615448 670019379 668267212 666628876
2843F66628876p86057j055527j218414j578827k424011k803268k992707j989975q39233
$$ 666628876 665842819 664787292 663568878 661990051 659566040 656762772 653770065 651780090 650940857
2851.7F50940857m2343N53436N51910K32850j51825J1520L18451N26886k7390m86373
$$ 650940857 650898514 651451950 652003860 652236710 652084885 652096405 652414856 652941742 652914352 652427979
2861.3F52427979L35540R86328O61545L5095O8894L8147n21927r36432r94797p07397
$$ 652427979 652763519 653749847 654411392 654446487 654515381 654553528 654031601 653095169 652100372 651392975
2870.9F51392975o0959M64706L08457K62451K13394k76108o37436m24194m84085r88312
$$ 651392975 651332016 651796722 652105179 652367630 652581024 652304916 651667480 651243286 650759201 649770889
2880.6F49770889o98852n7755N98984K34680m35257j23672n36728j106873j390228
$$ 649770889 649072037 649014282 649613266 649847946 649412689 649289017 648752289 647645416 646255188
2889.3F46255188j469269j040344l91007J11847j98593n00717l53470o04629j522827
$$ 646255188 644785919 643745575 643354568 643466415 643267822 642767105 642413635 641809006 640286179
2897.9F40286179j539040r58214o65092l67432q55942p68738l32717l05901l80058
$$ 640286179 638747139 637788925 637123833 636756401 635900459 635131721 634799004 634493103 634113045
2906.6F34113045r36966j231957j295318j362725k119331j795807o79931j184845j395722
$$ 634113045 633176079 631944122 630648804 629286079 627166748 625370941 624691010 623506165 622110443
2915.3F22110443j658325k056618j840324j572190j534805j885605j093406j2360K73781
$$ 622110443 620452118 618395500 616555176 614982986 613448181 611562576 610469170 610456810 610730591
2924F10730591N37834R52339N59006j74523K79656M67873N01747Q83445Q22869J180572
$$ 610730591 611268425 612220764 612779770 612605247 612884903 613352776 613854523 614737968 615560837 616741409
2933.6F16741409J688729J301956J386986J466026K0828j52092N31120O19698J101112
$$ 616741409 618430138 619732094 621119080 622585106 622605934 622453842 622984962 623604660 624705772
2942.3F24705772J092682J001091Q91724L67432J16310J41067m34036j028977m29191
$$ 624705772 625798454 626799545 627691269 628058701 628175011 628316078 627882042 626853065 626423874
2951F26423874K46162M26407K23770K04850M82444L56980J37596p9575j94206m5967
$$ 626423874 626670036 627096443 627320213 627525063 628007507 628364487 628502083 628422508 628228302 628182335
2960.6F28182335P24563Q10128L37944J055984J153832Q85086J218414O17943j59302
$$ 628182335 628906898 629717026 630054970 631110954 632264786 633149872 634368286 634986229 634826927
2969.3F34826927J33972P34253R93653J034355R35631P13691N19524N36766L74298
$$ 634826927 634960899 635695152 636688805 637723160 638658791 639372482 639892006 640428772 640803070
2978F40803070K2125k35748q3542K37579r7961J27029Q73871J077423R35440j25656
$$ 640803070 640825195 640589447 640505905 640743484 640645523 640772552 641646423 642723846 643659286 643533630
2987.6F43533630q95538l88946P400j22986k44980P0496L06854L91846N38864j12305
$$ 643533630 642638092 642249146 642256546 642133560 641888580 641959076 642265930 642657776 643196640 643084335
2997.3F43084335p20291n05752m52271p69577o20956K03018L6163l66211J75782N6457
$$ 643084335 642364044 641858292 641406021 640636444 640015488 640218506 640254669 639888458 640064240 640120697
3006.9F40120697q3771R8877n60798j191330o84510k23999J63231O74782Q3580j29013
$$ 640120697 640036926 640135803 639575005 638383675 637699165 637475166 637638397 638313179 638396759 638267746
3016.6F38267746j70326r63059j104431o02760k66113o69213n21774L4637K72293J06850
$$ 638267746 638097420 637134361 636029930 635427170 635161057 634491844 633970070 634004707 634277000 634383850
3026.2F34383850o35376l15094J64681k62261r28802j073304o64482l62434K58255
$$ 634383850 633748474 633433380 633598061 633335800 632406998 631333694 630669212 630306778 630565033
3034.9F30565033L79677j11809m26598q62274j312713o14281j77422q78906m66270
$$ 630565033 630944710 630832901 630406303 629544029 628231316 627617035 627439613 626560707 626094437
3043.6F26094437N9280J19667K5520K9717k29111j249771r16367o64443o94619n79376
$$ 626094437 626153717 626273384 626298904 626328621 626099510 624849739 623933372 623268929 622574310 621994934
3053.2F21994934n26848Q2703r8114j64337k99721o26373q77610j039238p55004l99437
$$ 621994934 621468086 621550789 621452675 621288338 620988617 620362244 619484634 618445396 617690392 617290955
3062.9F17290955K28576r536K04849J89934n36538m18052r84764j110726r91134q06962
$$ 617290955 617519531 617509995 617714844 617904778 617368240 616950188 615965424 614854698 613863564 613056602
3072.5F13056602l01475m4022J08528r7847J41488l66440p83425p34481r48487o40220
$$ 613056602 612755127 612711105 612819633 612721786 612863274 612496834 611713409 610978928 610030441 609390221
3082.1F09390221n19410p8849K35443J62964j40648m21982m76456m25415l77388j104965
$$ 609390221 608870811 608791962 609027405 609190369 609049721 608627739 608151283 607725868 607348480 606243515
3091.8F06243515q52776k71835l4675J21192o41670n56679j01966k08779o40983q28820
$$ 606243515 605390739 605118904 605084229 605205421 604563751 604007072 603905106 603696327 603055344 602226524
3101.4F02226524p77893o78100m24729m64668K09084J95579n77927k72216j72043q45184
$$ 602226524 601448631 600770531 600345802 599881134 600090218 600285797 599707870 599435654 599263611 598418427
3111.1E98418427j133805p15637l31726l29895o85043p096L97110m89158p00112p09190
$$ 598418427 597284622 596568985 596237259 595907364 595222321 595215225 595612335 595123177 594423065 593713875
3120.7E93713875n97458p42951r08546o84738k14234K18621k08664L0289k66495q66394
$$ 593713875 593116417 592373466 591464920 590780182 590565948 590784569 590575905 590606194 590339699 589473305
3130.4E89473305q67234j248016j021767m61769K23847K56691J45492r6435q53310
$$ 589473305 588606071 587358055 586336288 585874519 586098366 586355057 586500549 586404114 585550804
3139E85550804m90913n75676j213570j195831p97081k58751P7095j03607l92418k87972
$$ 585550804 585059891 584484215 583270645 582074814 581277733 581018982 581096077 580992470 580600052 580312080
3148.7E80312080m12063l83263o32324j001358j025696j008911n30281k01073j70212
$$ 580312080 579900017 579516754 578884430 577883072 576857376 575848465 575318184 575117111 574946899
3157.4E74946899j97296N5008l60374q11005p69997j330604p68967Q8806J72501m08974
$$ 574946899 574749603 574804611 574444237 573633232 572863235 571532631 570763664 570852470 571024971 570615997
3167E70615997p95021m59404p03659o96373p21016m88243m11911n90248k85835j92948
$$ 570615997 569820976 569361572 568657913 567961540 567240524 566752281 566340370 565750122 565464287 565271339
3176.6E65271339M7303p20024p45354k96173r67331n94788k65617p86591j096878l30696
$$ 565271339 565318642 564598618 563853264 563557091 562589760 561994972 561729355 560942764 559845886 559515190
3186.3E59515190K41699K3346k2316o10618j203423j129417q92830p84950m53988k66418
$$ 559515190 559756889 559780235 559757919 559147301 557943878 556814461 555921631 555136681 554682693 554416275
3195.9E54416275P896m1122o03905m01649q08602r45587l88260l15322p57943o61049
$$ 554416275 554424171 554383049 553779144 553377495 552568893 551623306 551235046 550919724 550161781 549500732
3205.6E49500732L51525m04854n60570J2436o87866q25234r44290n18875l62511q22067
$$ 549500732 549852257 549447403 548886833 548899269 548211403 547386169 546441879 545923004 545560493 544738426
3215.2E44738426o12945J2588K75955l14865q34083j005974k80037p5378o12793p03240
$$ 544738426 544125481 544138069 544414024 544099159 543265076 542259102 541979065 541903687 541290894 540587654
3224.9E40587654q00896k42271m7684l12576m43039l59001j19667n31655q98246o63452
$$ 540587654 539786758 539544487 539496803 539184227 538741188 538382187 538262520 537730865 536832619 536169167
3234.5E36169167k07634l46985m60129l07121m46358o38313o32439l19748l23448n30472
$$ 536169167 535961533 535614548 535154419 534847298 534400940 533762627 533130188 532810440 532486992 531956520
3244.2E31956520q54835j24741M22707l79830o03027r80911n80521O9542n12428n78232
$$ 531956520 531101685 530976944 531399651 531019821 530416794 529435883 528855362 528924904 528412476 527834244
3253.8E27834244n14794l28331J21384j40152n16014l83606o01654k49939K71797o50787
$$ 527834244 527319450 526991119 527112503 526972351 526456337 526072731 525471077 525221138 525492935 524842148
3263.4E24842148j247788n96580N72204L89214m36211n17120p05643n95665p19947
$$ 524842148 523594360 522997780 523569984 523959198 523522987 523005867 522300224 521704559 520984612
3272.1E20984612n87769k79846m5204J16310l66783r5406O027m93622q50334o77566
$$ 520984612 520396843 520116997 520071793 520188103 519821320 519725914 519731941 519238319 518387985 517710419
3281.8E17710419k49253o66389q31528n4893P25593K10953n56374m01115N3978l34740
$$ 517710419 517461166 516794777 515963249 515908356 516633949 516844902 516288528 515887413 515941391 515606651
3291.4E15606651j067848r7694M3792q20999n55381l81508n19448l91540j11809l60832
$$ 515606651 514538803 514441109 514484901 513663902 513108521 512727013 512207565 511816025 511704216 511343384
3301E11343384j68877P9308m12522l17993k53410l01705j17340k52952m69284o86837
$$ 511343384 511174507 511253815 510841293 510523300 510269890 509968185 509850845 509597893 509128609 508441772
3310.7E08441772r76295m40025P3814n30090q14019l07426K16179l09639o70471o95038
$$ 508441772 507465477 507025452 507099266 506569176 505755157 505447731 505663910 505354271 504683800 503988762
3320.3E03988762q81081o8702K56576j9073q53501r44214j83982o57692l46604l38783
$$ 503988762 503107681 503038979 503295555 503276482 502422981 501478767 501294785 500637093 500290489 499951706
3330D99951706p74841m85306l32947r4223n98526n10826j47629j102562j214790n6725
$$ 499951706 499176865 498691559 498358612 498264389 497665863 497155037 497007408 495904846 494690056 494633331
3339.6D94633331P7439n80025p25555q49495m07029k71110o74935k60505n5809m85611
$$ 494633331 494710770 494130745 493405190 492555695 492148666 491877556 491202621 490942116 490886307 490400696
3349.3D90400696k21367J3924n56031k29530k56119m83246j67884o31333l19328K10762
$$ 490400696 490179329 490193253 489637222 489407692 489151573 488668327 488500443 487869110 487549782 487760544
3358.9D87760544Q5678m76990o51245o01959p83539R3689J04218k40021k70233l38364
$$ 487760544 487846222 487369232 486717987 486116028 485332489 485426178 485530396 485290375 485020142 484681778
3368.6D84681778K44446k80190p05414n51643p06215m71458K73590N74341Q6593k79541
$$ 484681778 484926224 484646034 483940620 483388977 482682762 482211304 482484894 483059235 483145828 482866287
3378.2D82866287q26568n22728R4223j92490l63960l81470p7362q9951k21519k7618
$$ 482866287 482039719 481516991 481611214 481418724 481054764 480673294 480595932 480505981 480284462 480256844
3387.8D80256844n0965p9498k10381l07426l09143m84047n35774k10419R5863M12903
$$ 480256844 480205879 480126381 479916000 479608574 479299431 478815384 478279610 478069191 478165054 478577957
3397.5D78577957p171o81420k72522k01149k32086n60112o74400N62057K20566k29836
$$ 478577957 478570786 477889366 477616844 477415695 477183609 476623497 475949097 476511154 476731720 476501884
3407.1D76501884N61066J39427m92172n0087K28081m38271l25508J88294k70577j78909
$$ 476501884 477062950 477202377 476710205 476660118 476888199 476449928 476124420 476312714 476042137 475863228
3416.8D75863228J30348K94304K80609n69382k18353M48761m49905k07863R10988M10156
$$ 475863228 475993576 476287880 476568489 475999107 475780754 476229515 475779610 475571747 476482735 476892891
3426.4D76892891j20163m1428j10092O8665l357J30157J70479O1722J4992l31726L87420
$$ 476892891 476772728 476731300 476621208 476689873 476686516 476816673 476987152 477048874 477063866 476732140 477119560
3437D77119560O30379K03896P0686j95274j31951n92956P0304N11322L34435O75545
$$ 477119560 477749939 477953835 478024521 477829247 477697296 477104340 477174644 477685966 478020401 478695946
3446.7D78695946k90947K76832O23742r8954K24648K09884K15111J68190K50969O41136
$$ 478695946 478404999 478681831 479305573 479206619 479431267 479641151 479856262 480024452 480275421 480916557
3456.3D80916557P84149L26157l43K49405j32904k74582q2131M93393P91741L96309
$$ 480916557 481700706 482026863 482026520 482275925 482143021 481868439 481786308 482279701 483071442 483467751
3466D83467751L44200K54135K58636L9864K17743M65851L31382L46413L44772Q11921
$$ 483467751 483811951 484066086 484324722 484364586 484582329 485048180 485379562 485725975 486070747 486882668
3475.6D86882668N50079L01781M87632M66309M38805J15699q1634q9264O44607O90155
$$ 486882668 487432747 487734528 488222160 488688469 489127274 489242973 489161339 489072075 489716682 490406837
3485.2D90406837J57128K94227K80190O13937R11713P03201j50757o6795J121063R91860
$$ 490406837 490563965 490858192 491138382 491752319 492664032 493367233 493216476 493149681 494270744 495262604
3494.9D95262604J59416K6245L69186P08924R94987O00472L95775J78337m08669L49083
$$ 495262604 495422020 495448265 495817451 496526375 497521362 498121834 498517609 498695946 498287277 498636360
3504.5D98636360Q49152O56853N14144R74465M46014p7362Q58956N09834R32388P11136
$$ 498636360 499485512 500142365 500656509 501630974 502076988 501999626 502858582 503368416 504300804 505011940
3514.2E05011940J75743P22160J29853K05078P90558R54933P78236R66759J51100q32252
$$ 505011940 505187683 505909843 506039696 506244774 507035332 507990265 508768501 509735260 509886360 509054108
3523.8E09054108Q00857Q96569O48994N86204K71225K89422L41186P79572P94029J065826
$$ 509054108 509854965 510751534 511400528 511986732 512257957 512547379 512888565 513668137 514462166 515527992
3533.5E15527992J041222J059914L2615j73492J070366L77197N18913O90994J029816
$$ 515527992 516569214 517629128 517661743 517488251 518558617 518935814 519454727 520145721 521175537
3542.1E21175537J014481Q38165P99522l7880N62401p70874J228218K148171J140671
$$ 521175537 522190018 523028183 523827705 523789825 524352226 523581352 524809570 526957741 528098412
3550.8E28098412J341247j436996Q48541J156921M09241J711845K94114J156959O37322
$$ 528098412 529439659 528002663 528851204 530008125 530417366 532129211 532423325 533580284 534217606
3559.5E34217606K21061N93109J011506J204376O92253K883263j157990j567459J031723
$$ 534217606 534438667 535031776 536043282 537247658 537939911 540823174 539665184 538097725 539129448
3568.2E39129448Q2512L059082O81915M70925J670265J253738L61405K40058J908226
$$ 539129448 539211960 542271042 542952957 543423882 545094147 546347885 546709290 546949348 548857574
3576.9E48857574M54827K072372J738396o37131J031990J021042K75917l83835K823296
$$ 548857574 549312401 551384773 553123169 552486038 553518028 554539070 554814987 554431152 557254448
3585.5E57254448J621132k713204Q62542k01378K919693L057136J697006n1383j16044
$$ 557254448 558875580 556162376 557024918 556823540 559743233 562800369 564497375 564445992 564329948
3594.2E64329948K908822k201767O86721K577553j27907K562676N87540N85403J972427
$$ 564329948 567238770 565037003 565723724 568301277 568173370 570736046 571323586 571908989 573881416
3602.9E73881416J037407J070099K013664K390099p37267K461281j003647j184578
$$ 573881416 574918823 575988922 578002586 580392685 579655418 582116699 581113052 579928474
3610.6E79928474O241570L96576j866379K880592j850433L319588L987274p87582J260795
$$ 579928474 586170044 586566620 584700241 587580833 585730400 589049988 593037262 592249680 593510475
3619.3E93510475p60918J02692K208328J787110J917267J923942R82056J392097N686684
$$ 593510475 592749557 592852249 595060577 596847687 598764954 600688896 601670952 603063049 608749733
3628F08749733k56081j0566291L779411M783859M925537J140366j910935J719628K900238
$$ 608749733 608493652 597927361 601706772 606490631 611416168 612556534 610645599 612365227 615265465
3636.6F15265465K525062M95453J013451J695328J956977J388627L11164J754570K380677
$$ 615265465 617790527 618285980 619299431 620994759 622951736 624340363 624651527 626406097 628786774
3645.3F28786774L934059k850838n428581M685860R29870j407699R3689N340728M634056
$$ 628786774 632720833 629869995 624441414 629127274 630057144 628649445 628743134 634083862 638717918
3654F38717918K862587L442688o546135Q99468M614029J548767J055450k40783J404419
$$ 638717918 641580505 645023193 638477058 639376526 643990555 645539322 646594772 646353989 647758408
3662.7F47758408J241455R56726O16913l21656L066712J460647j525192j04523o036682
$$ 647758408 648999863 649956589 650573502 650251846 653318558 654779205 653254013 653149490 647112808
3671.4F47112808K129135P742997P374954l374253j5217208M279403P025452L796082
$$ 647112808 649241943 656984940 664359894 660985641 645768433 650047836 657073288 660869370
3679.1F60869370k154313J47934K214508J248780J274109p9041m98352K622757M876175
$$ 660869370 658715057 658862991 661077499 662326279 663600388 663521347 663022995 665645752 670521927
3687.8F70521927p553864l605423P068329n034103p79190M398727Q24204J548309j1063
$$ 670521927 662968063 659362640 666430969 661396866 660617676 665016403 665840607 667388916 667377853
3696.4F67377853n67703K14920q76541J871719L399659l982621k971878M169998J749192
$$ 667377853 666810150 667025070 666148529 668020248 671419907 667437286 664465408 668635406 670384598
3705.1F70384598m39759K61536K885437L932419q002090J479949M815979r898376L743439
$$ 670384598 669944839 670206375 673091812 677024231 669022141 670502090 675318069 665419693 669163132
3713.8F69163132M172973L052k04620J071319K36435l371582Q33817N117721k463073
$$ 669163132 673336105 673339157 673134537 674205856 674442291 671070709 671904526 677022247 674559174
3722.5F74559174m372330L387222L83377o05545k504349j68380L064117O42624M777985
$$ 674559174 670186844 673574066 673957443 673351898 670847549 670679169 673743286 674385910 679163895
3731.2F79163895j553955p179871O739807M7455j0221100J631165M206695Q16117K209167
$$ 679163895 677609940 670430069 677169876 677217331 666996231 668627396 672834091 673650208 675859375
3739.8F75859375K840576l108063K265625J0231324r111634j5659561R243698M961472
$$ 675859375 678699951 675591888 677857513 688088837 678977203 663317642 672561340 677522812
3747.5F77522812M529495k967300p371292J0776596l951340p445374M382096L665771
$$ 677522812 682052307 679085007 671713715 682490311 678538971 671093597 675475693 679141464
3755.3F79141464K242279m613037K285843N613022o298370k483674L032837R25446
$$ 679141464 681383743 676770706 679056549 684669571 678371201 675887527 678920364 679845810
3763F79845810J054306L686829k638169m579696K631683M629822Q0261q668747J788101
$$ 679845810 680900116 684586945 681948776 677369080 680000763 684630585 684710846 676042099 677830200
3771.7F77830200L280487N4169M20227r6359Q83941K40937J869125J50681o384736
$$ 677830200 681110687 681164856 681585083 681488724 682372665 682613602 684482727 684633408 678248672
3780.3F78248672J725464J939926J89515J125412k412339q31604J354218P72400L60412
$$ 678248672 679974136 681914062 682103577 683228989 680816650 679985046 681339264 682111664 682472076
3789F82472076P7439l5553l63999O99921n24673O00509K935715l605042l927764J855316
$$ 682472076 682549515 682513962 682149963 682849884 682325211 682925720 685861435 682256393 678328629 680183945
3798.7F80183945M040298N525971o078949j1060257L439560L800125M306488N000076
$$ 680183945 684224243 689750214 683671265 672611008 676050568 679850693 684157181 689157257
3806.4F89157257q354492l990173L823165P80411O82373J208649m63181M15879N440979
$$ 689157257 680802765 676812592 680635757 681416168 682098541 683307190 682844009 683259888 688700867
3815.1F88700867j328354j4746781M357148N462036M049148R39484j4926376K088546
$$ 688700867 687372513 672625732 676982880 682444916 686494064 687433548 672507172 674595718
3822.8F74595718N194931K359620K337646j42975m006500L49731J448059J953583O12335
$$ 674595718 679790649 682150269 684487915 684344940 680338440 680688171 682136230 684089813 684702148
3831.4F84702148p333297K968902O045685n559235m77218P588119q115921o516723
$$ 684702148 677368851 680337753 686383438 680824203 680346985 687935104 679819183 673302460
3839.2F73302460P216034l045273N00641O060791k036133l337860J840744J438522
$$ 673302460 680518494 677473221 677973862 684034653 681998520 678660660 680501404 681939926
3846.9F81939926L73917J940994j394958M69131N260696o352768K7009r672013M70581
$$ 681939926 682313843 684254837 682859879 683329010 688589706 682236938 682263947 672591934 673062515
3855.6F73062515Q017502j074219j195297K041702K354279K075882n660095m61121
$$ 673062515 681080017 680005798 678810501 680852203 683206482 685282364 679622269 679161148
3863.3F79161148O447754m509277n302811K704849L452072N454712o533127p676391
$$ 679161148 685608902 681099625 675796814 678501663 681953735 687408447 680875320 673198929
3871F73198929M452514N611420K726822r758987N85556L730087M11606K810364M226303
$$ 673198929 677651443 683262863 685989685 676230698 676816254 680546341 680957947 683768311 687994614
3879.7F87994614n345459p751465M950561J511536J440430L706970j0904007J240311
$$ 687994614 682649155 674897690 679848251 681359787 682800217 686507187 675603180 676843491
3887.4F76843491L082046J143799L980484j404343p840194O10885L097840j146698
$$ 676843491 679925537 681069336 685049820 683645477 675805283 676416168 679514008 678367310
3895.1F78367310J196746J733933K115784J012420q959198L896790J546097m020310
$$ 678367310 679564056 681297989 683413773 684426193 675466995 679363785 680909882 676889572
3902.8F76889572M182282l786774j668778J983490J891938J846847n22384m26712m08631
$$ 676889572 681071854 677285080 675616302 677599792 679491730 681338577 680816193 680389481 679980850
3911.5F79980850N10559M39301Q3847J055450J238175k651444l587112K950134N46036
$$ 679980850 680491409 680930710 681014557 682070007 683308182 680656738 677069626 680019760 680565796
3920.2F80565796k999725J578674J481094Q86078j837463k908478J153412J609268
$$ 680565796 677566071 679144745 680625839 681511917 679674454 676765976 677919388 679528656
3927.9F79528656J664505j87759r70536R35135k262954j756897O78863J47400J308212
$$ 679528656 681193161 681005402 680034866 680970001 678707047 676950150 677629013 677776413 679084625
3936.6F79084625J022644k05917j19934n54276N56565j75019l416748L26386J891632
$$ 679084625 680107269 679901352 679781418 679227142 679783707 679608688 676191940 676518326 678409958
3945.2F78409958J267166M35791k552109O62918M89273k055816J553116P71713q35877
$$ 678409958 679677124 680112915 677560806 678223724 678712997 676657181 678210297 678982010 678146133
3953.9F78146133k08664N09034P27157p27768m30069J48011Q72650L15552j150742
$$ 678146133 677937469 678446503 679173660 678445892 678015823 678163834 679036484 679352036 678201294
3962.6F78201294j64871m30451l77044P43789N34745M81414J6556m86069L25928j48315
$$ 678201294 678036423 677605972 677228928 677972717 678507462 678988876 679005432 678519363 678845291 678696976
3972.2F78696976o71082M7455j5793j43890o18439o29044J96305N31997K80381K35138
$$ 678696976 678025894 678073349 678057556 677913666 677295227 676666183 676862488 677394485 677674866 677910004
3981.9F77910004p2861r57794o09055j54495P77130P79495n6533J039810L9901j050186
$$ 677910004 677837143 676879349 676270294 676115799 676892929 677672424 677615891 678655701 678695602 677645416
3991.5F77645416l52325O6528N32150k87857m31518k3575J48926J59988l96271
$$ 677645416 677293091 677359619 677891769 677603912 677172394 677148819 677297745 677457733 677061462
4000.2F77061462
$$ 677061462
##END=$$ End of the data block
