##TITLE=$$ Begin of the data block
##JCAMP-DX=5.00 $$ ACD/SpecManager v 10.08
##SPECTROMETER/DATA SYSTEM=Varian
##DATE=08 Jan 2013 14:52:08
##DATA TYPE=INFRARED SPECTRUM
##DATA CLASS=XYDATA
##ORIGIN=
##OWNER=
##NPOINTS=3735
##FIRSTX=399.26403809
##LASTX=4000.35498047
##MAXX=4000.35498047
##MINX=399.26403809
##MAXY=78.40197754
##MINY=47.45821381
##XFACTOR=1.0000000000
##YFACTOR=0.000000100000000
##FIRSTY=69.20111084
##DELTAX=0.96440572
##XUNITS=1/CM
##YUNITS=TRANSMITTANCE
##XYDATA=(X++(Y..Y))
399.3F92011108j3371963l393021P59049M565048R398193m714203j1028060r173432
$$ 692011108 678639145 675246124 676005173 680570221 689968414 685254211 674226151 665052719
407F65052719n659790Q033981J0123978Q78449n912400K827072P982483r350891j0303039
$$ 665052719 659392929 667426910 677550888 678429337 672516937 675344009 683326492 673975601 663672562
415.7F63672562n36957k713013j055298J0507279L172912L729401M197464o754303
$$ 663672562 663135605 660422592 659367294 669874573 673047485 676776886 680974350 674220047
423.4F74220047p648621o760025n391845K017288J781616N421982J6004105J2243652
$$ 674220047 666571426 659811401 654419556 656436844 658218460 663640442 679644547 691888199
431.1F91888199n365143j2974091j0873947l287277m76074k506561J712341O357040
$$ 691888199 686523056 673548965 662675018 659387741 658911667 656405106 658117447 664474487
438.8F64474487R188004O927490r56192p333908m783325n807266n691605J14441M624023
$$ 664474487 673662491 680589981 679633789 672299881 667516556 661709290 656017685 656132126 660756149
447.5F60756149Q931351J4363861Q082123n639877j1772156q572998n651703k739868
$$ 660756149 669687500 684051361 692133484 686493607 674721451 666148453 660496750 657756882
455.2F57756882j044617n32608O421890J0800781J0043793K249527r097519j2955703
$$ 657756882 656712265 656179657 662601547 673402328 683446121 685695648 676598129 663642426
462.9F63642426j0136414m759674J409302O478195L546142N636139R484406P66830
$$ 663642426 653506012 648746338 650155640 656633835 660179977 665816116 675300522 676067352
470.6F76067352K41547k30789j2769165q682862j115493j46561P14416Q229371Q278121
$$ 676067352 676308899 676078110 663308945 654626083 653510590 653364029 654078445 662307816 670585937
479.3F70585937K843705k223587n378723m924012q167114o922760K674103Q716430
$$ 670585937 673429642 671206055 665827332 660903320 652736206 645813446 648487549 657203979
487F57203979P051697O757431K819596m826813n155335n051345o247483k841034K963028
$$ 657203979 664255676 671013107 673832703 669005890 663850555 658799210 652551727 649710693 652673721
495.7F52673721P415696O778488O264572K292404k749405m146347j1101913p306824
$$ 652673721 660089417 666867905 673132477 675424881 672675476 668529129 657427216 650120392
503.4F50120392j372757q78067K310715Q921890J0497055K831497k601318m651718
$$ 650120392 648747635 647869568 650180283 659102173 669599228 672430725 669829407 665177689
511.1F65177689q431549o747284l522187J68305K533569M249420O785813L852310K016907
$$ 665177689 656746140 649998856 646476669 646644974 649178543 653427963 660213776 664066086 666082993
519.8F66082993J17874o255112j0026245n590286j415329R88083P259674P440185M114456
$$ 666082993 666200867 659945755 649919510 644329224 642913895 643901978 651161652 658601837 662716293
528.5F62716293J946488l005524o908188o817779n058518j527252K706909P266617
$$ 662716293 664662781 661657257 654749069 647931290 642872772 641345520 644052429 651319046
536.2F51319046Q021927L935776k70539k873153m835205n675126m156570j500778K99835
$$ 651319046 659340973 663276749 663006210 660133057 655297852 649622726 645466156 643965378 644265213
544.9F44265213K075272M245376P055893M884415j988754n609513o124649o503219
$$ 644265213 646340485 650585861 657641754 662526169 660537415 654927902 648803253 642300034
552.6F42300034l177414K180862L921661M840928N017852K841721j065979m446411
$$ 642300034 639122620 641303482 645225143 650066071 655083923 657925644 656859665 652413254
560.3F52413254n202637m504776j924515J309281L331222L891602M321899J613770
$$ 652413254 647210617 642705841 640781326 642090607 645421829 649313431 653635330 655249100
568F55249100p94602N51300k820663n897904m104080k886581N16510N092773Q580094
$$ 655249100 654454498 655005798 652185135 646287231 642183151 639296570 639813080 644905853 653485947
576.7F53485947M720688K25753p27081m674454p862396m048004j44348J204452N070648
$$ 653485947 658206635 658432388 657705307 653030853 645168457 641120453 640976105 642180557 647251205
585.4F47251205O322251L782883K028427k196427n084457n023651k912216q79212q57620
$$ 647251205 653573456 657356339 659384766 657188339 652103882 647080231 644168015 643288803 642431183
594.1F42431183L471680O301422M947052J181488j862335l022461o047364n177154
$$ 642431183 645902863 652204285 657151337 658332825 656470490 653448029 647400665 642223511
601.8F42223511k041016J433945M629822M813079L436203J590882o92826l466644m807434
$$ 642223511 640182495 641616440 646246262 651059341 654495544 656086426 655393600 651926956 647119522
610.5F47119522m360657l067665n92117K790413M334717L037414J422501k55127j208573
$$ 647119522 642758865 639691200 639099083 641889496 646224213 649261627 650684128 650429001 649220428
619.2F49220428k644958m093399l146362q61817L223038M995651M985962M228821J255569
$$ 649220428 646575470 642482071 639335709 638473892 641696930 646692581 651678543 655907364 657162933
627.8F57162933j412048l640060n176926m525757o82373L820648N616303N253143L302002
$$ 657162933 655750885 652110825 646933899 642408142 641725769 645546417 651162720 656415863 659717865
636.5F59717865J270142j441269l282090l981857l637543j552581M24575K532578M377594
$$ 659717865 660988007 659546738 656264648 652282791 648645248 647092667 647517242 650049820 654427414
645.2F54427414N572128L539047k73284l393708o236267m398956k108765L7079K127380
$$ 654427414 659999542 663538589 663265305 659871597 653635330 649236374 647127609 647164688 649292068
653.9F49292068L775177O298066N084839K044143k211227o057053n367660l835831
$$ 649292068 653067245 659365311 664450150 666494293 664283066 658226013 652858353 649022522
661.6F49022522j065292K180252M873428P033386M590073n167084l3982353R382248
$$ 649022522 647957230 650137482 655010910 662044296 666634369 661467285 627484932 636867180
669.3F36867180J0870933K127457j450882L8986L587036O081391N761947L282547K67792
$$ 636867180 647738113 649865570 648414688 648453674 652040710 658122101 663884048 667166595 667434387
678F67434387k165298n209351o629791k704697J358872L452606N361557O336670N815811
$$ 667434387 665269089 660059738 653429947 650725250 652084122 655536728 660898285 667234955 673050766
686.7F73050766K097015k365722m884949m688492l062744j038361K221528M426269
$$ 673050766 675147781 672782059 667897110 663208618 660145874 659107513 661329041 665755310
694.4F65755310N406494M911881K800064q5983m011155n062408l921585k345963J46561
$$ 665755310 671161804 676073685 678873749 678787766 674776611 669714203 665792618 663446655 663593216
703.1F63593216L727570P234115P011337L548813j48926k911300m939881n533447l518905
$$ 663593216 667320786 674554901 681566238 685115051 684966125 682054825 677114944 671581497 668062592
711.7F68062592K79922K905121M652634O072158M383088J453475k396240o092453n290069
$$ 668062592 668342514 671247635 675900269 681972427 686355515 687808990 685412750 679320297 674030228
720.4F74030228k554169l43170K511139M598922N024186M987335M124374P88269m180908
$$ 674030228 671476059 671132889 673644028 678242950 683267136 688254471 692378845 693167114 688986206
729.1F88986206n767441l260650k092743J56326L416824M896851N220718L663636J240310
$$ 688986206 683218765 679958115 677865372 678021698 681438522 686335373 691556091 695219727 696460037
737.8F96460037j620483l851929n698013m067536k27890J925736M902878N108337L699188
$$ 696460037 694839554 690987625 685289612 681222076 680994186 682919922 687822800 692931137 696630325
746.5F96630325K230835l1204k327881n694580l702469O29502K215271K678680K652740
$$ 696630325 698861160 698829956 696502075 690807495 687105026 687734528 689949799 692628479 695281219
755.1F95281219L308411L421860J378097k199859l456726l164368j668854L9749J634064
$$ 695281219 698589630 702011490 703389587 701189728 697733002 694568634 692899780 692939529 694573593
763.8F94573593M347382L961334L187332J702118j816330l332367l310318k643585
$$ 694573593 698920975 702882309 706069641 707771759 705955429 702623062 699312744 696669159
771.5F96669159j163559J931839L274078L279038K910766R15986n25132k279586l190079
$$ 696669159 695505600 697437439 700711517 703990555 706901321 707817307 707292175 705012589 701822510
780.2G01822510l404465j944809P13883K443389M404374L960571J934738L75900k372131
$$ 701822510 698418045 696473236 697187119 699630508 704034882 707995453 709930191 710306091 707933960
788.9G07933960m104919k246399j818467r11331L787689M599381K535782J299133n05676
$$ 707933960 703829041 701582642 699764175 698852844 702640533 707239914 709775696 711074829 710569153
797.6G10569153j743088k941589m134522k328110P11670K007294L247681K879181J873092
$$ 710569153 708826065 705884476 701749954 699421844 700133514 702140808 705388489 708267670 710140762
806.2G10140762O16303j985474m329986m756470k199936j598740o3553K843781L537521
$$ 710140762 710757065 708771591 704441605 699685135 697485199 695886459 695822906 698666687 702204208
814.9G02204208L015595J013946j66778l491821n247193k689667k54440J504669K475281
$$ 702204208 705219803 706233749 706066971 702575150 697327957 694638290 694383850 695888519 698363800
823.6F98363800M434967L925247K182160Q20007j602936j958160j906433q88596J175995
$$ 698363800 702798767 706724014 708906174 709726181 708123245 706165085 704258652 703370056 704546051
832.3G04546051L415070M521484M394150L139877Q37250j95847k564163l132935j626510
$$ 704546051 707961121 712482605 716876755 720016632 720853882 720658035 718093872 714960937 713334427
841G13334427L52173K288055L264389M970627L859711J698837j03073j885147l613129
$$ 713334427 713686600 715974655 719239044 724209671 728069382 729768219 729665146 727779999 724166870
849.6G24166870l345032m30755R23614L325196M462585L817368L391494J498337j222534
$$ 724166870 720821838 720391083 721314697 724639893 729102478 732919846 736311340 737809677 736587143
858.3G36587143l671799l381805k374420K05307K373123M114075M921035J745682N99518
$$ 736587143 732915344 729533539 727159119 727364426 729737549 733851624 738772659 740518341 741117859
867G41117859j049423l485566m766464n051803k555695q1406J485367K415390K510376
$$ 741117859 740068436 736582870 731816406 726764603 724208908 724127502 725612869 728028259 730538635
875.7G30538635J664047J53k713776l351211j137619n35584o75964J419525N087433
$$ 730538635 732202682 732202835 729489059 726137848 725000229 724464645 723788681 725208206 730295639
884.4G30295639M510651J858825K23847k179795l128738m080963l233032j030197J067123
$$ 730295639 734806290 736665115 736888962 734709167 731580429 727499466 724266434 723236237 724303360
893G24303360K496567K778854K882996J362686o5994l035431m537125l228607k610397
$$ 724303360 726799927 729578781 732461777 733824463 733758469 730723038 726185913 722957306 720346909
901.7G20346909m73252J837006L678360M530716L683471J389161j537400k499084k689896
$$ 720346909 719873657 721710663 725389023 729919739 733603210 734992371 733454971 730955887 728265991
910.4G28265991k196884p98645J028366K785721L629150K937012J259384j420898m060745
$$ 728265991 726069107 725270462 726298828 729084549 732713699 735650711 736910095 735489197 731428452
919.1G31428452m333268l749847j892166l85742J031036K337646K282792J290130k092743
$$ 731428452 727095184 723345337 721453171 721067429 722098465 724436111 726718903 728009033 725916290
927.8G25916290l412475l508911l861542l480835j875305J633148J686554J598587
$$ 725916290 722503815 718994904 715133362 711652527 709777222 711410370 713096924 714695511
935.5G14695511K248535L55988j293793k899780l681031l405685j804962j92032J114502
$$ 714695511 716944046 717300034 716006241 713106461 709425430 706019745 704214783 704022751 705137253
944.2G05137253K229156J747361Q03070o69556j551514k219543k585144j885834p87277
$$ 705137253 707366409 709113770 709916840 709247284 707695770 705476227 702891083 701005249 700217972
952.8G00217972O71310K046967L151855J310578j334534j954727k918549l307037l070145
$$ 700217972 700889282 702936249 706088104 707398682 706064148 704109421 701190872 697883835 694813690
961.5F94813690k267608l64762J162186J880340R33609m76379j138153k822571l671264
$$ 694813690 692546082 692181320 693343506 695223846 696157455 695681076 694542923 691720352 688049088
970.2F88049088k860566j999206q91266k20947P28759N00260j091843k120590k789307
$$ 688049088 685188522 683189316 682298050 682077103 682805862 683306122 682214279 680093689 677304382
978.9F77304382k732238l209076l244629k369309j882934j298523p53632r78088j992111
$$ 677304382 674572144 671363068 668118439 665749130 663866196 662567673 661814041 660835953 658843842
987.6F58843842l145829l563308k800675k772751l449249k968674q57658N13344n86167
$$ 658843842 655698013 652134705 649334030 646561279 643112030 640143356 639285698 639799042 639212875
996.2F39212875j497268j574631j614380k373581k780914k133827j616478j007805
$$ 639212875 637715607 636140976 634526596 632153015 629372101 627238274 625621796 624613991
1004F24613991p87621q03718j286850j598740j692619j672364k316627k946358r12208
$$ 624613991 623826370 623022652 621735802 620137062 618444443 616772079 614455452 611509094 610596886
1012.6F10596886j01433r5215N68275j20658j381302k457199k640648k842293k197990
$$ 610596886 610495453 610400238 610968513 610847855 609466553 607009354 604368706 601526413 599328423
1021.3E99328423j341897j537208j282082m82826M1199n11666j923408k980156k214813
$$ 599328423 597986526 596449318 595167236 594684410 594725609 594213943 592290535 589310379 587095566
1030E87095566j351052j105804j194458m08096R79194Q33207J302223R26933M53072
$$ 587095566 585744514 584638710 583444252 583036156 584015350 584848557 586150780 587077713 587530785
1038.7E87530785l5820k9259Q35380J70670J509056K193489J026879O21528m8523j201286
$$ 587530785 587494965 587465706 588301086 588471756 589980812 592174301 593201180 593822708 593774185 592572899
1048.3E92572899j455879j157341k166405j436043m67071K670P85179K29950n50842
$$ 592572899 591117020 589959679 587793274 586357231 585890160 585892830 586678009 586907959 586357117
1057E86357117j460495j122742j321335p41348M51393J426888L036689K564087K116738
$$ 586357117 584896622 583773880 582452545 581711197 582162590 583589478 586626167 589190254 591306992
1065.7E91306992J403617R82743J67541J9379L01132m02870P56721J2169J61324J563606
$$ 591306992 592710609 593693352 593860893 593880272 594181404 593778534 594535255 594547424 594708748 596272354
1075.3E96272354J482506P51686o02112l20167j092530j035461n798M77676J390305
$$ 596272354 597754860 598506546 597904434 597584267 596491737 595456276 595450478 595928154 597318459
1084E97318459J723251J946144J164703J282959R47190o93016j618843p67479R48791
$$ 597318459 599041710 600987854 602152557 603435516 604382706 603689690 602070847 601303368 602252159
1092.7F02252159J644631K420272J850815J637879J665458Q12950m54406j349678o55289
$$ 602252159 603896790 606317062 608167877 609805756 611471214 612284164 611829758 610480080 609824791
1101.4F09824791q53195K11487J347961J089706J811219J907081M80919r68857m23927
$$ 609824791 608971596 609183083 610531044 611620750 613431969 615339050 615819969 614851112 614427185
1110F14427185o32400q54187j45150n6686J352997K404022K126083J065445K41318
$$ 614427185 613794785 612940598 612795448 612738762 614091759 616495781 618621864 619687309 619928627
1118.7F19928627o26335j075935j263505j188507N21164R00994J081886J038895J642036
$$ 619928627 619302292 618226357 616962852 615774345 616295509 617196503 618278389 619317284 620959320
1127.4F20959320K401123N56870K63557J91040L14980J141929R94568J608887K063179
$$ 620959320 623360443 623917313 624180870 624371910 624686890 625828819 626823387 628432274 630495453
1136.1F30495453K565498K592812J253624j93558o27212o06995l06740J020470J132202
$$ 630495453 633060951 635653763 636907387 636713829 636086617 635479622 635172882 636193352 637325554
1144.8F37325554J036262J414261J058579Q14209K36053p13577j730728j243630K5177
$$ 637325554 638361816 639776077 640834656 641648865 641884918 641171341 639440613 638196983 638222160
1153.4F38222160R2697J86348P4959k0447L14064J74866n25284r14535j197510j002808
$$ 638222160 638314857 638501205 638576164 638555717 638869781 639044647 638519363 637604828 636407318 635404510
1163.1F35404510K04773Q59337J710282K293358J928863J891861J660233J430358J015702
$$ 635404510 635609283 636468620 638178902 640472260 642401123 644292984 645953217 647383575 648399277
1171.8F48399277P07855J392441J481170K180634K981262K392273J902924J450882
$$ 648399277 649107132 650499573 651980743 654161377 657142639 659534912 661437836 662888718
1179.5F62888718J409378J189804P55005R10797J345520J202850J036225J412124J026459
$$ 662888718 664298096 665487900 666242905 667153702 668499222 669702072 670738297 672150421 673176880
1188.1F73176880O62918N02396k1592l35006J63498J67083l60412j04752k24151l37906
$$ 673176880 673839798 674342194 674320602 673985596 674149094 674316177 673955765 673851013 673626862 673288956
1197.8F73288956O408O6376m33731p42493q22372o28967k90375n87158j89362j58081
$$ 673288956 673295364 673361740 672928009 672185516 671363144 670734177 670443802 669856644 669667282 669509201
1207.4F69509201j77841K11029j39999j70441l85285r8877J71891l54920q14209n67169
$$ 669509201 669331360 669542389 669402390 669231949 668846664 668747787 668919678 668564758 667750549 667183380
1217.1F67183380N42526L9597o79550r5291J11389K31628L19519K33917m82864j168442
$$ 667183380 667725906 667765503 667085953 666990662 667102051 667333679 667653198 667887115 667404251 666235809
1226.7F66235809m85305j25504n21164k01645l17993m47617K2965m3488j33438j01547
$$ 666235809 665750504 665625000 665103836 664902191 664584198 664136581 664159546 664116058 663982620 663881073
1236.4F63881073j73950m06800j67694P9346j40915j01013l05176J49231O34308J30386
$$ 663881073 663707123 663300323 663132629 663211975 663071060 662970047 662664871 662814102 663448410 663578796
1246F63578796m69436r75952p23191l49121p8277L72085K99530J09863P9575j44730
$$ 663578796 663109360 662133408 661410217 661061096 660982819 661354904 661654434 661764297 661843872 661699142
1255.7F61699142J15433R6436o04096n14373l84141J57319P20749Q02536R95407K17514
$$ 661699142 661814575 661911011 661306915 660792542 660408401 660565720 661286469 662089005 663084412 663301926
1265.3F63301926l4943K49863N3329L03574L52630r8114K15378J657410J436996O76728
$$ 663301926 663266983 663516846 663570175 663873749 664226379 664128265 664343643 666001053 667438049 668114777
1274.9F68114777P60650L56522M89426M91790L40195j5183J32294R32236P75528J035538
$$ 668114777 668875427 669231949 669721375 670213165 670553360 670538177 670670471 671602707 672378235 673413773
1284.6F73413773J259002J037522M97207L34244L37372o485N25055J40915K56500Q34427
$$ 673413773 674672775 675710297 676207504 676541748 676879120 676872635 677397690 677538605 677795105 678629532
1294.2F78629532N13306M7988J28098P06558j37176n41306o11191k43988K76032M1656
$$ 678629532 679142838 679190826 679318924 680025482 679888306 679347000 678735809 678491821 678767853 678809509
1303.9F78809509J88675m501K52685l25088p53403o73218q74633o60172j342926q02307
$$ 678809509 678998184 678993683 679246368 678921280 678167877 677494659 676620026 675959854 674616928 673814621
1313.5F73814621K96173N88532K40554K6245O7826m31748L70179N67092N09034M70047
$$ 673814621 674110794 674699326 674939880 674966125 675033951 674602203 674972382 675539474 676048508 676518555
1323.2F76518555M01764N79681o87J33973J52130J63498m54865o66275J4648l96499
$$ 676518555 676920319 677500000 677499313 677633286 677785416 677948914 677494049 676827774 676842422 676445923
1332.8F76445923l71704m59976o20270n73502l06015K28195j46942m94766R14536J548995
$$ 676445923 676074219 675614243 674993973 674420471 674114456 674342651 674195709 673700943 674615479 676164474
1342.4F76164474K82441j28022R3079J61362N80520L54157J96152Q9111N13611P0190
$$ 676164474 676446915 676318893 676411972 676573334 677153854 677508011 677704163 677793274 678306885 678377075
1352.1F78377075n22613o15616r07517p67212q18023j12839J87302M32739o29273j350479
$$ 678377075 677854462 677238846 676331329 675564117 674746094 674633255 674820557 675253296 674624023 673273544
1361.7F73273544l13492j244277N32760J57700p21436n88455j582336j50452Q76236
$$ 673273544 672960052 671715775 672248535 672406235 671684799 671096344 669514008 669363556 670239792
1370.4F70239792O84585p2250q94928j516724j005172J04370m69132m96292J90506
$$ 670239792 670924377 670852127 669957199 668440475 667435303 667539673 667070541 666574249 666764755
1379.1F66764755L97492m44565p09534j143875k053528j035156j68152n48019j166687
$$ 666764755 667162247 666717682 666008148 664864273 662810745 661775589 661607437 661059418 659892731
1387.8F59892731R15527J132278M78516O78406k76718o52848k809753k913589m49219
$$ 659892731 660808258 661940536 662419052 663097458 662820740 662167892 659358139 656444550 655995331
1396.4F55995331j311188j718826k910156J20849J020889l80401p75986j361771k910308
$$ 655995331 654684143 652965317 650055161 650176010 651196899 650816498 650040512 648678741 645768433
1405.1F45768433k477799j207657j625976j162186p86667l44238M26483o4735k85035
$$ 645768433 643290634 642082977 640457001 639294815 638508148 638163910 638590393 638525658 638240623
1413.8F38240623j340789j980210k159423j897278j568070l786773K255935K746659
$$ 638240623 636899834 634919624 632760201 630862923 629294853 625508080 627764015 630510674
1421.5F30510674J348953K35557j196022O09513N51757j084747j058998r75952l48587
$$ 630510674 631859627 632095184 630899162 631508675 632060432 630975685 629916687 628940735 628592148
1430.2F28592148J709099K528228J718331J282997J212463O0845l448868j11351K331009
$$ 628592148 630301247 632829475 634547806 635830803 637043266 637104111 633655243 633543892 635874901
1438.9F35874901J332054J179695J597061J633415J765290R19418M98047m89807j552658
$$ 635874901 637206955 638386650 639983711 641617126 643382416 644301834 644799881 644310074 642757416
1447.6F42757416j520767J206207J907425N13763O54144J071549J586761P10144r06295
$$ 642757416 641236649 642442856 644350281 644864044 645518188 646589737 648176498 648886642 647980347
1456.2F47980347l269806j701279L699799K137069K579956J858063J799622K666549
$$ 647980347 644710541 643009262 646709061 648846130 651426086 653284149 655083771 657750320
1464F57750320m81338N03235R79385L29895L69339P70493J735840L09295r7580K988892
$$ 657750320 657268982 657772217 658751602 659081497 659450836 660221329 661957169 662266464 662168884 665157776
1473.6F65157776N384827L217010l98025P40814J247635L40499L12348P75070J946793
$$ 665157776 670542603 673759613 673361588 674102402 675350037 675690536 676002884 676777954 678724747
1482.3F78724747K388839K058335J257629O84662j383896j852722m10767l451538K42768
$$ 678724747 681113586 683171921 684429550 685114212 683730316 681877594 681466827 678015289 678258057
1491F78258057L747253K681198J100083N44586J34735m387512L69491j093750k581253
$$ 678258057 682005310 684686508 685786591 686331177 686465912 682078400 682447891 681354141 678772888
1499.6F78772888J193390o5231m1657R62372J366348m577r159088o880722M433212
$$ 678772888 679966278 679901047 679859390 680821762 682188110 682183533 673024445 666143723 670576935
1508.3F70576935K846985O45752J897659P8888O5307J931077k8763q57239k669296
$$ 670576935 673423920 674069672 675967331 676046219 676111526 678042603 678013840 677156601 674487305
1517F74487305l014527K229081Q12759n109863l757096L239518L997421K732315j254502
$$ 674487305 671472778 673701859 674514618 669404755 665647659 668887177 672884598 675616913 674362411
1525.7F74362411o21261k66724j148300L47977M24576L3874K46887K79465j148987
$$ 674362411 673741150 673474426 672326126 672674103 673098679 673132553 673379440 673658905 672509918
1534.3F72509918J516113N77088k99072n56336r928741m122391M994659J470642Q18558
$$ 672509918 674026031 674603119 674304047 673747711 663818970 659696579 664691238 666161880 666980438
1543F66980438K291336J781464P71408J772003Q2703l8376j894150j429519K428436
$$ 666980438 669271774 671053238 671824646 673596649 673679352 673640976 671746826 670317307 672745743
1551.7F72745743J688080J633987k555923J2512K583008M11453p595749j0580750M909440
$$ 672745743 674433823 676067810 673511887 673524399 676107407 676518860 668923111 658342361 663251801
1560.4F63251801M376373L112488J496582P71026j443710q43277J03912j856079k497711
$$ 663251801 667628174 670740662 672237244 673008270 671564560 670721283 670825195 668969116 666471405
1569.1F66471405p312622J641235J611786m03213L39966k88239j427307r672470P40585
$$ 666471405 659158783 660800018 662411804 662008591 662348557 662060318 660633011 650960541 651701126
1577.7F51701126j68381k356491k154617k500458m91791j005554m96368j834793k361946
$$ 651701126 651532745 649176254 647021637 644521179 644029388 643023834 642527466 640692673 638330727
1586.4F38330727k751274l803483k747345l604850j422959j584930m60053r58824k253952
$$ 638330727 635579453 631775970 629028625 625423775 624000816 622415886 621955833 620997009 618743057
1595.1F18743057j325226k901954k173195l483048j938324k070884j736527o07719
$$ 618743057 617417831 614515877 612342682 608859634 606921310 604850426 603113899 602506180
1602.8F02506180j693344K02331j202011j077690l051071k161293j991577k407532
$$ 602506180 600812836 601015167 599813156 598735466 595684395 593523102 591531525 589123993
1610.5E89123993M06799j129989N27534q57010K99568m0168o979447J534615q42591
$$ 589123993 589530792 588400803 588928337 588071327 588370895 588330727 581351280 582885895 582043304
1619.2E82043304m20761j333542L85170n95245j879234K672958O94008J098785k797546
$$ 582043304 581622543 580289001 580674171 580078926 578199692 580872650 581566658 582665443 579867897
1627.9E79867897j417503M28428l73726M61045L98483K397499J275025l310280j152039
$$ 579867897 578450394 578878822 578505096 578966141 579364624 581762123 583037148 579726868 578574829
1636.6E78574829K879067R27505M20380Q69598n12733J581649J086922K722817K114334
$$ 578574829 581453896 582381401 582801781 583671379 583158646 584740295 585827217 588550034 590664368
1645.3E90664368k369118M34074n22117K567405J135102J746711J627007o472740J074333
$$ 590664368 588295250 588729324 588207207 590774612 591909714 593656425 595283432 588810692 589885025
1653.9E89885025N862198M892807K138100J571121M70657M69551O32172Q40416J088028
$$ 589885025 595747223 600640030 602778130 604349251 604819908 605289459 605921631 606762047 607850075
1662.6F07850075J613350M664497L062401K407188J790123M68750k410202L64456L737565
$$ 607850075 609463425 614127922 617190323 619597511 621387634 621856384 619446182 619810638 623548203
1671.3F23548203J497116M020233M550972J265716L98941L448830L106155J209870
$$ 623548203 625045319 629065552 633616524 634882240 635281181 638730011 641836166 643046036
1679F43046036L48129n35126K677918K808533k497101J094131O934281N706405K297363
$$ 643046036 643394165 642859039 645536957 648345490 645848389 646942520 653876801 659583206 661880569
1687.7F61880569K96631J607285Q14285K247391K954559L105087L759308K743683k908630
$$ 661880569 662177200 663784485 664598770 666846161 669800720 672905807 676665115 679408798 676500168
1696.4F76500168L531113L818511L372040J462403o860352M782257M526062L197327
$$ 676500168 680031281 683849792 687221832 688684235 681823883 686606140 691132202 694329529
1704.1F94329529K164383J992569Q88443J844482K240753l69339j037140R93653J545486
$$ 694329529 696493912 698486481 699374924 701219406 703460159 703090820 702053680 703047333 704592819
1712.8G04592819J834488O35376J129913L489457R81598m923401K675628K422257N90820
$$ 704592819 706427307 707062683 708192596 711682053 712663651 707740250 710415878 712838135 713428955
1721.4G13428955K56577N49392J814652L157806K309876P66372P8049n93948k871552
$$ 713428955 713685532 714234924 716049576 719207382 721517258 722283630 722361679 721767731 718896179
1730.1G18896179r13772K418365J352463k999573k58942N966874L888244P43103R09195
$$ 718896179 717982407 720400772 721753235 718753662 718494720 724461594 728349838 729092941 730002136
1738.8G30002136k478027k643280K947845J176377q1711K496109M004440K249069M63334
$$ 730002136 727524109 724880829 727828674 729005051 728923340 731419449 735423889 737672958 738136292
1747.5G38136292k33536j315689J983261j536255p20062M475631L701630L282242K457351
$$ 738136292 737902756 736587067 738570328 737034073 736314011 740789642 744491272 747773514 750230865
1756.2G50230865o61773M81643R31321o81458l28445k766114P97501M108276K941513
$$ 750230865 749569092 750050735 750982056 750300598 749972153 747206039 748003540 752111816 755053329
1764.8G55053329K502900K222366M84924l666992N4321J084824l097687l041610J491394
$$ 755053329 757556229 759778595 760263519 756596527 756650848 757735672 754637985 751596375 753087769
1773.5G53087769M937057L110657J202392K214280j07270r60388k100449k978973L59955
$$ 753087769 758024826 761135483 762337875 764552155 764444885 763484497 761384048 758405075 758765030
1782.2G58765030J910248J675873J060485K575760K361298L12424j233826j150360
$$ 758765030 760675278 762351151 763411636 765987396 768348694 768661118 767427292 766276932
1789.9G66276932k872162k629547j147003K108078M283065J984177J240234J745148
$$ 766276932 763404770 760775223 759628220 761736298 766019363 768003540 769243774 770988922
1797.6G70988922L54385k081298l339997j48010q11996Q45794K762757K641754K380066
$$ 770988922 771343307 769262009 765922012 765774002 764962006 765807800 768570557 771212311 773592377
1806.3G73592377O03103m85305n32303j175766l050461j038513Q46710J610260K610626
$$ 773592377 774195480 773710175 773177872 772002106 768951645 767913132 768759842 770370102 772980728
1815G72980728J866913J856003J40762q27255q70819k198563j002731j035919N38559
$$ 772980728 774847641 776703644 776844406 776017151 775146332 772947769 771945038 770909119 771447678
1823.7G71447678J324310J86310K833633K517014L42788k164535m511490l83530O87714
$$ 771447678 772771988 772958298 775791931 778308945 778651733 776487198 771975708 771592178 772279892
1832.3G72279892P0038J458435K346802K213287J163559l7537k212j947479j839219
$$ 772279892 772349930 773808365 776155167 778368454 779532013 779494476 779492264 777544785 775705566
1841G75705566j729278p06482J29700j279755M213181L649063P60879j78833o19049
$$ 775705566 773976288 773269806 773399506 772119751 776332932 779981995 780742874 780564041 779944992
1849.7G79944992j484222k285004j153030m4327J443710K074509J966171J459732M8676
$$ 779944992 778460770 776175766 775022736 774978409 776422119 778496628 780462799 781922531 781971207
1858.4G81971207o77872j690064j821060j658249k97927P36312J075745K014923J168137
$$ 781971207 781293335 779603271 777782211 776123962 775826035 776562347 777638092 779653015 780821152
1867.1G80821152J170196o08520k350922n78003p80563j021271j87225J456985J458054
$$ 780821152 781991348 781382828 779031906 778453903 777673340 776652069 776464844 777921829 779379883
1875.7G79379883J863022J776199M18701o99768k007522j783524j858597q53576L82537
$$ 779379883 781242905 783019104 783437805 782738037 780730515 778946991 777088394 776234818 776617355
1884.4G76617355J599121K500382J640625J478424p00760l301315r04999l77502j075135
$$ 776617355 778216476 780716858 782357483 783835907 783135147 779833832 778928833 778551331 777476196
1893.1G77476196m68673N83419J994477K875518J380997J77841q84857j943435j617966
$$ 777476196 777007523 777590942 779585419 782460937 783841934 784019775 783134918 781191483 779573517
1901.8G79573517j468659l93982L92685J432190J972123J152801M33884k65580j158828
$$ 779573517 778104858 777710876 778103561 779535751 781507874 782660675 783094559 782828979 781670151
1910.4G81670151j564102j278229j406937K84119J245880J704025K329025p15408m43344
$$ 781670151 780106049 778827820 777420883 777705002 778950882 780654907 782983932 782268524 781825180
1919.1G81825180N12619j269760j751175k188339k68479J620636J911087J672898J591644
$$ 781825180 782337799 781068039 779316864 777128525 776860046 778480682 780391769 782064667 783656311
1927.8G83656311L36838q59375j210098k019654j576843j016617K47498J508941J756363
$$ 783656311 783993149 783133774 781923676 779904022 778327179 777310562 777558060 779067001 780823364
1936.5G80823364J520462P38068J63727j214829j402130k384491k645569R18198J525879
$$ 780823364 782343826 783081894 783245621 782030792 780628662 778244171 775598602 776516800 778042679
1945.2G78042679J523208J858902J461335R2926j199036j593094j306763j012573q74405
$$ 778042679 779565887 781424789 782886124 782979050 781780014 780186920 778880157 777867584 776993179
1953.8G76993179K57111J538925K186813J412812L68576j89972j329651j971970j898498
$$ 776993179 777250290 778789215 780976028 782388840 782757416 782567444 781237793 779265823 777367325
1962.5G77367325r43985p3090R09653J510620R02786J270142Q61587o80923j761780
$$ 777367325 776423340 776350250 777259903 778770523 779673309 780943451 781805038 781124115 779362335
1971.2G79362335j760559j502838m84848J278839J429596J354752J512756P85980m89044
$$ 779362335 777601776 776098938 775614090 776892929 778322525 779677277 781190033 781976013 781486969
1979.9G81486969j353760j790390j947021j077423M8980J150742J714020J763305J127243
$$ 781486969 780133209 778342819 776395798 775318375 775367355 776518097 778232117 779995422 781122665
1988.6G81122665k05230p58591j760941k656097j388855J59836R57184J379928J764679
$$ 781122665 780917435 780158844 778397903 775741806 774352951 774512787 775469971 776849899 778614578
1997.2G78614578J328278N17273n35050j510925k109909j816483r47952M81949J852570
$$ 778614578 779942856 780460129 779925079 778414154 776304245 774487762 773539810 774021759 775874329
2005.9G75874329J591796J404801Q90808k28729r75495j707000k086106j767883L8681
$$ 775874329 777466125 778870926 779761734 779533005 778557510 776850510 774764404 772996521 773035202
2014.6G73035202J448364J446610J290893J129532O93817l44314j326828k225647k042999
$$ 773035202 774483566 775930176 777221069 778350601 779044418 778700104 777373276 775147629 773104630
2023.3G73104630j121750K98996J668853J787262J623764Q89588m6540j008758k123413
$$ 773104630 771982880 772281876 773950729 775737991 777361755 778251343 778204803 777196045 775072632
2032G75072632k348480j504441j06048J079788J837768J763459J244430N39170n05906
$$ 775072632 772724152 771219711 771113663 772193451 774031219 775794678 777039108 777578278 777072372
2040.6G77072372j795120k338714j516266q20465K28958J416778J784516J417770P68738
$$ 777072372 775277252 772938538 771422272 770601807 770830765 772247543 774032059 775449829 776218567
2049.3G76218567j6708j395722j904678j819077j451797p8888J045227J657867K116852
$$ 776218567 776201859 774806137 772901459 771082382 769630585 769551697 770596924 772254791 774371643
2058G74371643J737442L19824j104278j774292j771546j694717j050720L27911J414795
$$ 774371643 776109085 776428909 775324631 773550339 771778793 770084076 769033356 769361267 770776062
2066.7G70776062K218857J611633N10941l92762j259079j582565j772461j086731k47116
$$ 770776062 772994919 774606552 775117493 774724731 773465652 771883087 770110626 769023895 768776779
2075.4G68776779P96204J477661J490784J438293M21219o28662j589279j754227j370392
$$ 768776779 769572983 771050644 772541428 773979721 774400940 773772278 772182999 770428772 769058380
2084G69058380p69501M76761J389618J832047J049957L04337j56022j035308j663437
$$ 769058380 768288879 768765640 770155258 771987305 773037262 773341599 773185577 772150269 770486832
2092.7G70486832j699219r94721k89611J079101J820221J328812R68551L16620p92617
$$ 770486832 768787613 767792892 767503281 768582382 770402603 771731415 772699966 773016586 772223969
2101.4G72223969j810380j806335j276932m59289L26462J367492J928787J179200Q30993
$$ 772223969 770413589 768607254 767330322 766871033 767197495 768564987 770493774 771672974 772503967
2110.1G72503967j71203j369934j707001j967545j424026J47857J305237J763840K013397
$$ 772503967 772332764 770962830 769255829 767288284 765864258 766012115 767317352 769081192 771094589
2118.7G71094589P60193l20206q71658j730499j743088j343918J2665P79190J209183
$$ 771094589 771854782 771534576 770662918 768932419 767189331 765845413 765858078 766637268 767846451
2127.4G67846451J698990J052551M26712m77829j151047j505508j455536r50394J16577
$$ 767846451 769545441 770597992 771024704 770546875 769395828 767890320 766434784 765484390 765600967
2136.1G65600967J359406J189346J129380J050338m1809j267929j566620j203995r41314
$$ 765600967 766960373 768149719 769279099 770329437 770287628 769019699 767453079 766249084 765307770
2144.8G65307770J12915J104355J138534J081619J175690K46506j008072j507339j575394
$$ 765307770 765420685 766525040 767663574 768745193 769920883 770167389 769159317 767651978 766076584
2153.5G66076584q60825l31039L89099J300659J534043J262664Q82645Q2550j383133
$$ 766076584 765215759 764884720 765273819 766574478 768108521 769371185 770253830 770336380 768953247
2162.1G68953247j657486j597214j008224K71759Q94699J501007J318894J059722M80576
$$ 768953247 767295761 765698547 764690323 764962082 765856781 767357788 768676682 769736404 770216980
2170.8G70216980r52911j709290j560669j099167m09469O47964J297379J822128J416702
$$ 770216980 769264069 767554779 765994110 764894943 764485474 765133438 766430817 768252945 769669647
2179.5G69669647M54560l61100j483459j698227j254273n68161K1820J417237J881637
$$ 769669647 770124207 769763107 768279648 766581421 765327148 764758987 764780807 766198044 768079681
2188.2G68079681Q52738P05261k6321p99103j656952j921768r42612J0452R36814J218643
$$ 768079681 768932419 769637680 769611359 768812256 767155304 765233536 764290924 764301376 765238190 766456833
2197.8G66456833J649475J394196N67321n10101j402512j541290j762619o22253K12402
$$ 766456833 768106308 769500504 770067825 769557724 768155212 766613922 764851303 764229050 764441452
2206.5G64441452J083908K099991J703720R53980j84327j029892k031326j940765q37326
$$ 764441452 765525360 767625351 769329071 770283051 770098724 769068832 767037506 765096741 764259415
2215.2G64259415q9722P70111J505203J983795J242981N04151o25305j947861j836395
$$ 764259415 764169693 764939804 766445007 768428802 769671783 770175934 769550629 767602768 765766373
2223.9G65766373j724778p60650Q83331J521988J650085J760254R42765m06952j417084
$$ 765766373 764041595 763280945 764164276 765686264 767336349 769096603 770039368 769632416 768215332
2232.5G68215332j685181j479416j542205k36740J077652J494216J494828J000976
$$ 768215332 766530151 765050735 763508530 763271790 764349442 765843658 767338486 768339462
2240.3G68339462P85065k05383j578675k342987j856079p19528O53152J273118J293029
$$ 768339462 769124527 768919144 767340469 764997482 763141403 762421875 763075027 764348145 765641174
2248.9G65641174K010346R71756l65601j289215j832580j568680j401367j19324P05642
$$ 765641174 767651520 768623276 768257675 766968460 765135880 763567200 762165833 762046509 762752151
2257.6G62752151J435013J521302J341095P39517j155930j610794j974716j632156
$$ 762752151 764187164 765708466 767049561 767789078 766633148 765022354 763047638 761415482
2265.3G61415482p65458L75138J505661J598053J774139R94797m6387j319275j723404
$$ 761415482 760650024 761025162 762530823 764128876 765903015 766897812 766851425 765532150 763808746
2274G63808746j667785j458512l79562N72281K044830J865540J610794O95495p09304
$$ 763808746 762140961 760682449 760302887 760875168 762919998 764785538 766396332 767091827 766382523
2282.7G66382523j285401k208481j434326j383285k20948Q53653J167755J265870k54746
$$ 766382523 765097122 762888641 761454315 760071030 759850082 760703735 761871490 763137360 762882614
2291.4G62882614j36108j559830k255402k096786j678162l54461k18430J425705M07486
$$ 762882614 762746506 761186676 758931274 756834488 755156326 754801865 754583435 756009140 756416626
2300G56416626M94003M96979j247025j294326k917252k922134k267609l82004l30352
$$ 756416626 756910629 757407608 756160583 754866257 751949005 749026871 746759262 746377258 746046906
2308.7G46046906m44718O23322q96225m34571k425079j977081j334839k203674m82026
$$ 746046906 745602188 746225510 745329285 744894714 742469635 740492554 739157715 736954041 736472015
2317.4G36472015j605072q40759j679993j487045j373749k864532j707993j402893
$$ 736472015 734866943 734026184 732346191 730859146 729485397 726620865 724912872 723509979
2325.1G23509979j351852l602524j021728k00120K98005J300964j393356k17820j447677
$$ 723509979 722158127 718555603 717533875 717333755 717631760 718932724 717539368 717321548 715873871
2333.8G15873871L53393k279129l304443J095352j00174P33109o99692M61655K42004
$$ 715873871 716227264 713948135 710643692 711739044 711638870 712371979 711672287 712133942 712375946
2342.5G12375946J02310n81131k30713M358902M469376P372360L110581l405610m209823
$$ 712375946 712478256 711897125 711666412 716025314 720494690 727867050 730977631 727572021 723362198
2351.2G23362198o317368n552673l454971m793396n197525m674607k188034q4686O36520
$$ 723362198 717044830 711492157 708037186 703243790 698046265 693371658 691183624 691098938 691735458
2359.8F91735458K27814J026611K51847K157974J791916J25656K259140K922745L718261
$$ 691735458 691963272 692989883 693241730 695399704 697191620 697317276 699576416 702499161 706217422
2368.5G06217422M498063N333480M637299L663788K423477K089844K014465J886597
$$ 706217422 710715485 716048965 720686264 724350052 726773529 728863373 730877838 732764435
2376.2G32764435K798691K864761M261398M200592L237152K819901J968689J360855
$$ 732764435 735563126 738427887 742689285 746889877 750127029 752946930 754915619 756276474
2383.9G56276474k70157l13263J94245L42025J123352J262055J347351R89532J20697
$$ 756276474 756006317 755693054 755887299 756229324 757352676 758614731 759962082 760951614 761072311
2392.6G61072311j364364j453934q82797r20334k9373J43509N04532J496505J522446
$$ 761072311 759707947 758254013 757371216 756450882 756421509 756565018 757069550 758566055 760088501
2401.3G60088501L15933l97262q95996j914444j437226q57315p6R14001J282654J426697
$$ 760088501 760404434 760007172 759111176 757196732 755759506 754902191 754902115 755816116 757098770 758525467
2410.9G58525467M61197L6011m96140j394882j617356j173706l88336O39191J482391
$$ 758525467 758986664 759022675 758526535 757131653 755514297 754340591 753952255 754591446 756073837
2419.6G56073837J030884P53555K59934o08444r66416j400757j541748p49664O04630
$$ 756073837 757104721 757858276 758118210 757509766 756543350 755142593 753600845 752851181 753455811
2428.3G53455811R00726J277313J379700P6904n34515o80237j332779j606522r31396
$$ 753455811 754356537 755633850 757013550 757090454 756555939 755875702 754542923 752936401 752005005
2437G52005005k69699O75049J251220R00803Q11157L01895m37622j288528j511307
$$ 752005005 751735306 752410355 753661575 754562378 755373535 755675430 755237808 753949280 752437973
2445.7G52437973j141968o92672M58908J000290J156692J038742M36478j23825o52695
$$ 752437973 751296005 750603333 751062241 752062531 753219223 754257965 754694443 754570618 753917923
2454.3G53917923j372681k012024j035385O9351M30146J277084J423492O17066M2572
$$ 753917923 752545242 750533218 749497833 749567184 749997330 751274414 752697906 753314972 753357544
2463G53357544n17120j274338j479187j347885r69315J5411J096955J761856J574249
$$ 753357544 752840424 751566086 750086899 748739014 747769699 747785110 748882065 750643921 752218170
2471.7G52218170K57797p14645r59167j451111j272354j231080n92422Q83560J217270
$$ 752218170 752475967 751761322 750802155 749351044 748078690 746847610 746255188 747138748 748356018
2480.4G48356018J580505J017380m7149o18134j575165j940384j605148m92325M30222
$$ 748356018 749936523 750953903 750906754 750288620 748713455 746773071 745167923 744675598 745105820
2489.1G45105820J118622J399154Q23059O08521j24359j072922j492691j507645r94415
$$ 745105820 746224442 747623596 748446655 749055176 748930817 747857895 746365204 744857559 743863144
2497.7G43863144k11105N94635R41619J017838P80487R6054n29938j020355j825867
$$ 743863144 743652039 744246674 745188293 746206131 746986618 747082672 746552734 745532379 743706512
2506.4G43706512j620559m22135J44349P48519J042710Q12454L98712j9302n14450
$$ 743706512 742085953 741663818 741808167 742556686 743599396 744411850 744810562 744791260 744276810
2515.1G44276810j263428j272888j168442n37338P17239J119614R40475O99539K41623
$$ 744276810 743013382 741740494 740572052 740034714 740751953 741871567 742812042 743511581 743753204
2523.8G43753204m95147j083374j567078j244812o36215j23520R91669J376342J075974
$$ 743753204 743258057 742174683 740607605 739362793 738726578 738603058 739594727 740971069 742047043
2532.5G42047043M66614l68576r24225j057663j227570j340713m49601L79944J143341
$$ 742047043 742513657 742145081 741220856 740163193 738935623 737594910 737145309 737525253 738668594
2541.1G38668594J585083P80564j20392m86679j066284j709366j174774m60358K26822
$$ 738668594 740253677 741034241 740913849 740427170 739360886 737651520 736476746 736016388 736243210
2549.8G36243210N52978N94788J216888O82984j87073p16248j128082j423950j119843
$$ 736243210 736796188 737390976 738607864 739290848 739103775 738387527 737259445 735835495 734715652
2558.5G34715652M9439J95389P59277J234131M29535L4256m69437j175384j323395
$$ 734715652 734765091 734960480 735719757 736953888 737383423 737417679 736948242 735772858 734449463
2567.2G34449463p33795l05558m1351M24194J016999J344147M08554q13828j500320
$$ 734449463 733715668 733410110 733368759 733792953 734809952 736154099 736562653 735748825 734248505
2575.9G34248505j232453p58285n46494K32697O00586O29120O03408J91498q3542l91617
$$ 734248505 733016052 732257767 731711273 731943970 732544556 733173676 733777084 733968582 733885040 733493423
2585.5G33493423q06427q12149j076202j075973O8283O92749Q30841Q85009L56598
$$ 733493423 732686996 731874847 730798645 729722672 729790955 730483704 731314545 732199554 732556152
2594.2G32556152m51660q93860r32388j071777n87082j83029M11453J133652O46820
$$ 732556152 732104492 731210632 730278244 729206467 728619385 728436356 728847809 729981461 730628281
2602.9G30628281J29394l41492o77032j182632j430893o72226k63443K97699R45663
$$ 730628281 730757675 730416183 729739151 728556519 727125626 726453400 726189957 726487656 727433319
2611.5G27433319Q53119K91824j92337m62951q20847j020889r31320m92173m5471M59442
$$ 727433319 728286438 728578262 728385925 727922974 727102127 726081238 725149918 724657745 724612274 725071716
2621.2G25071716R53522P67899K36816k9831o76269j522141j311417p06558k66647
$$ 725071716 726025238 726793137 727029953 727000122 726323853 724801712 723490295 722783737 722517090
2629.9G22517090j31378N70755J335296N43900j37863q49305j140975n92576p96737
$$ 722517090 722385712 722956467 724291763 724835663 724697800 723848495 722707520 722114944 721318207
2638.5G21318207o97403l6392O08749Q44727N55267J82953j10321p33948j624146j371536
$$ 721318207 720620804 720584412 721193161 722037888 722593155 722776108 722665787 721931839 720307693 718936157
2648.2G18936157n34515R1247N70908P25555P13044L98178n21698j214829p76901p12280
$$ 718936157 718401642 718492889 719063797 719789352 720502396 720900574 720378876 719164047 718387146 717674866
2657.8G17674866q52204o37130k76261P27844J074448P27463K38495j62888r14001
$$ 717674866 716822662 716185532 715909271 716637115 717711563 718439026 718677521 718514633 717600632
2666.5G17600632j936341j410980l86505K11258P69501R62982P69882L30124j2054
$$ 717600632 715664291 714253311 713866806 714078064 714847565 715810547 716580429 716910553 716898499
2675.2G16898499m67606j186676j362839p40661l99933K3422P48291O98471M87595
$$ 716898499 716430893 715244217 713881378 713140717 712740784 712764206 713512497 714210968 714698563
2683.9G14698563M53796l82843j638870j544419o74438k67639P8048M89045Q16269
$$ 714698563 715152359 714769516 713130646 711586227 710911789 710644150 710722198 711211243 712027512
2692.5G12027512P51953M40368k75344j134568j323623j016236o16379j36642M97131
$$ 712027512 712779465 713219833 712944489 711809921 710486298 709470062 708853683 708717041 709214172
2701.2G09214172N89295N26581P10678M54254m38080j159515r15985r97162j047592
$$ 709214172 709803467 710330048 711040726 711494980 711056900 709897385 708981400 707984238 706936646
2709.9G06936646j7930Q92792P59506L01590M40140Q1711r95407j460724j038590o78939
$$ 706936646 706918716 707811508 708571014 708872604 709312744 709394455 708399048 706938324 705899734 705220795
2719.5G05220795n3864N47714K38648O47430P86438Q9798n07965j120834r15680o05087
$$ 705220795 705166931 705714645 705953293 706600723 707387161 707476959 706968994 705848160 704932480 704327393
2729.2G04327393j79520K59170K86789L83454N41687O39114n3406o91299q75855q70285
$$ 704327393 704147873 704407043 704693832 705077286 705618973 706258087 706204681 705513382 704637527 703767242
2738.8G03767242m99267m22592j78833N85708Q80204M19769Q7890o5078n89142j212158
$$ 703767242 703267975 702845383 702666550 703252258 704132462 704552231 704640121 704575043 703985901 702773743
2748.5G02773743r31778l22953j48849L48892N28946N07584M22897q0261m93469p37839
$$ 702773743 701841965 701519012 701370163 701719055 702248001 702755585 703178482 703098221 702604752 701866913
2758.1G01866913q94852q78677q6441P2021J02997Q95920M65240m44488p67746o54526
$$ 701866913 700972061 700093384 700006943 700078964 700181961 701077881 701543121 701098633 700330887 699676361
2767.8F99676361p40814n80979j32980Q1253N37110N56259O84814M39453k94494q96988
$$ 699676361 698935547 698354568 698221588 698302841 698839951 699396210 700081024 700520477 700225983 699328995
2777.4F99328995j254196r50699o17523K53982L40653n341M06036N00031J26114o72074
$$ 699328995 698074799 697124100 696506577 696760559 697101212 697095871 697501907 698001938 698128052 697455978
2787F97455978q34198r62524o32553k76413l03040M14963M06494N71213N1422o83822
$$ 697455978 696621780 695659256 695026703 694750290 694447250 694862213 695268707 695839920 695891342 695207520
2796.7F95207520m22669r91135j148605q91418m16260k1057K17361O92673M47540j10016
$$ 695207520 694784851 693793716 692645111 691753693 691337433 691316376 691533737 692226410 692673950 692563934
2806.3F92563934p78351r09347q30231q91418o49491m80728j66321K89917O14014L64456
$$ 692563934 691785583 690876236 690046005 689154587 688505096 688024368 687858047 688147964 688761978 689126434
2816F89126434l74221j297226j465226r34829n64957k45819j45569M25491M59061j96304
$$ 689126434 688752213 687454987 685989761 685054932 684489975 684244156 684098587 684524078 684983139 684786835
2825.6F84786835n18112j074982j030274p22427p28455n50155l85208l63922q3619
$$ 684786835 684268723 683193741 682163467 681441040 680712585 680162430 679777222 679413300 679329681
2834.3F79329681J00022m18320j030807j563950j778641k166214k028732p98721o17752
$$ 679329681 679429703 679011383 677980576 676416626 674637985 672471771 670443039 669644318 669026566
2843F69026566j040268j114731j257477j813278k477341k563934k601319k082595j131058
$$ 669026566 667986298 666871567 665614090 663800812 661323471 658759537 656158218 654075623 652944565
2851.7F52944565l19977N57251N73120K88010L36380p6752j93558J82801j8006j16348
$$ 652944565 652624588 653181839 653754959 654042969 654379349 654302597 654109039 654291840 654273834 654157486
2861.3F54157486M63181P09762M47006O78406M80042m51050p21054r96781r08661m05655
$$ 654157486 654620667 655330429 655777435 656455841 656935883 656484833 655763779 654766998 653858337 653452682
2870.9F53452682j09100K83890L22266M65011M24500j99433r75799r82361k64588l29360
$$ 653452682 653343582 653627472 653949738 654414749 654839249 654639816 653664017 652681656 652417068 652087708
2880.6F52087708p09458m66614L36380M37622l25393q18405p83768o00815r31778j074829
$$ 652087708 651378250 650911636 651248016 651685638 651360245 650541840 649758072 649157257 648225479 647150650
2890.2F47150650r83810p74384m81491n951J22604q74481r28726q51898j247254j252822
$$ 647150650 646166840 645392456 644910965 644905014 645027618 644153137 643224411 642372513 641125259 639872437
2899.9F39872437j271935q19244l96805K98118O8283n92880l96080j101303j602554
$$ 639872437 638600502 637781258 637384453 637682571 637750854 637157974 636761894 635660591 634058037
2908.6F34058037j468659j542167j608467j365471j683579j758575p29943j491699
$$ 634058037 632589378 631047211 629438744 628073273 626389694 624631119 623901176 622409477
2916.3F22409477k241668j911736j910667j281853j274185j080857r0904M61731N84869
$$ 622409477 620167809 618256073 616345406 615063553 613789368 612708511 612617607 613079338 613664207
2925F13664207J97831j43395Q5907M43230N43938Q10852J267929J407623R74007J313858
$$ 613664207 613862038 613718643 613804550 614247780 614791718 615602570 616870499 618278122 619252129 620565987
2934.6F20565987J591644P08275O65855O30722M74053N72166Q12073J267357P32803
$$ 620565987 622157631 622865906 623531761 624162483 624636536 625208702 626020775 627288132 628020935
2943.3F28020935O59332Q13485N38711J61514m95643k90413n11208n94063K72179K80075
$$ 628020935 628680267 629493752 630032463 630193977 629698334 629407921 628896713 628302650 628574829 628854904
2952.9F28854904K49520L99017N30243O20079M3945l37524m84848j06125J125717J313324
$$ 628854904 629104424 629503441 630033684 630653763 630697708 630360184 629875336 629769211 630894928 632208252
2962.6F32208252O67076O21376O15273R67521J249352K00195l99589J51825N72433
$$ 632208252 632875328 633496704 634111977 635079498 636328850 636529045 636129456 636281281 636853714
2971.2F36853714J161690J510391J060295O32858P91855P42417K49710N3100l41568
$$ 636853714 638015404 639525795 640586090 641218948 642010803 642753220 643002930 643056030 642714462
2979.9F42714462m09622k24304q8654Q10547J184998P29599K89535J50299j36184n97382
$$ 642714462 642304840 642080536 641991882 642802429 643987427 644717026 645006561 645156860 645020676 644423294
2989.6F44423294n25284k79922K26059J29699j39083N81893O51169j72882n84335k37961
$$ 644423294 643898010 643618088 643844147 643973846 643834763 644416656 645067825 644894943 644310608 644072647
2999.2F44072647j86310p98416q96683l9520M65927J39542K7695j69068k49939k92816
$$ 644072647 643886337 643087921 642191238 642151718 642617645 642757187 642784882 642615814 642365875 642073059
3008.8F42073059q42285q39615m44145l07121P2021L99246P8888k05002k20718o09398
$$ 642073059 641230774 640391159 639947014 639639893 639711914 640111160 640190048 639985046 639764328 639154930
3018.5F39154930q94508n78156o57158r40971j84631L46946L26271R3422l06205j37368
$$ 639154930 638260422 637682266 637025108 636084137 635899506 636246452 636572723 636666145 636359940 636222572
3028.1F36222572k05459n90744j217804j397858m39300Q5372n7716K09503K27738o16684
$$ 636222572 636017113 635426369 634208565 632810707 632371407 632456779 632399063 632608566 632836304 632219620
3037.8F32219620n10140o01654j286392o52390j61972k52761l46222j12076J01395
$$ 632219620 631709480 631107826 629821434 629169044 629007072 628754311 628408089 628296013 628397408
3046.5F28397408q1597o33507j228828o85043o43998r58480m34037p3700j88369k56272
$$ 628397408 628315811 627682304 626453476 625768433 625124435 624165955 623731918 623658218 623469849 623213577
3056.1F23213577k47879n95894l61824m48951j028290r26819l77579k77214p43942
$$ 623213577 622965698 622369804 622007980 621559029 620530739 619603920 619226341 618949127 618205185
3064.8F18205185K37007N24330k16980l44276q76389q23860r66110r73244j15127K53982
$$ 618205185 618442192 618966522 618749542 618405266 617528877 616705017 615738907 614765663 614650536 614904518
3074.4F14904518J6861Q2207L48205n04989j053314j104775q58116r6130j39771l48511
$$ 614904518 614921379 615003586 615351791 614846802 613793488 612688713 611830597 611734467 611594696 611246185
3084.1F11246185l14254j53199l7307l50762p64503m89121m97742j081695o33965O867
$$ 611246185 610931931 610778732 610741425 610390663 609626160 609137039 608639297 607557602 606923637 606930504
3093.7F06930504m3564o52237m57344J14212J20926n5580q13408p61223j076927j173134
$$ 606930504 606886940 606234703 605777359 605891571 606012497 605956917 605143509 604382286 603305359 602132225
3103.4F02132225l69148k15645J44081l23257m79546j61858l94172m54102p69195r44977
$$ 602132225 601763077 601547432 601691513 601368256 600888710 600726852 600332680 599878578 599109383 598164406
3113E98164406o64139r1515k70729K45629M90036r41277j003189n84183o05507q72764
$$ 598164406 597500267 597408752 597138023 597383652 597873688 596932411 595929222 595345039 594739532 593866768
3122.6E93866768q50144k53143Q736p4311o51855m97704m73594q28171o57730m73175
$$ 593866768 593016624 592763481 592772217 592697906 592046051 591548347 591074753 590246582 589588852 589115677
3132.3E89115677m12369n24673j61515J81580O5308o61812q24738l34549o91414q85048
$$ 589115677 588703308 588178635 588017120 588198700 588264008 587602196 586777458 586442909 585751495 584866447
3141.9E84866447n91545l87840o89964j85280J8501o59485l55758p43866o65207m36363
$$ 584866447 584274902 583887062 583197098 583011818 583030319 582370834 582015076 581271210 580606003 580169640
3151.6E80169640r29146p84645o92368m13666j67465L79372j12877j035996o60247
$$ 580169640 579240494 578455849 577763481 577349815 577182350 577561722 577448845 576412849 575752602
3160.3E75752602q19054q89549q43773m84429K24076m78745j109810l20511J47629
$$ 575752602 574933548 574043999 573200226 572715797 572939873 572461128 571351318 571030807 571178436
3168.9E71178436l16047p83272j049233q39233o58875l60641k95029m29306J15090
$$ 571178436 570862389 570079117 569029884 568190651 567531776 567171135 566876106 566446800 566561890
3177.6E66561890l36419p33680n33791p47909n72167m95491p07359j119080p59735
$$ 566561890 566225471 565491791 564958000 564210091 563637924 563142433 562435074 561315994 560556259
3186.3E60556259p4692l93867k35291R4605q28018j145935l12539j72233p13043p45850
$$ 560556259 560481567 560087700 559852409 559947014 559118996 557973061 557660522 557488289 556775246 556029396
3195.9E56029396R6588m42238j282272l86887l55072n49583l66936l42369o56433r41200
$$ 556029396 556125984 555683746 554401474 554014587 553659515 553109932 552742996 552400627 551744194 550802994
3205.6E50802994l39508m01345k40631k7160m83513o00243n61638k68440o44379q39958
$$ 550802994 550463486 550062141 549821510 549794350 549310837 548710594 548148956 547880516 547236137 546396179
3215.2E46396179o21643o93664j31798j10169q18786n53398k48070o92368n82771n44815
$$ 546396179 545774536 545080872 544949074 544838905 544020119 543466721 543218651 542526283 541943512 541398697
3224.9E41398697o36253n56679k20528L68080m31671q90541k96211k12097p23801q67462
$$ 541398697 540762444 540205765 539985237 540353317 539921646 539031105 538734894 538522797 537798996 536931534
3234.5E36931534k49062n88875o69288J9874j36985n38140m38156l77808o19354m55360
$$ 536931534 536682472 536093597 535424309 535444183 535307198 534769058 534330902 533953094 533333740 532878380
3244.2E32878380n20287k42347J99012j12724q17223j574783p48939K58789J27105
$$ 532878380 532358093 532115746 532314758 532202034 531384811 529810028 529061089 529319878 529446983
3252.8E29446983j33018n60570m76303m3526l06663n53742j56746n53550q93364l00255
$$ 529446983 529313965 528753395 528277092 528233566 527926903 527373161 527216415 526662865 525769501 525469246
3262.5E25469246L2539k19001p77054n86968k21329n8822K5558l74603q57429m42391
$$ 525469246 525501785 525282784 524505730 523918762 523697433 523638611 523664169 523289566 522432137 521989746
3272.1E21989746P3395q63266p45316j27220j94816K4643j53466l56827q50448k48032
$$ 521989746 522063141 521199875 520454559 520327339 520132523 520157166 520003700 519646873 518796425 518548393
3281.8E18548393K52419n81589p28455l97300J23748l34396l75404R5939k73361l63121
$$ 518548393 518800812 518219223 517490768 517093468 517217216 516882820 516507416 516603355 516329994 515966873
3291.4E15966873o57081l49007j74332n16777n47485l48549J19362j16615m95720r62754
$$ 515966873 515309792 514960785 514786453 514269676 513722191 513373642 513493004 513376389 512880669 511917915
3301E11917915r54551k45858J05057N3711m70199k75498q659n98107m22706k01073
$$ 511917915 510963364 510717506 510822563 510876274 510406075 510130577 510121918 509523811 509101105 508900032
3310.7E08900032p91092n40581k69317p21588m88091l52745l75938o9199L4256n84373
$$ 508900032 508108940 507568359 507299042 506577454 506089363 505736618 505360680 505291481 505325737 504741364
3320.3E04741364j129838m82368P9689J15318m17900r48295r11103n81474k39830p02209
$$ 504741364 503611526 503129158 503208847 503324165 502906265 501957970 501046867 500465393 500225563 499523354
3330D99523354m41018k35862r56917p44705k09160q3008k54440j39809l68538j060257
$$ 499523354 499082336 498846474 497889557 497144852 496935692 496852684 496598244 496458435 496089897 495029640
3339.6D95029640q84170k44446j21079o93130o86569j96305k07214m76608o89163m43001
$$ 495029640 494145470 493901024 493779945 493086815 492400246 492203941 491996727 491520119 490830956 490387955
3349.3D90387955k1897J13716n04760j119881o01120J08795j4152m60320l65791r5711
$$ 490387955 490366058 490479774 489975014 488855133 488254013 488362808 488348656 487888336 487522545 487426834
3358.9D87426834Q7395j3886p07817p20634O8321k31705q58841j58882L9177p33642
$$ 487426834 487514229 487500343 486792526 486071892 486140213 485908508 485049667 484890785 484929962 484196320
3368.6D84196320k98195M1427o62841k92473k93351n48744M01078K09960k56271l09677
$$ 484196320 483898125 483939552 483276711 482984238 482690887 482142143 482543221 482753181 482496910 482187233
3378.2D82187233n35889m17480n02243l45764j45569l8109p8659j77574k60124k78550
$$ 482187233 481651344 481233864 480731621 480385857 480240288 480202179 480123520 479945946 479685822 479407272
3387.8D79407272K97814q5602m10919m9210m30374m59137m97017m34799K41432J16806
$$ 479407272 479705086 479619484 479208565 479159355 478728981 478269844 477772827 477338028 477579460 477696266
3397.5D77696266l58391o3705J62201L8872m5891m52957p57523k04048K87208k69088
$$ 477696266 477337875 477274170 477436371 477475243 477429352 476976395 476218872 476014824 476302032 476032944
3407.1D76032944k75154L02887j75438k11258J58767m35905m15306J85776k06299l78876
$$ 476032944 475757790 476060677 475885239 475673981 475832748 475396843 474981537 475167313 474961014 474582138
3416.8D74582138J24512O89583P59887m55551o87485K02713j14n6877N71441J42594
$$ 474582138 474706650 475396233 476156120 475700569 475013084 475215797 475215683 475158806 475730247 475872841
3426.4D75872841m23317L18260K45400l58811l06587R5558P85065P35130k36320p62215
$$ 475872841 475449524 475767784 476013184 475654373 475347786 475443344 476228409 476963539 476727219 475965004
3436.1D75965004P4539K49176o409M33426M25492r3003n12161K48375K70920M87862
$$ 475965004 476039543 476288719 476282310 476715736 477141228 477048225 476536064 476784439 477055359 477543221
3445.7D77543221K99186j251297K15416P61070N32952P90634L64799L30697K5444J54914
$$ 477543221 477842407 476591110 476806526 477567596 478100548 478891182 479255981 479586678 479612122 479767036
3455.3D79767036K6894M21829N23033j92680N49164O52809J39236n0354N11933Q93555
$$ 479767036 479793930 480215759 480738792 480546112 481095276 481748085 481887321 481836967 482348900 483242455
3465D83242455M29229P6142j54496L61596N51071M76417J11351m3373L73039R537k40440
$$ 483242455 483671684 483747826 483593330 483954926 484505997 484982414 485093765 485050392 485423431 485432968 485192528
3475.6D85192528P31544J692620L61175m8561J041107O01921l61938n21927R21669
$$ 485192528 485924072 487616692 487977867 487929306 488970413 489572334 489210396 488688469 489610138
3484.3D89610138O28700K17056R83925L59497M16909J65634k73934J00556P78656J073303
$$ 489610138 490238838 490455894 491439819 491799316 492216225 492381859 492107925 492208481 492987137 494060440
3493.9D94060440N90935K11944q1901M28123Q15468P67937L87916O94771R40514m66652
$$ 494060440 494651375 494863319 494781418 495209541 496025009 496792946 497180862 497875633 498816147 498349495
3503.6D98349495J39236R30787L87992N16243J356583N17464k28386J255302L05100
$$ 498349495 498488731 499419518 499807510 500323753 501680336 502197800 501969414 503224716 503529816
3512.2E03529816J19857Q37555K12326N55649R86367Q53004J43242N32608J028671
$$ 503529816 503649673 504487228 504699554 505255203 506241570 507094574 507237816 507770424 508799095
3520.9E08799095P81784K40822r18617r3231J499748J679077L26996L08838N04188
$$ 508799095 509580879 509821701 508903084 508809853 510309601 511988678 512315674 512624512 513128700
3529.6E13128700M79088Q63381L97758Q12073Q65059J150360L29208m69589J101036
$$ 513128700 513607788 514471169 514868927 515681000 516546059 517696419 518025627 517556038 518657074
3538.3E18657074Q22067Q75206R91249O35987N78918R69658L52554q53042L88717M4175
$$ 518657074 519479141 520354347 521345596 521981583 522560501 523530159 523882713 523029671 523418388 523462563
3547.9E23462563J537246J709862J521797J708222j607590N86586J166458J287117
$$ 523462563 524999809 526709671 528231468 529939690 528332100 528918686 530085144 531372261
3555.6E31372261J940002r6054J290894Q62427j45798J83868J529694R36546j94931
$$ 531372261 533312263 533216209 534507103 535369530 535223732 535407600 536937294 537873840 537678909
3564.3E37678909K934647q61702m84695Q30650j157799L721390K084503O62651J014786
$$ 537678909 540613556 539751854 539267159 540097809 538940010 542661400 544745903 545408554 546423340
3573E46423340R88312R12246N27993R66835k37008K203827J689797p14455Q13141J088486
$$ 546423340 547411652 548323898 548851891 549818726 549581718 551785545 553475342 552760887 553574028 554662514
3582.6E54662514P98607L35998K973824J338653j512794J007957j076126K828407K698250
$$ 554662514 555461121 555797119 558770943 560109596 558596802 559604759 558528633 561357040 564055290
3591.3E64055290J529618l8376K7809L261223k588120O05240L383102J72120K508354
$$ 564055290 565584908 565546532 565574341 568835564 566247444 566852684 570235786 570407906 572916260
3600E72916260R53979p7820J407471J092224J163559L071785K571526k388191K495689
$$ 572916260 573870239 573792419 575199890 576292114 577455673 580527458 583098984 580710793 583206482
3608.7E83206482n97344j108398O550484J50642k509346K994347r80721L692131M045182
$$ 583206482 582609138 581500740 588051224 588201866 585692520 588686867 587706146 591398277 595443459
3617.4E95443459k61002J531067j509476p18307K287178J773529J414757K208023J628761
$$ 595443459 595182457 596713524 595204048 594485741 596772919 598546448 599961205 602169228 603797989
3626F03797989K298622O666031j543312j0826302M000359M532738N254173J156654
$$ 603797989 606096611 612762642 611219330 600393028 604393387 608926125 614180298 615336952
3633.8F15336952j688766J840973K849121K733764M4823O64291J746674J815453J333236
$$ 615336952 613648186 615489159 618338280 621072044 621116867 621781158 623527832 625343285 626676521
3642.4F26676521M2458J330376K893714N056839j970100m079590N395508r42764l342552
$$ 626676521 626718979 628049355 630943069 635999908 634029808 629950218 635345726 634402962 631060410
3651.1F31060410L59382N334244L872337L270951N107421o771240L43628M645386J141891
$$ 631060410 631419792 636754036 640626373 643897324 649004745 642233505 642577133 647222519 648364410
3659.8F48364410Q58002j17721J519546J271210P09228N70374M45022L885346J035461
$$ 648364410 649222412 649104691 650624237 651895447 652604675 653175049 653620071 657505417 658540878
3668.5F58540878k379989m0131o463242K237626P735977Q477936J54876j8854065K880097
$$ 658540878 656160889 656120758 649657516 651895142 659631119 668109055 668263931 649409866 652289963
3677.1F52289963P386932L915634j785354N44357K205505Q48084J204376k60010m72259
$$ 652289963 659676895 663592529 661807175 662351532 664557037 665405121 666609497 666349487 665877228
3685.8F65877228L276596N465393p994766m506073P167740n271225n54276M881287
$$ 665877228 669153824 674619217 666624451 662118378 669286118 664014893 663460617 668341904
3693.5F68341904O44912J455307J46790n07126L12500q08334J603546L168564m136734
$$ 668341904 668986816 670442123 670588913 670081787 670394287 669585953 671189499 674358063 670221329
3702.2F70221329l138352M120865J192017r4376J177063K618027L001251q498154K439804
$$ 670221329 667082977 671203842 672395859 672301483 673478546 676096573 679097824 670599670 673039474
3710.9F73039474N006867j0540237M010009M582367R33457K49481J322250M69437m104309
$$ 673039474 678046341 667506104 671516113 676098480 677031937 677281418 678603668 679073105 674968796
3719.6F74968796O61011N235214m352341n108719M382630L05709o68335k276382k0828
$$ 674968796 675629807 680865021 676512680 671403961 675786591 676092300 675423965 673147583 673126755
3728.3F73126755L323974N50003N314637j182404o826858P913894q10318j1799545
$$ 673126755 676450729 677000732 682315369 681132965 674306107 682220001 681409683 669610138
3736F69610138J943741M108505O72073L123551M025192l572845J862259J0334472j0257873
$$ 669610138 671553879 675662384 676334457 679458008 683483200 679910355 681772614 692107086 681849213
3744.7F81849213j6037522R904251N988541O125107k712937j2155227R461365k948227
$$ 681849213 665811691 675715942 681704483 687829590 685116653 672961426 682422791 679474564
3752.4F79474564o550446N474777M462662K724838m602966J766205M895477o125870
$$ 679474564 672924118 678398895 682861557 685586395 680983429 682749634 687645111 681519241
3760.1F81519241j401825L037262Q14896N82275K987976k298889m262085K715454M303284
$$ 681519241 680117416 683154678 683969574 684551849 687539825 685240936 680978851 683694305 687997589
3768.8F87997589p26166q690567J997757L369904J73340J013946J34659M91486M26330
$$ 687997589 687271423 678580856 680578613 683948517 684121857 685135803 685270462 685761948 686188278
3777.4F86188278K441178K72140p578583J236954K565231J073151J084747l253402
$$ 686188278 688629456 688901596 681323013 682559967 685125198 686198349 687283096 684029694
3785.2F84029694n09873J595383N71976Q8424m28695N03463p8582k57264o88324J320115
$$ 684029694 683519821 685115204 685687180 685775604 685346909 685850372 685771790 685514526 684826202 686146317
3794.8F86146317K774276m095001k742538J922683L389664N030060p540055r912109
$$ 686146317 688920593 684825592 682083054 684005737 687395401 692425461 684885406 674973297
3802.5F74973297L789978L447571N084076O140900r157410m691849M952927J514816
$$ 674973297 678763275 682210846 687294922 693435822 684278412 679586563 684539490 686054306
3810.2F86054306K35291L40652p30667N82657M186172k259979j1768341N379486N296021
$$ 686054306 686289597 686630249 685899582 686482239 690668411 688408432 676640091 682019577 687315598
3818.9F87315598L368835P51572j6098709J735687N049133K129440K448578r2697l380127
$$ 687315598 690684433 691436005 675337296 677072983 682122116 684251556 686700134 686607437 683227310
3827.6F83227310L43018J486130K736358J121674q472290J550674O167908m566422
$$ 683227310 683570328 685056458 687792816 688914490 680442200 681992874 688160782 683594360
3835.3F83594360l30810P565765q432998n322037Q360901l233872J14670O133118k540665
$$ 683594360 683263550 690829315 682396317 677074280 685435181 682201309 682315979 688449097 685908432
3844F85908432l259354K063294Q80737k7466J713944j079407N41153N024490m238205
$$ 685908432 682649078 684712372 685593109 685565643 687279587 686200180 686741333 691765823 687527618
3852.7F87527618L022385j1867828l026886Q403396m54330j889572K127380K518311
$$ 687527618 690550003 678682175 675655289 684058685 683604355 681714783 683842163 686360474
3860.4F86360474K579269n198822j148529N792847m168167m324494L493729L937988
$$ 686360474 688939743 683740921 682592392 688385239 684217072 679892578 683386307 687324295
3868.1F87324295N002594o703644r038162L821564O250305L067932r973984M53949
$$ 687324295 692326889 685623245 676585083 680406647 686656952 689724884 679750900 680204849
3875.8F80204849M176407j77612J671524L901520m672089o448364M704132J317520
$$ 680204849 684381256 684203644 685875168 689776688 685104599 678656235 683360367 684677887
3883.5F84677887J339645M996262j0334015o61087L454056J309662M110565j246948
$$ 684677887 686017532 691013794 680679779 680018692 683472748 684782410 688892975 687646027
3891.2F87646027q453980J805496L549042j179962P69119J316300K118682Q16117q777390
$$ 687646027 679192047 680997543 684546585 683366623 684135742 685452042 687570724 688386841 679609451
3899.9F79609451M729767K560578n831299L208847l541718j788101K030716J572342
$$ 679609451 684339218 686899796 681068497 684277344 680735626 678947525 680978241 682550583
3907.6F82550583K219849R002p8506n22385R995J3504l91846J197891M22058l276138
$$ 682550583 684770432 684779434 684700928 684178543 684188538 684202042 683810196 685008087 685430145 682154007
3917.3F82154007j971207L556290o08368l222122L058853K154846J109162k763291
$$ 682154007 680182800 683739090 683130722 679908600 682967453 685122299 686231461 683468170
3925F83468170m080047J705246K159805J944656q44269j237106R82742k837829r48105
$$ 683468170 679388123 681093369 683253174 685197830 684353561 683116455 684099197 681261368 680313263
3933.7F80313263J789932L95203O65207J097336R7503p51190j229172K31781P44324
$$ 680313263 682103195 682498398 683163605 684260941 684358444 683607254 682378082 682609863 683354187
3942.3F83354187l079453k01492J944809J171112P60117k736588O943O59180j125946
$$ 683354187 680274734 680073242 682018051 683189163 683949280 681212692 681219635 681878815 680752869
3951F80752869J764984k29416r15299M84925P96737N95093j124649n36194m65469O35986
$$ 680752869 682517853 682288437 681373138 681858063 682654800 683249893 682125244 681589050 681123581 681759567
3960.7F81759567M59442j492538J061783R51156m43039O85349N87921L83606o42242
$$ 681759567 682219009 680726471 681788254 682739410 682296371 682981720 683569641 683953247 683311005
3969.3F83311005j657029l81088m8065k4185M15649l57284k99378Q6136j56021J96686
$$ 683311005 681653976 681272888 681224823 681200638 681616287 681259003 680959625 681045761 680889740 681086426
3979F81086426L54690J68228L10517m34418r48410j46637j74866P86057J026077m18014
$$ 681086426 681441116 681609344 681919861 681485443 680537033 680390396 680215530 681001587 682027664 681609650
3988.6F81609650N08575K47345p86514j46179n71747q11157l3722O09970j35498m89884
$$ 681609650 682118225 682365570 681579056 681432877 680861130 680049973 680016251 680626221 680490723 680000839
3998.3F80000839O43158N62668
$$ 680000839 680643997 681206665
4000.2F81206665
$$ 681206665
##END=$$ End of the data block
