##TITLE=$$ Begin of the data block
##JCAMP-DX=5.00 $$ ACD/SpecManager v 10.08
##SPECTROMETER/DATA SYSTEM=Varian
##DATE=08 Jan 2013 16:01:06
##DATA TYPE=INFRARED SPECTRUM
##DATA CLASS=XYDATA
##ORIGIN=
##OWNER=
##NPOINTS=3735
##FIRSTX=399.26403809
##LASTX=4000.35498047
##MAXX=4000.35498047
##MINX=399.26403809
##MAXY=81.23735046
##MINY=42.51689529
##XFACTOR=1.0000000000
##YFACTOR=0.000000100000000
##FIRSTY=61.11450195
##DELTAX=0.96440572
##XUNITS=1/CM
##YUNITS=TRANSMITTANCE
##XYDATA=(X++(Y..Y))
399.3F11145020P080497k679748l869896J143722j406974L338317M824257m895744
407F14679451n500908m321937L33023L921394r67407k70996o89164l3950M510727J999511
416.6F13659744N247841J1833687k7493591j0068398N399132j81007M109039K786598
424.3F05293045l737526M021874N404701l283959n241317k642403k44217M81148j114960
433E98936386K826386L454666k799568l550072o7673K774735J014251k749176j533889
441.7E98306046L77006k496414J106N756416M279862o91300j785011N70679K336578
450.4F06654968J345063j776162l516845O54373K038231J775322j187325o773338o61202
459.1E98553085K261086K715111l638115k981263J292305J63994J897927k35634J031036
$$ y = [611145020, 618225517, 615545769, 611675873, 612819595, 611412621, 614750938, 619575195, 614679451, 609178543, 604856606, 605189629, 609111023, 608143616, 607872620, 607183456, 607149506, 611660233, 613659744, 618907585, 630741272, 603247681, 593179283, 598578415, 598397408, 602506447, 605293045, 601555519, 605577393, 610982094, 607698135, 602456818, 599814415, 599570198, 600051346, 598936386, 601762772, 605217438, 602417870, 598867798, 598800125, 601574860, 602589111, 599839935, 598306046, 598683052, 596186638, 596187744, 601944160, 606224022, 605532722, 603747711, 604318390, 606654968, 608000031, 606223869, 602707024, 603361397, 605399628, 607174950, 605987625, 599214287, 598553085, 600814171, 603529282, 599891167, 596909904, 598202209, 598366203, 600264130, 600028496, 601059532]
467.7F01059532L34053l251152J763458J900063o871147p757569L794060N563622k272606
476.4E94262314k841873M15306O91986J347313K21176p8125J528206j7357q35152j445999
486.1E93247795L19023N363693L912926l640518q138733l902473Q20503N94673K808647
494.7E91385536M207802J683693j156502K937j91535P19986n42069l025780J072731
503.4E94156799k842979j448593K593307J091309P67975j912537j54953J062393K72789
512.1E93585510l31650l108634q39043P96814k759552k080345M176559K113686j056481
520.8E90496864M07181j774444j024514K34452j370736l321762j873436P67861K728462
529.5E85269928K950134p26166j821403j614685j233292P68357O16569P85065j68305
$$ y = [601059532, 601393585, 598142433, 599905891, 601805954, 594934807, 587177238, 590971298, 596534920, 594262314, 591420441, 591835747, 592527733, 593875046, 594096222, 594018097, 595546303, 595528946, 594693794, 593247795, 593566818, 598930511, 602843437, 599202919, 591064186, 587161713, 587982216, 588576889, 591385536, 595593338, 597277031, 596120529, 596123466, 595931931, 596651917, 596109848, 593084068, 594156799, 591313820, 589865227, 592458534, 593549843, 594317818, 592405281, 592250328, 593312721, 593585510, 593253860, 590145226, 589306183, 590102997, 587343445, 585263100, 589439659, 591553345, 590496864, 590904045, 589129601, 588105087, 588339539, 586968803, 583647041, 581773605, 582541466, 585269928, 588220062, 587493896, 585672493, 584057808, 582824516, 583592873, 584209442, 584994507, 584826202]
538.1E84826202j09939J259079Q28094l36075j733512q87795p16820j858291n62897
546.8E80708046R54437k02255q87947Q66470J003723l89289j013070j728058j535453
555.5E77776604L55262L43667R2048r0561n68084J754226J063805j207810r6740J44767
565.1E79567184j179313j127854P33567R14154J268158J241798j481895j328659Q46633
573.8E79453773q29238k033577K13546K79084J63383k99110m93241K132035J522483
582.5E80109138r7084l50799j63956o19163j734429l86657K75917Q0528J294594J714630
592.1E80122719O07872k13394L21235k02827k093964n90896J065559m15153n84260
600.8E78016891L64037J60294J55830O08292k69204p06749m12559j141624k75002j071510
$$ y = [584826202, 584716263, 585975342, 586803436, 586467361, 584733849, 583846054, 583129234, 581270943, 580708046, 581662483, 581460228, 580572281, 581438751, 582442474, 582053185, 581040115, 579312057, 577776604, 578131866, 578475533, 578567581, 578477020, 577908936, 579663162, 580726967, 579519157, 579422417, 579567184, 578387871, 577260017, 577993584, 578907738, 580175896, 581417694, 579935799, 578607140, 579453773, 578624535, 576590958, 576804504, 577083588, 577246971, 576947861, 576454620, 578586655, 580109138, 580012054, 579661255, 579497299, 578878136, 577143707, 576757050, 577032967, 577113495, 578408089, 580122719, 580730591, 580517197, 580838432, 580635605, 578541641, 577950745, 579016304, 578601151, 578016891, 578380928, 578541222, 578697052, 579305344, 579036140, 578329391, 577916832, 576775208, 576500206, 575428696]
610.5E75428696k235527N85212J453362j88828n95207K23313o89469o31714N89218
619.2E73939056n24520O32057R20257L11013K144889J628075l73535N28641J349525
627.8E80555458m58450K25181J216660p5264J128998K502670J316566K65809J511955
636.5E88189583K085914O52771k96707p11975O08025K640228J805611N93414R28154
645.2E96495018J001816J020279j85356j110230K93617Q69980l63235n49279J036911
653.9E98509521J627427R09385J31073j74370l16085j496773j313286N09567R98078
662.5E99384537N08423J06544j8349K37732k510299j1192246P507630O468887J384239
671.2F01877098p58438n51376P02591J932602J262054O90994K14462M34723J593628
$$ y = [575428696, 573193169, 573778381, 575231743, 575042915, 574447708, 574671021, 573981552, 573349838, 573939056, 573414536, 574046593, 574966850, 575277863, 577422752, 579050827, 578677292, 579205933, 580555458, 580097008, 580322189, 581538849, 581463585, 582592583, 585095253, 586411819, 586677628, 588189583, 590275497, 590928268, 590631561, 589919586, 590527611, 593167839, 594973450, 595566864, 596495018, 597496834, 598517113, 598331757, 597221527, 597515144, 598385124, 598021889, 597472610, 598509521, 600136948, 601046333, 601177406, 601003036, 600686951, 599190178, 597876892, 598386459, 599384537, 599892960, 599999504, 599981155, 600218887, 597708588, 586516342, 594023972, 600492859, 601877098, 601118660, 600567284, 601269875, 603202477, 604464531, 605155525, 605369987, 605804710, 607398338]
679.9F07398338J220742K71415J02883R04579J073799J63765P27348J139717P15371
688.6F13717957Q64830J592788J951676o6414j074410J70632N73463M94576P99713
697.3F19024811J453018R41505n03501l11928J042099J119461L50990k75917j38779
705.9F22701759J237259J857682J648139J077462N05981L26386R2544L968k99187L69530
715.6F29521523M38385K45399J225929N42679O71921J683388O96067k365k88925n13344
725.2F34220657P37076J528740P07131O39152J234360J635704R39407n55954j176262
733.9F39910011l65562P85141N54199R20563J283035M32587P90329J715545J408997
742.6F47434845m7913j500015r65423P70568n1498J95084K231674J722412J131973
$$ y = [607398338, 608619080, 608890495, 608993378, 609897957, 610971756, 611135521, 611862869, 613002586, 613717957, 614582787, 616175575, 618127251, 618060837, 616986427, 617157059, 617730522, 618225098, 619024811, 620477829, 621419334, 620915833, 620603905, 621646004, 622765465, 623116455, 622840538, 622701759, 623939018, 625796700, 627444839, 628522301, 629028282, 629354668, 629447212, 629451180, 629151993, 629521523, 629959908, 630205307, 631431236, 631973915, 632645836, 634329224, 635025291, 635022926, 634734001, 634220657, 634957733, 636486473, 637193604, 637832756, 639067116, 640702820, 641642227, 641086273, 639910011, 639544449, 640329590, 640883789, 641804352, 643087387, 643519974, 644310303, 646025848, 647434845, 647386932, 645886917, 644921494, 645692062, 645640564, 645835648, 648067322, 649789734, 650921707]
751.3F50921707J045075J374664O18668q80814q4076J015549J058120O9046M87671
760F55625610J537171J313400R92889O80008L99094r6436m33578r07440L40652J462937
769.6F60914307O94885L67279P49130R37805r82666r08355o2027m87976M12826L75595
779.2F62010803N36499L89023M09927Q63343L72543j07040m84162K73667R95102R89151
788.9F66248856j35956L4332J571045J268616p51496j458587J135177M36478q94928
797.6F67453537k75421o99768j93482o47964m93241l48968p08923o82068j093827q65554
807.2F61444321n07202m65546j310425j198196j425095j121597L91159j90964j039123
815.9F54577332j379776j047822j053085J71280J623230R97086J340255P02896J26877
$$ y = [650921707, 651966782, 653341446, 653960114, 653079300, 652995224, 654010773, 655068893, 655137939, 655625610, 657162781, 658476181, 659469070, 660149078, 660548172, 660451736, 660018158, 659110718, 659451370, 660914307, 661609192, 661976471, 662725601, 663663406, 662680740, 661772385, 661710358, 661222382, 661635208, 662010803, 662547302, 662936325, 663346252, 664209595, 664582138, 664475098, 663990936, 664264603, 665259705, 666248856, 666112900, 666147232, 667718277, 668986893, 668235397, 666776810, 667911987, 668348465, 667453537, 667178116, 666478348, 666284866, 665636902, 665143661, 664794693, 664085770, 663403702, 662309875, 661444321, 660937119, 660471573, 659161148, 657962952, 656537857, 655416260, 655807419, 655616455, 654577332, 653197556, 652149734, 651096649, 651267929, 652891159, 653888245, 655228500, 655931396, 656058273]
824.6F56058273M92707J278076K251434K230148K465821J896591J858597J379394J077500
833.3F70988541K114410K896118L083878J738128J118927J174927J697617Q85238J44196
841.9F85841980P64084L76434M32587P14493K120590J913757J202545J353684L03650
850.6F95023804o7826k14996P09457M06876Q32596K049713J861877J787644O83746
859.3G03072891P77817N89600J272583J207733m61655R6207K17895M66919L67127p17163
868.9G06889954j609345p29141n70145j460342n43976n43060o92368n85022N2338m60510
878.6F99748383p72706R57718N18952q46634j497498p70645r99527o90231K60620o81076
888.2F95227356Q621N04990n2719j459198j057129K67639o20804q45947p31354N53131
$$ y = [656058273, 656550980, 657829056, 660080490, 662310638, 664776459, 666673050, 668531647, 669911041, 670988541, 673102951, 675999069, 679082947, 680821075, 681940002, 683114929, 684812546, 685697784, 685841980, 686606064, 686982498, 687415085, 688129578, 690250168, 692163925, 693366470, 694720154, 695023804, 694955978, 694740982, 695450439, 695857315, 696689911, 698739624, 700601501, 702389145, 703072891, 703850708, 704440308, 705712891, 706920624, 706458969, 706555176, 706773071, 707239990, 707607117, 706889954, 705280609, 704551468, 703981323, 702520981, 701977005, 701433945, 700741577, 700156555, 700208893, 699748383, 698975677, 699933395, 700452347, 699605713, 698108215, 697337570, 696338043, 695647812, 695908432, 695227356, 695235977, 695740967, 695688248, 694229050, 693171921, 693439560, 692818756, 691972809, 691241455, 691794586]
897.9F91794586M85230o50788j165542j440354l37982k25906K27585R19113J495437
906.5F91101379J230545R41849K131272J374969N72052J36337n50232p47604q6288
915.2F96104279k65503j448594r11026p53021j195907j648407r22699r30786k212296
923.9F85816040k292862k568817j677628j206131j788940j948700j839600j784362
931.6F70709000j824646j013565j011277q13217n41000j012345j088714q01850l88488
940.3F62213898j243286j309357p41272r34219r62677j066971o83670n89447q37250
949F53845749j69830Q11233M14505j62201l66058q70362o98242j524429k044678j385727
958.6F47849960r54055r62601j943512j857300r05380j133652j678886j596337j761665
$$ y = [691794586, 692279816, 691629028, 690463486, 689023132, 688685150, 688459244, 688686829, 689605942, 691101379, 692331924, 693273773, 695405045, 696780014, 697352066, 697488403, 696938171, 696190567, 696104279, 695838776, 694390182, 693479156, 692726135, 691530228, 689881821, 688959122, 688028336, 685816040, 683523178, 680954361, 679276733, 678070602, 676281662, 674332962, 672493362, 670709000, 668884354, 667870789, 666859512, 666046295, 665505295, 664492950, 663404236, 662602386, 662213898, 660970612, 659661255, 658919983, 657985764, 657023087, 655956116, 655272446, 654682999, 653845749, 653675919, 654487152, 654901657, 654739456, 654373398, 653503036, 652804794, 651280365, 649235687, 647849960, 646895905, 645933304, 643989792, 642132492, 641227112, 640093460, 638414574, 636818237, 635056572]
967.3F35056572k039833j388283n72052j136398k206230j719704j246338j703491k566185
976F20478058l059731k444572k847061l070908k352867k851791l183251l328285l293648
984.7E94045944k587967l806305l937530k531090l140182l080941k231025k238465
992.4E70492439k402611j431312j205216k314529k099228j414642k052727k685127
1000.1E54887047j432152j805496k729683j831207j658631j751442j843643j623306
1007.8E40211487j681900j297455j250992j226272q42438j685600j698075j804771
1015.5E28723984n35050j014900l014145k029533j981011k088432j931763j002197
1023.2E15126953j230736j927719j287956j575165j237678j695710p14263J16043n88303
$$ y = [635056572, 633016739, 631628456, 631056404, 629920006, 627713776, 625994072, 624747734, 623044243, 620478058, 617418327, 614973755, 612126694, 609055786, 606702919, 603851128, 600667877, 597339592, 594045944, 591457977, 587651672, 583714142, 581183052, 578042870, 574961929, 572730904, 570492439, 568089828, 566658516, 565453300, 563138771, 561039543, 559624901, 557572174, 554887047, 553454895, 551649399, 548919716, 547088509, 545429878, 543678436, 541834793, 540211487, 538529587, 537232132, 535981140, 534754868, 533912430, 532226830, 530528755, 528723984, 528188934, 527174034, 524159889, 522130356, 520149345, 518060913, 516129150, 515126953, 513896217, 511968498, 510680542, 509105377, 507867699, 506171989, 505457726, 505573769, 504985466]
1031.9E04985466j135292j239548M6120L91540Q36564K97164R42994J601867J256295
1040.6E07983170J534690R33571R89685p4920P52754O20537j210518j255112j689567
1049.3E08584290p35779r98574r87052j250840j740265p68394p96318j001663j187897
1058D99117508O4278k67640O44417K020035J572723J778908J753235K116242Q19244
1066.6E09618950J879883K133636J422653J388512K97775J461945j55907p53631q9875
1075.3E17203941k65426N09186Q39881R25942k9793J678162R55925j61171M72069l90740
1085E21737976J97334K14424J636124J584358R18732J028175O60057J221734O23359
1093.6E29822273J160317N56259l97644M26140J425857J507645J226539J686249R76601
$$ y = [504985466, 503850174, 502610626, 502656746, 503048286, 503884850, 504182014, 505125008, 506726875, 507983170, 509517860, 510451431, 511441116, 511366196, 512118950, 512739487, 511528969, 510273857, 508584290, 507848511, 506849937, 505862885, 504612045, 502871780, 502103386, 501307068, 500305405, 499117508, 499181786, 498914146, 499558563, 501578598, 503151321, 504930229, 506683464, 508799706, 509618950, 511498833, 513632469, 515055122, 516443634, 516741409, 518203354, 518047447, 517293816, 517203941, 516938515, 517447701, 518287582, 519213524, 519183731, 520861893, 521817818, 521656647, 522128716, 521737976, 521935310, 522149734, 523785858, 525370216, 526288948, 527317123, 527977180, 529198914, 529822273, 530982590, 531538849, 531141205, 531567345, 532993202, 534500847, 535727386, 537413635, 538390236]
1102.3E38390236Q89282K03705J76964n6076o56052R67827O61430J15662K64625J317368
1112E42274971Q20465l21960J276512R55429k81067o16798q6060K15302Q67271J190262
1121.6E46294327K73132L68881L06397P30095m5395j20621M24805M68788J763306K168006
1131.2E52631721L006287J490860Q03223K127075J434097J458092J376495J151772
1139E65479622J012115J126290J465263J628876J111488M04854Q61473J40266l93676
1147.6E72836571j05324m0970J68915L26691L27339l01934k14195m38995p18308m65965
1157.3E71373825o76117j124115j023865N9815j19553N0850N02930O85501J444778
1166E71174049J836319K097473J492386J875267K266426K253266K315216K267837K777214
$$ y = [538390236, 539279518, 539483223, 539660187, 539604111, 538948059, 539915886, 540577316, 540692978, 540957603, 542274971, 543095436, 542773476, 544049988, 545005417, 544724350, 544107552, 544021492, 544236794, 545104065, 546294327, 546567459, 546936340, 547242737, 547972832, 547927437, 547806816, 548231621, 548700409, 550463715, 552631721, 555638008, 557128868, 557932091, 560059166, 561493263, 562951355, 564327850, 565479622, 566491737, 567618027, 569083290, 570712166, 571823654, 572228508, 573089981, 573230247, 572836571, 572731247, 572690277, 572859192, 573185883, 573513222, 573211288, 572997093, 572558098, 571839790, 571373825, 570697708, 569573593, 568549728, 568609543, 568489990, 568540840, 569043770, 569729271, 571174049, 573010368, 575107841, 576600227, 578475494, 580741920, 582995186, 585310402, 587578239, 590355453]
1174.6E90355453K789994K735901K032547J546058J308518J294517J836624K117043
1182.4F06016655K376556J996842J314201J052094J673355J530914J022949R44557
1190.1F17928123K49291J94473J96419J76392L42140J88522K03171j84021p60651q43086
1199.7F17690773m40598j71661o20155j023178p91893m95530m43496j92414K4415L2119
1209.4F13568382k46696n43442k78168k35061m71802n56526k11182L84216K9946q96378
1219F10543289o12259J69335m56467q79974n16091n84831o05469o32286o00471l62969
1228.6F05461807P6638Q4877k79084m22020o33812n99136p10297m36325o9122j48354
1238.3F02325172J98784N41992M22440k35481l98751m43534o32897l96271k07748m18663
$$ y = [590355453, 593145447, 595881348, 597913895, 599459953, 600768471, 602062988, 603899612, 606016655, 608393211, 610390053, 611704254, 612756348, 614429703, 615960617, 616983566, 617928123, 618177414, 618371887, 618568306, 618744698, 619086838, 619275360, 619478531, 619294510, 618533859, 617690773, 617250175, 617078514, 616458359, 615435181, 614643288, 614147758, 613704262, 613511848, 613536263, 613568382, 613321686, 612778244, 612500076, 612265015, 611793213, 611236687, 611025505, 611409721, 611439667, 610543289, 609931030, 610100365, 609643898, 608763924, 608247833, 607663002, 607057533, 606425247, 605824776, 605461807, 605538445, 605623322, 605344238, 604922218, 604288406, 603689270, 602978973, 602542648, 602473526, 602325172, 602523956, 603065948, 603488388, 603252907, 602854156, 602410622, 601777725, 601381454, 601173706, 600755043]
1247.9F00755043o05431M22440M88777Q507L42255l8109n12276o42166k34680n36232
1257.6E99448128o39153K25220M94804P87201O79779N32837K93808J86196J16920M9820
1267.2F02175560M42886N48096Q67424Q02612J062088J239396R29641J126671P40929
1275.9F09935303M42581K30637J3389M99191J180916J385994J070633J497879J774788
1284.6F18031311R18465L95851K52418K42844O03371P01828Q29734J144448J179466
1293.3F24299736R57794Q55942M19846J46980M16832l21617o38314r5825M36821O04134
1302.9F27082329L29666L29628j11122l53546m70581p94335q06389q18481j118164
1311.6F23269005j172104q7013O14547K83738l62358j61934J52015l19404J28936L02392
$$ y = [600755043, 600149612, 600572052, 601060829, 601069336, 601411591, 601373482, 600861206, 600219040, 599984360, 599448128, 598808975, 599034195, 599528999, 600316200, 600995979, 601528816, 601822624, 602008820, 602125740, 602175560, 602618446, 603166542, 604033966, 604836578, 605898666, 607138062, 608067703, 609194374, 609935303, 610377884, 610608521, 610621910, 611121101, 612302017, 613688011, 614758644, 616256523, 618031311, 618949776, 619345627, 619598045, 619840889, 620444260, 621146088, 621975822, 623120270, 624299736, 625257530, 626113472, 626533318, 626680298, 627097130, 626775513, 626137199, 626041374, 626478195, 627082329, 627411995, 627741623, 627630501, 627276955, 626806374, 626012039, 625205650, 624387169, 623269005, 622096901, 622009888, 622624435, 622908173, 622545815, 622383881, 622535896, 622216492, 622345428, 622647820]
1321.2F22647820M98847Q27904N27001O59332P14149N74494J72157j51367m44298q91037
1330.9F25135002j132049n56031m8179l62206o5880J2017n989J3313o00929q2283P79419
1341.5F23086205R29908K43798J99928R60998Q34847Q21228P50542N33638L7040k41241
1351.1F28156891m97399m71687m81453j042213k47231M43268M47579K8457J12229r1553
1360.8F26356888j273728j370887j032334Q22144L08800o48156j02577m26369m6920
1369.4F22586861K20985j16310m41895r89036r68018K73590Q33168M19960M56810J72272
1379.1F22448387M88358L38516j019669j554412j319581q38165p09534m27360o64673
1387.8F16741867L43971O88858m59251j020622j726876j517181k289162k482147r02138
$$ y = [622647820, 623146667, 623974571, 624501572, 625160904, 625875053, 626449547, 626621704, 626470337, 626026039, 625135002, 624002953, 623446922, 623398743, 623036537, 622970657, 622982674, 622976685, 622989998, 622389069, 622306786, 623086205, 624016113, 624259911, 624459839, 625420837, 626255684, 627076912, 627827454, 628361092, 628398132, 628156891, 627659492, 627187805, 626706352, 625664139, 625416908, 625860176, 626307755, 626336212, 626448441, 626356888, 625083160, 623712273, 622679939, 623502083, 623810883, 623162727, 623060150, 622633781, 622586861, 622807846, 622691536, 622249641, 621260605, 620292587, 620566177, 621399345, 621819305, 622276115, 622448387, 622936745, 623275261, 622255592, 620701180, 619381599, 618543434, 617833900, 617406540, 616741867, 617085838, 617774696, 617315445, 616294823, 614567947, 613050766, 610761604, 608279457, 607377319]
1396.4F07377319r19685p59735k759895j119271J85509j383324j387672r91326k416229
1405.1E95825691k264137q21953j127548j305389r36203q95081r25255j165466j113053
1413.8E85271606j433792j265220j487122j068382n0125l269120J047097J891441K37274
1422.5E79873657m37202j454888Q47626Q15048R8687O24427j88446r9144O20957J463966
1432.1E82164688Q31299J087456K049942Q21380j395721O03752K898026J635856R68971
1440.8E91665649J250153R76906J834678P37992J306915J473198N96085L11889R61609
1449.5F01115074J826019P62063Q34503J089286J812516J646232K74048m54750l5210
1458.2F08869781L578797K090034K787400J826629J322213K281646m81224J464691
$$ y = [607377319, 606457634, 605697899, 602938004, 601818733, 602004242, 600620918, 599233246, 598241920, 595825691, 593561554, 592739601, 591612053, 590306664, 589370461, 588475380, 587550125, 586384659, 585271606, 583837814, 582572594, 581085472, 580017090, 579966965, 576697845, 577744942, 579636383, 579873657, 579436455, 577981567, 578829193, 579644241, 579742928, 580367355, 580178909, 580079765, 580700722, 582164688, 582995987, 584083443, 586133385, 586954765, 585559044, 586162796, 589060822, 590696678, 591665649, 592915802, 593892708, 595727386, 596465378, 597772293, 599245491, 599841576, 600153465, 601115074, 602941093, 603703156, 604537659, 605626945, 607439461, 609085693, 609359741, 608904991, 608869781, 612448578, 614538612, 617326012, 619152641, 620474854, 622756500, 622275276, 623739967]
1465.9F23739967K337914K781753K168847J466026K399483N70030n89142J030998M713555
1474.6F40619431L855743R02862K477570K508545J559067J215286N21011P24259J125259
1483.2F55509033Q84552P97425J194915J39313m806J232223j571579o94809J317444
1491.9F58803711P51114j14517m78287j785355n347824K208252O6757k442321N36422
1500.6F52197952n52368o19964n70603M10156K2126n658036o437111J696587K704697
1509.3F43193436L84674J912613n68390j713257O96793p75300q68988l853988j689148
1518F36718445L445206J999893l214608l469772K318459J798439J504860j173249k4109
1526.6F39903564j04484o54221J311455R79767L66745Q4000k94648k555084J443863
$$ y = [623739967, 626077881, 628859634, 631028481, 632494507, 634893990, 635464020, 634874878, 635905876, 640619431, 644475174, 645378036, 647855606, 650364151, 651923218, 653138504, 653659515, 654383774, 655509033, 656393585, 657191010, 658385925, 658525238, 658520432, 659752655, 658181076, 657486267, 658803711, 659554825, 659440308, 658962021, 657176666, 651828842, 654037094, 654103851, 651661530, 652197952, 651645584, 651025620, 650455017, 650865173, 650887299, 645229263, 638792152, 640488739, 643193436, 643578110, 645490723, 644922333, 643209076, 643905869, 643130569, 642261581, 638407593, 636718445, 640163651, 642163544, 638948936, 635479164, 637797623, 639596062, 641100922, 639927673, 639903564, 639799080, 639144859, 640456314, 641436081, 641802826, 641886826, 641592178, 639037094, 640480957]
1535.3F40480957J057129m07562K7694n584182l046837M860420K173615r44634J506004
1544F40122604L82996j753235J982193N29327N69687p98034j348038K262344J207886
1552.7F43157730Q77915k905579L83377K775574N42297p663422j0104637P348290M173775
1561.4F38585320K517738J48315m61731k109375j433792J8997j467590j547203p062492
1570F27188187N15899K73247k026977j462975j468544j425781j1248627M56810r40781
1578.7F09860458l018150k637939l545227k398034l731193k051354l779335l356590
1586.4E85342636k935181m262695l020477m692345k630005l804283k198067k961692
1594.1E58837891l571091k018433m447250j884308l651657k437172l273201l067017
$$ y = [640480957, 641538086, 641130524, 641158218, 635574036, 632527199, 637387619, 639561234, 638616600, 640122604, 640505600, 638752365, 640734558, 641263885, 641833572, 641035538, 639687500, 641949844, 643157730, 644035645, 641130066, 641513443, 644289017, 644831314, 637167892, 627063255, 634411545, 638585320, 641103058, 641251373, 640789642, 638680267, 637246475, 637265472, 635797882, 634250679, 627188187, 627704086, 627977333, 625950356, 624487381, 623018837, 621593056, 610344429, 610801239, 609860458, 606842308, 604204369, 600659142, 598261108, 594529915, 592478561, 588699226, 585342636, 582407455, 578144760, 575124283, 570431938, 567801933, 563997650, 561799583, 558837891, 555266800, 553248367, 548801117, 546916809, 543265152, 540827980, 537554779, 534487762]
1601.9E34487762j526184l166237p32383k316017j084252l206863j575813j485787
1609.6E19394226l230324k52762k680969k67525j518135J67160j013946p021484K766342
1618.2E06342583l74451R39941j768417J39961o41517l116455J995010P9193J816101
1626.9E05411949j697082j0720K56920R079P91855m98924K200241M84352l081551n54657
1636.6E03311462L472939J823616J190071J734810j67389K001762K17362K081070K360611
1645.3E18026314n00107P52220q29620M300003J894607L414116K531891o205520l46451
1653.9E23037453M790001N431366J973877K628631J559754J826133K266007J904220
1661.6E45417442K170983N60989L782997K283325K341042K677002K507400J229554
$$ y = [534487762, 532961578, 529795341, 529062958, 526746941, 525662689, 522455826, 520880013, 519394226, 516163902, 515911140, 513230171, 512962646, 511444511, 511611671, 510597725, 503576241, 506342583, 505968132, 506908073, 505139656, 505279617, 504638100, 501521645, 503516655, 503595848, 505411949, 503714867, 503704147, 503961067, 503970146, 504762001, 504263077, 506463318, 506947670, 503866119, 503311462, 506784401, 508608017, 509798088, 511532898, 511365509, 513367271, 513584633, 515665703, 518026314, 517526207, 518278427, 517448807, 521748810, 523643417, 527057533, 529589424, 523383904, 523037453, 527827454, 533258820, 535232697, 537861328, 539421082, 541247215, 543513222, 545417442, 547588425, 548149414, 551932411, 554215736, 556556778, 559233780, 561741180, 562970734]
1669.4E62970734J101722M513970K027359L754959L577232J394806N41458L055344
1677.1E82937584M087524K444764K474594J015854L966789N183563Q57925k050476
1684.8F00918121M481087O438828K956581J734924L344841K833862L762970L525086
1692.5F29996300L822517M161873K892876l278656M603500N592575N086289J540908
1700.2F54418182m763565P683335N573959K842636J099472K051697J177750J962280
1707.9F72045746K981949J075210J116257K372818K694550K276763r94873Q34351M577942
1716.6F88980713R14459o628799L492202L294602J564636J122208P41882J309967K102356
1725.3F96894226J645050K20871L79715J246414j708832k32391L669281K935715k873612
$$ y = [562970734, 564072456, 568586426, 570613785, 574368744, 577945976, 579340782, 579882240, 582937584, 587025108, 589469872, 591944466, 592960320, 596927109, 602110672, 602968597, 600918121, 605399208, 611838036, 614794617, 616529541, 619874382, 622708244, 626471214, 629996300, 633818817, 637980690, 640873566, 637594910, 642198410, 647790985, 652877274, 654418182, 649654617, 657337952, 662911911, 665754547, 666854019, 668905716, 670083466, 672045746, 675027695, 676102905, 677219162, 679591980, 682286530, 684563293, 683568420, 684402771, 688980713, 689895172, 683266373, 686758575, 690053177, 691617813, 692740021, 693481903, 694791870, 696894226, 698539276, 698760147, 699139862, 700386276, 698677444, 698445053, 702114334, 705050049, 702176437]
1734G02176437l956298N449523L940812J825027K441712o30036j435394L599548K173767
1742.7G15585098K57035K058410L533783K791748K326203J826553L97263L125000l7842
1751.3G31863251Q86841N023269K923584K699204K488403j06583J882553K405243K105790
1760G52171555K742157j631241l45612L244629K072296J848145K204742J408234k138596
1768.7G61576309K036591L387451j055298k589950n14145M009246J740647o027K549591
1777.4G71134415P38678J319503M55018j021119J274567J684647R14077j004409N41458
1786G76036835J790771R30786N97306J275406M19082n26962k103882M75540L485031
1794.7G82379913N27191o45523J350022J741791L69186n37109J897049j92490J76010
$$ y = [702176437, 698220139, 703669662, 707610474, 709435501, 711877213, 711247177, 709811783, 713411331, 715585098, 715842133, 717900543, 721434326, 724226074, 726552277, 728378830, 728776093, 731901093, 731863251, 732750092, 737773361, 740696945, 743396149, 745884552, 745777969, 747660522, 750065765, 752171555, 754913712, 753282471, 752936859, 756181488, 758253784, 760101929, 762306671, 763714905, 761576309, 763612900, 767000351, 765945053, 763355103, 762840958, 766850204, 768590851, 768584824, 771134415, 771873093, 773192596, 773647614, 772626495, 773901062, 775585709, 776499786, 775495377, 776036835, 777827606, 778758392, 779355698, 780631104, 781050186, 780523224, 778419342, 778894882, 782379913, 782907104, 782261581, 783611603, 785353394, 785722580, 785185471, 787082520, 786890030, 787066040]
1803.4G87066040Q78830o8283O85806K58942M19159J289673J389923q33054N15823
1812.1G91602859J484375L06016J44729o27670N41916j94016M56619J358262N00946
1820.8G95574036J277160k5558O21109Q6441l035736N92193J891404J309967m52271
1829.4G97838745k737579J424179K550659O81000M98581P4310j99966j76621o48498
1838.1G99304810R08737O34460O31561K42692J547470P65304n630417K047882K035904
1846.8H02488403l82538k94265O42090J060638K07748Q62427K9450K21023R0637j79672
1856.4H04745941K99149m72794K63062j15815L14560L74833M45175P03888J23062M73861
1866.1H07154922q36563n12237j250534p90634J490783J403961J276551O6376k19574
$$ y = [787066040, 787944870, 787876587, 788562393, 788821335, 789240494, 790530167, 791920090, 791087036, 791602859, 793087234, 793393250, 793537979, 792910309, 793452225, 793258209, 793714828, 795073090, 795574036, 796851196, 796825638, 797446747, 797533188, 794497452, 795089645, 796981049, 798291016, 797838745, 795101166, 796525345, 799076004, 799757004, 800255585, 800329895, 800129929, 799953308, 799304810, 800213547, 800848007, 801479568, 801722260, 803269730, 804035034, 798404617, 800452499, 802488403, 802105865, 801811600, 802453690, 803514328, 803722076, 804584503, 804613953, 804834976, 804925613, 804745941, 805045090, 804572296, 804835358, 804719543, 805034103, 805408936, 805854111, 806557999, 806681061, 807154922, 806318359, 805806122, 804555588, 803764954, 805255737, 806659698, 807936249, 808002625, 807783051]
1874.8H07783051j68763L69263N7678m62417j86234l967Q05588l9978Q9569K441J93405
1885.4H08439636O89850L7155Q56934n27420j664810K64968N18876J45416M51279j60904
1895H09050980p01065J069259O20270N75256O2790p28836l2348k00730J88370k42081
1904.7H09661865K89002M92019K04163N49698k57950o19736j26953P46155m39682n93262
1914.3H09905319k23160N41306J646805j467743j98822J250686L18070M1809j824722
1923H09989548q86612R32236P09609n3405M96978M02909M4632L03421j6861k10114
1932.6H11712341r33914n97381l12729O33926P34711J64413O65436k22321N29023r87320
1942.3H11386185k543335N90515L99551k05917J97830Q52738M97512L95279l7460m23431
$$ y = [807783051, 807614288, 807983551, 808041229, 807578812, 807392578, 807388611, 808194199, 808154221, 808243790, 808246231, 808439636, 809129486, 809166641, 810023575, 809496155, 807831345, 808096313, 808615189, 808760605, 809211884, 809050980, 808349915, 809419174, 810039444, 810614700, 810677490, 809948654, 809916306, 809715576, 809903946, 809661865, 809950867, 810442886, 810647049, 811196747, 810938797, 810319061, 810192108, 810938263, 810498581, 809905319, 809682159, 810223465, 811870270, 810402527, 810203705, 811454391, 811772461, 811814270, 809989548, 809102936, 810035172, 810744781, 810691376, 811188354, 811591263, 811635895, 811939316, 811922455, 811712341, 810778427, 810181046, 809868317, 810502243, 811236954, 811401367, 812066803, 811844482, 812373505, 811386185, 808842850, 809433365, 809832916, 809626999, 809824829, 810677567, 811175079, 811570358, 811532898, 811109467]
1951.9H11109467l7690n83038m38538n15060J92413L80249K96326Q74939k3270j63269
1961.6H11092529j35727q6288m08020n49622m85992o95648O15387Q78067P93914L20511
1971.2H11339111j20010l23181n71060l23334o35910l78266J40686O40259N95398L27149
1980.8H10690842Q0108l21731l54309o14701j44958j62048j1750n4016j15051P57980
1990.5H09750366l11355r49326K04773N80902k27356m51965N1498p8506L72848J52588
2000.1H09094467K13165l738m38309j59912l72085l42636m51737N4932J87530J85700
2009.8H07967377J44500l81546N0965J05591j06812m42886n34973m78821l3264L99246
2019.4H06689377L22800L51409l70636j89437q0185j66779j61819k81144P8125k93274
$$ y = [811109467, 811071777, 810488739, 810050201, 809535141, 809727554, 810107803, 810404129, 811279068, 811255798, 811092529, 810956802, 810870514, 810462494, 809912872, 809426880, 808731232, 809346619, 810224686, 811018600, 811339111, 811219101, 810895920, 810324860, 810001526, 809365616, 808987350, 809128036, 809768295, 810363693, 810690842, 810770950, 810449219, 810094910, 809480209, 809335251, 809173203, 809161453, 809107437, 808992386, 809750366, 809439011, 808489685, 808694458, 809275360, 809048004, 808596039, 808647537, 808569031, 808941879, 809094467, 809307632, 809303894, 808865585, 808705673, 808333588, 807990952, 807539215, 807594147, 807781677, 807967377, 808111877, 807730331, 807781296, 807886887, 807780075, 807337189, 806802216, 806323395, 806290131, 806689377, 807012177, 807363586, 806992950, 806803513, 806723328, 806556549, 806394730, 806113586, 806191711, 805898437]
2029.1H05898437J44883j15967j81503L3187m66079j05667l78647N9204L26614J97449
2038.7H05411911P1411j75018j43280k39639J01623n53436j92414p2326k17209M48685
2048.4H04440308M5318J56937k38266q7586k22778l30963K10037m97360k23007L1662
2058H03284302J90582o7368j28402K17438o1112L11203k09351q55331p30667J79138
2067.6H02130432N45197L83072O53533j84097k90832k02713l84522k85187j11312k47956
2077.3H02005615j33514O75506j0986k42538l5248J3962j67771p12585l4485P3242
2086.9H01431198Q4229K36129J07422o0425j4343P4692j49612N2032m13361l13644
2096.6H01034317l0746m8447L0136j6174J06048l25775K55737K01416l27453m73328
$$ y = [805898437, 806043320, 805927353, 805745850, 805779037, 805312958, 805207291, 804828644, 804887848, 805214462, 805411911, 805483322, 805308304, 805165024, 804925385, 805027008, 804473572, 804281158, 804208832, 803991623, 804440308, 804485626, 804642563, 804404297, 804316711, 804093933, 803762970, 803973007, 803475647, 803252640, 803284302, 803474884, 803407516, 803279114, 803496552, 803435440, 803746643, 803537292, 802681961, 801951294, 802130432, 802675629, 803058701, 803712234, 803528137, 803237305, 803034592, 802650070, 802364883, 802253571, 802005615, 801872101, 802547607, 802536621, 802294083, 802258835, 802272797, 802105026, 801392441, 801357956, 801431198, 801515427, 801751556, 801858978, 801798553, 801784210, 801858902, 801709290, 801761322, 801347961, 801034317, 801003571, 800955124, 800985260, 800969086, 801075134, 800749359, 801005096, 801206512, 800879059, 800405731]
2106.2H00405731n81360O3019k05078j0071K22321K31323k4948k62985j8769m61883
2115.9G99357300J2512m1428n9661J19247n8823K02942K9373J08033l58887j34125
2125.5G99176483k9678m15268M5013L24784M21981j26876j13068p0267K04773J16501
2135.1G99534378m54483l8528l77579o4621K04315r537J53K2583K93274m0817r8267
2145.8G98970871l07388K3651J25427j18637L10898J23367O5765R5597J07116l71017
2155.4G99025650m48837p2937K07901M03747r3612J90048o8894k65579L9902L06625
2165G99224014O64597k9450m26254n21240k5864O2943K34680M49982j39924K31553
2174.7G99725037j37253j51444O485q1024J29090j9074M41055J28861j39313r4452
$$ y = [800405731, 799824371, 799887390, 799682312, 799672241, 799894562, 800125885, 800100937, 799837952, 799819183, 799357300, 799369812, 799328384, 799268723, 799387970, 799329147, 799532089, 799561462, 799669495, 799310608, 799176483, 799146805, 798731537, 798776550, 799101334, 799523315, 799396439, 799283371, 799213104, 799417877, 799534378, 799079895, 799041367, 798663788, 798599167, 798803482, 798793945, 798794098, 798816681, 799109955, 799069138, 798970871, 798663483, 798687134, 798812561, 798693924, 799004822, 799128189, 799193954, 799289551, 799396667, 799025650, 798576813, 798503876, 798711777, 799115524, 799021912, 799211960, 799143066, 798877487, 798917389, 799224014, 799888611, 799859161, 799432907, 798911667, 798885803, 798948746, 799183426, 799633408, 799493484, 799725037, 799587784, 799436340, 799442825, 799361801, 799490891, 799471817, 799912872, 800041733, 799902420, 799807968]
2184.3G99807968K20184L0747n10101N9204P2097L38974K94037P3624o7673k59857
2194H00059204L3493r9258J1673j3886K98386N6381l38440Q6823K97699K97546j03836
2204.6H00585785J87302p8431k79083j57242n5618M03824m5014J66398Q4762P4463
2214.2H00887146K289k57797L8223l64075q9645q3618Q6975K14004L08762N10025k83661
2224.8H00968628k32925j76239L3950M6234M7303n4627l10592K03247j00403K12478
2234.5H00637054Q5068k94647j26114q1329J53122q2932M25644K55509P9803K5330
2244.1H01076508l27454l04642l56064M49753R6359k75650j40762r766J60294k670
2253.8H00365906J63116m95758j50146J07803j05438m6234k63214J6021J15967M93851
$$ y = [799807968, 800028152, 800058899, 799548798, 799608002, 799680099, 800019073, 800313110, 800386734, 800319061, 800059204, 800092697, 799993439, 800005112, 799991226, 800289612, 800345993, 800007553, 800094376, 800392075, 800689621, 800585785, 800773087, 800694656, 800415573, 800258331, 800202713, 800606537, 800561523, 800727921, 800812683, 800887146, 800889435, 800631638, 800669861, 800305786, 800216141, 800132523, 800219498, 800433502, 800742264, 801252289, 800968628, 800735703, 800559464, 800593414, 800639648, 800686951, 800632324, 800321732, 800524979, 800424576, 800637054, 800722122, 800427475, 800301361, 800220032, 800373154, 800290222, 800715866, 800971375, 801051178, 801076508, 800749054, 800444412, 800088348, 800538101, 800634460, 800358810, 800218048, 800208282, 800368576, 800365906, 800529022, 800033264, 799883118, 799990921, 799885483, 799839249, 799576035, 799592056, 799708023, 800201874]
2263.4H00201874j77841l49503J66626J35040O7063k42691Q7509k35443R3994J73797
2273G99920425M7303K73819p2098r3994r40628j54496M96827J34887J5183J5335L84903
2283.7H00027466j92871R9258n54657m10766P4310o09512j82953k90146L80783k94495
2293.3G98046417k48718Q7585n77926k64893j090851p5225n4322j13907k6397o69022
2302.9G95012741K39639l72238m24804j092301m82101j22300j270980m86756n03158
2311.6G90497742M62341R0790K594p45468j333008K81372j010437j286087j871491
2320.3G85088348j139526J38474j55030l55453j035004L75671l91845m25797j197204
2329G80902634j184388N646j107559L46985K99072Q32062o28204j661301k45590J86462
$$ y = [800201874, 800024033, 799674530, 799841156, 799976196, 800043259, 799800568, 799888077, 799652634, 799746628, 799920425, 799967728, 800241547, 800169449, 800075455, 799134827, 798980331, 799477158, 799612045, 799627228, 799642563, 800027466, 799834595, 799933853, 799379196, 798968430, 799042740, 798433228, 798250275, 797960129, 798340912, 798046417, 797797699, 797885284, 797307358, 797042465, 795951614, 795876389, 795822067, 795708160, 795681763, 795012741, 795252380, 794880142, 794455338, 793363037, 792880936, 792758636, 791487656, 791000900, 790497742, 790960083, 791050873, 791053467, 790307999, 788974991, 789256363, 788245926, 786959839, 785088348, 783948822, 784087296, 783932266, 783576813, 782541809, 782917480, 782525635, 782099838, 780902634, 779718246, 779723892, 778616333, 778963318, 779262390, 780094452, 779466248, 777804947, 777559357, 777745819]
2338.6G77745819N13764j265870L95356J42822k10037L51562J88217J873780K051315
2347.3G81786728K673416L61404j622695j278534k169876k293320j964569k142639
2355G73349915k450791j707687l27759j07117k8686J251526J287078o33697n38712
2363.7G70094070j5869P82700l05939J201172K698593J492768J876602R62677J585769
2372.4G80372543J410523P99255J040268J034851R87168K22549R19113J333923J613541
2381.1G89733734J056061M85763J044693M59366P1106k96631l4637J59225l6315K10647
2390.7G92853012N8441L28903K23160r3307r43985j019974r92M28162L65982k47727
2400.3G91951675J02463j55639l96500l357j4496n4321n62058p5454j87607l88870
$$ y = [777745819, 778259583, 776993713, 777389069, 777531891, 777321854, 777673416, 777861633, 779735413, 781786728, 784460144, 784821548, 783198853, 781920319, 779750443, 777457123, 775492554, 773349915, 770899124, 769191437, 768863678, 768756561, 768727875, 769979401, 771266479, 770632782, 770094070, 770078201, 770860901, 770554962, 771756134, 774454727, 775947495, 777824097, 778786774, 780372543, 781783066, 782582321, 783622589, 784657440, 785644608, 785867157, 786786270, 788120193, 789733734, 790789795, 791275558, 792320251, 792779617, 792850723, 792554092, 792519455, 792678680, 792642365, 792853012, 792911453, 793240356, 793463516, 793370209, 792426224, 791406250, 791405258, 791833420, 792199402, 791951675, 792054138, 791898499, 791501999, 791498642, 791484146, 791429825, 790867767, 790792313, 790604706, 790215836]
2410G90215836j71738j19629L41339J17111M5777l92990k31705k25678o57959k93502
2419.6G88626862k05536L52478K80609j145l59420n76859j69906j58997j14365l72085
2429.3G87301636n8365q6441j19171k29n06821k6474J86081j59073o44378n22614q1177
2439.9G85282974j60675O7139J07727M2648j11389l27682n08652j62964L4256j50909
2449.5G84112473o7749m90876l87649J26571J33744n27420k92817K34833n88608j54495
2459.2G82098007K08283n24445m97284q5907j81122j46026j31455o52618j36719K24152
2468.8G80174866M9209m77829n33523K42538m5013m93164o95267J99814O943p79038
2478.5G77649536K5330m9668k1286m05426n60074q6364n6839n04761p08923M63714
$$ y = [790215836, 790044098, 789924469, 790265808, 790382919, 790428696, 790035706, 789804001, 789578323, 788920364, 788626862, 788421326, 788773804, 789054413, 789053268, 788693848, 788116989, 787947083, 787788086, 787673721, 787301636, 787243271, 787156830, 787037659, 787037430, 786530609, 786504135, 786690216, 786531143, 785886765, 785364151, 785282974, 785122299, 785189438, 785297165, 785339813, 785228424, 784900742, 784392090, 784229126, 784263382, 784112473, 784044724, 783553848, 783166199, 783292770, 783426514, 782899094, 782606277, 782841110, 782252502, 782098007, 782306290, 781781845, 781284561, 781198654, 781017532, 780871506, 780740051, 780087433, 779950714, 780174866, 780224075, 779746246, 779212723, 779455261, 779410248, 778917084, 778221817, 778421631, 778428574, 777649536, 777674866, 777625198, 777603912, 777198486, 776638412, 776552048, 776495209, 775990448, 775281525, 775745239]
2488.1G75745239m8294m35028j27106l49655j72577o44226m78058l34625j67312l5172
2497.7G72953186J4496O4773j28173L280r24453p38221J2818o9504l70865o99158j54266
2508.3G69963913k17056j43814Q4304j9531l90243m48075j00326o32553m55857k10189
2518G67430573j21460N0506K93045K26441o29120m70200l03192q8730m71649q16803
2527.6G65099411m6082L7232O4468l4866K66495q6899o81152l19367o89163o87103
2537.3G62922974l42102K5482J95923P1029N3940l18909l85208k36511l91312o69937
2546.9G60925369o01577l52784K6017J74865J11008K2049j50299k17514o50559l53088
2556.6G58933487m96140o21719R8496j99128j0681N9357N0506R5139l55148n00794
$$ y = [775745239, 775696945, 775261917, 775134811, 774785156, 774612579, 773968353, 773490295, 773155670, 772988358, 772953186, 772967682, 773032455, 772904282, 772907562, 771983109, 771244888, 771257706, 771188202, 770817337, 770118179, 769963913, 769746857, 769603043, 769687347, 769667816, 769277573, 768829498, 768729172, 768096619, 767640762, 767430573, 767309113, 767359619, 767652664, 767879105, 767249985, 766779785, 766476593, 766387863, 765916214, 765099411, 765053329, 765090561, 765155029, 765120163, 765386658, 765299759, 764618607, 764299240, 763610077, 762922974, 762580872, 762606354, 762802277, 762873306, 762927246, 762608337, 762223129, 761986618, 761595306, 760925369, 760323792, 759971008, 759997025, 760171890, 760282898, 760304947, 760154648, 759937134, 759286575, 758933487, 758437347, 757815628, 757914124, 757714996, 757704315, 757763672, 757814178, 757909317, 757554169, 757053375]
2566.2G57053375q97598p58286m66918k05460m4403R1247K71759L80326K41394q95462
2575.9G54769974p15561k86637m11987j65634l42255j87606k7695J21002j91421j00403
2585.5G52461777J8310p42874o89621l44467j65939l83683j87835m9439j23749L43018
2595.1G50135498O1493l96271o15082l84979o63528o71997j24131l94363q39r9030
2604.8G46846771j09405K95257r1095k16369k82517m60739r88922q95386k18506Q7281
2614.4G43966370J88064Q3389q8348l70560m18090o57731p66601m71649k02408M8447
2624.1G41310883r6131l46374m5395J81808o75277r45511m18396k04392l14865m24957
2633.7G38021393Q9493p0267k51465m5242r2087k42081o10351n58930o04248o47278
$$ y = [757053375, 756155777, 755397491, 754930573, 754725113, 754680710, 754771957, 755043716, 755424042, 755665436, 754769974, 754054413, 753767776, 753355789, 753190155, 752847900, 752660294, 752632599, 752753601, 752562180, 752461777, 752480087, 751737213, 751047592, 750703125, 750537186, 750153503, 749965668, 749916229, 749792480, 750135498, 750196991, 749800720, 749185638, 748800659, 748137131, 747465134, 747341003, 746946640, 746945801, 746846771, 746737366, 747032623, 746941528, 746725159, 746442642, 745981903, 744992981, 744097595, 743879089, 743966370, 744154434, 744237823, 744149475, 743778915, 743360825, 742703094, 741936493, 741464844, 741262436, 741310883, 741214752, 740868378, 740822983, 741004791, 740329514, 739384003, 738965607, 738761215, 738446350, 738021393, 738110886, 738040619, 737789154, 737743912, 737651825, 737409744, 736799393, 736240463, 735636215, 734988937]
2643.4G34988937o86035l5782M45786r8267n188m67300p34787m29001l66592j23368
2653G32488403k38495o39495p36695J16959J82419k77329j30310k64053m02146l34320
2662.6G29764938j00937k50778k35672m10843l30047J43432k60315r4757j34582n58319
2672.3G27532120m51737l71933m37469j39313K27509m01841k64968J67465k00958m35868
2681.9G25223007k83050J7090k54746l46909m49142n88760m91791j45950J6632k43683
2691.6G22452698j5030j46027j68838m70734p21893k59171l94134r3766J89209p858
2701.2G20364456l55911l04947m0588l68882n04226n03235k82669m59976j77842M67987
2710.9G17834167J17798q8501N6229Q0185l98254n69001q47397o65588J3504j90658
$$ y = [734988937, 734302902, 734267120, 734712906, 734614639, 734609451, 734142151, 733407364, 732978363, 732611771, 732488403, 732249908, 731610413, 730873718, 730990677, 731173096, 730895767, 730765457, 730501404, 730099258, 729764938, 729664001, 729413223, 729177551, 728766708, 728436661, 728580093, 728319778, 728225021, 728090439, 727532120, 727080383, 726708450, 726270981, 726131668, 726359177, 725957336, 725692368, 725859833, 725658875, 725223007, 724939957, 724957047, 724702301, 724355392, 723906250, 723317490, 722825699, 722679749, 722696381, 722452698, 722437668, 722291641, 722122803, 721652069, 720930176, 720671005, 720276871, 720183105, 720372314, 720364456, 720008545, 719703598, 719663010, 719294128, 718789902, 718286667, 718003998, 717544022, 717366180, 717834167, 717951965, 717863464, 717919693, 717999878, 717601624, 717032623, 716185226, 715519638, 715533142, 715342484]
2720.5G15342484J95388j66702n81360J46713L86200J4191m91104m75006p70188m18090
2730.2G13182526r6817m40216J08261K63443k1668j53961J8539k49633o53611p5225
2739.8G11881638J65252k41241n40467k84042N7984J56707J74179L05252K13623m80422
2749.4G11408463q98591p22045l00141k47955O86K64588N6457k26898k74048K19498
2759.1G09280014k77252m67377J7471n07431o56204j00708P4158m17252M8600L36532
2768.7G07330551m82941o38885l35846R8267l29285o04019k8839J45263M4785k60849
2778.4G04938202m14276l26615l51410p55386n40924q8043k37351k86254M7454N10559
2788G02495956j67999n67398k97394m68216n67169n43976j63803k87323k32391j08948
$$ y = [715342484, 715537872, 715371170, 714789810, 714936523, 715322723, 715336914, 714845810, 714370804, 713600616, 713182526, 713085709, 712645493, 712753754, 713017197, 712995529, 712841568, 712860107, 712610474, 711956863, 711881638, 712046890, 711805649, 711265182, 710981140, 711039124, 711195831, 711370010, 711675262, 711888885, 711408463, 710509872, 709787827, 709487686, 709239731, 709240417, 709505005, 709561462, 709334564, 709060516, 709280014, 709002762, 708535385, 708552856, 708045425, 707389221, 707288513, 707362671, 706945419, 706994019, 707330551, 706847610, 706208725, 705872879, 705971146, 705641861, 705037842, 705009003, 705154266, 705199051, 704938202, 704523926, 704197311, 703845901, 703090515, 702549591, 702461548, 702224197, 701937943, 701985397, 702495956, 702327957, 701760559, 701463165, 700994949, 700427780, 699883804, 699720001, 699432678, 699200287, 699091339]
2797.7F99091339n34668n95245n51224n28793n74265j11847l60412j118012q46634
2806.3F93870239l13492O8589M2267q6442p56454o73676l5018o60706r16824p75147
2816F89763336n81207n66025m69971J4496n0583l60183p50962q01010p73544r32007
2825.6F84492340q57239n16586k45361l56827m95148p41730o57806o22024j008912
2834.3F78990707q04824n72663q41369q61206j208725j479950o33927n33294j191559
2843F70863190j544571j557694j623535k023239j849365j672440j259765j274033j281357
2851.7F56777191n42450p73544p30438m09241L4943K05688n875J57776l00750j79444
2861.3F54233856J74256L81240O4393r02863p41653l09449m49218p15027m91791o82449
$$ y = [699091339, 698556671, 697961426, 697410202, 696881409, 696307144, 696195297, 695834885, 694716873, 693870239, 693556747, 693625336, 693667603, 693581161, 692824707, 692151031, 692116013, 691455307, 690538483, 689763336, 689182129, 688616104, 688146133, 688160629, 688110046, 687749863, 686998901, 686197891, 685424347, 684492340, 683635101, 683118515, 682873154, 682516327, 682021179, 681279449, 680621643, 679999619, 678990707, 678185883, 677613220, 676771851, 675910645, 674701920, 673221970, 672588043, 672054749, 670863190, 669318619, 667760925, 666137390, 664114151, 662264786, 660592346, 659332581, 658058548, 656777191, 656234741, 655461197, 654730759, 654321518, 654356461, 654562149, 654556274, 654714050, 654413300, 654233856, 654408112, 654789352, 654853745, 653950882, 653209229, 652899780, 652450562, 651735535, 651243744, 650561295]
2870.9F50561295n42298K29263n5160l96500o33773o54068n02243l36686n00259p23801
2880.6F46445770l50494m01993l69644m17328o7825q2398r89074j152878j228714r32541
2890.2F40452881q80127q11958n82390n48058k36587p44019o22864R232k04887p86171
2899.9F35045052j054497j081658r12971j23520j85966n27649n22881p04918q68873
2908.6F29062119q28209q46024j300621j011238q30422j009292j135521j338615j008683
2917.2F19753494m82330n04799j431160j363945q93021o31256m79545p31926L8223
2925.9F13273735L93105L22647K24762M25491M17213j1253M70429J41334J70822M13056
2935.6F16241341J92871N49011J042557J307983N25017L75175O15349M31671L19710
$$ y = [650561295, 650018997, 650248260, 650193100, 649796600, 649162827, 648508759, 648006516, 647669830, 647169571, 646445770, 646095276, 645693283, 645323639, 644906311, 644838486, 644756088, 643767014, 642614136, 641385422, 640452881, 639572754, 638760796, 638178406, 637630348, 637393761, 636649742, 636026878, 636036110, 635831223, 635045052, 633990555, 632908897, 631995926, 631872406, 631686440, 631158791, 630635910, 629930992, 629062119, 628233910, 627387886, 626087265, 625076027, 624245605, 623236313, 622100792, 620762177, 619753494, 619271164, 618766365, 617335205, 615971260, 615078239, 614446983, 613967438, 613235512, 613273735, 613666840, 613989487, 614214249, 614639740, 615056953, 615045700, 615516129, 615657463, 615828285, 616241341, 616434212, 616983223, 618025780, 619333763, 619858780, 620233955, 620849304, 621280975, 621600685]
2944.2F21600685L93257K86217N341P97996N53742J79672M74090K72179K7504n09338
2953.9F24081345k57035n7411O26335R11789J22833K64702K41547L86124N49888J54457
2963.5F27024574j65519J75132L08380L89290J023598P36046N98411N58548O06423
2972.2F31254883M99611K38304O36558M30413L95927M80461P14073L16773j02196N57709
2981.8F35422516N51453N02929n2986j42708K52037M769r7771K09274O32019k68593
2991.5F37012939j72767M0932o18897L5591p0534m85153k71339k91214k96326L2387
3001.1F34915619j79901j27907J84021q01201n24712J47629o92444j013908j15547
3009.8F31791649P171l75175q6822n77202m09394k61306l32680j88408p66792n90630
$$ y = [621600685, 621993942, 622280159, 622285500, 623083496, 623637238, 623816910, 624291000, 624563179, 624590683, 624081345, 623824310, 623766899, 624393234, 625305023, 625427856, 625692558, 625934105, 626320229, 626870117, 627024574, 626859055, 627034187, 627342567, 627731857, 628755455, 629491501, 630089912, 630648460, 631254883, 631754494, 631992798, 632629356, 633059769, 633455696, 633936157, 634650230, 634967003, 634864807, 635422516, 635973969, 636476898, 636423912, 636281204, 636533241, 636538010, 636440239, 636649513, 637281532, 637012939, 636840172, 636881104, 636262207, 636297798, 636227264, 635742111, 635470772, 635179558, 634883232, 634915619, 634735718, 634607811, 634791832, 633990631, 633465919, 633613548, 632921104, 631907196, 631791649, 631798820, 631423645, 631336823, 630759621, 630350227, 630088921, 629756241, 629567833, 628801041, 628210411]
3019.5F28210411o15578l34320j87759n05295l65410m64477k96669l67012n37033r96819
3029.1F23540039n32265k50282r77554k41318r4109n87883r79347l98712L1433p92503
3038.7F18717499m93889n43976p52106n69000l62739j70021n19219o08559o61201m94804
3048.4F13541985o96259r29260p36161o07261k90833k29149k85873l87459o03828q24585
3058F07951317n61867o07567q34656l41110l21502q25272r95331N7755K03170q24928
3067.7F02900009p53593n76821o73866o29921k82707p12433o80771L27797j2436o06994
3077.3E98298264p38450l23295j60446p29256q48618n04150n10101p80411l42140j42708
3087E93218689k06032l61481l99436n63050q67081n33103r91440o83975k27738m27093
$$ y = [628210411, 627594833, 627260513, 627072754, 626567459, 626202049, 625737572, 625440903, 625073891, 624536858, 623540039, 623007774, 622757492, 621779938, 621538620, 621444511, 620856628, 619877281, 619478569, 619510002, 618717499, 618223610, 617679634, 616927528, 616358528, 615995789, 615825768, 615306549, 614697990, 614036789, 613541985, 612845726, 611916466, 611180305, 610573044, 610282211, 610053062, 609767189, 609379730, 608775902, 607951317, 607389450, 606781883, 605947227, 605606117, 605284615, 604459343, 603464012, 603521767, 603724937, 602900009, 602146416, 601569595, 600895729, 600265808, 599983101, 599270668, 598589897, 598917694, 598905258, 598298264, 597559814, 597236519, 597076073, 596346817, 595498199, 594994049, 594483948, 593703537, 593361397, 593218689, 593012657, 592651176, 592251740, 591688690, 590821609, 590288506, 589297066, 588613091, 588385353, 587958260]
3096.6E87958260n6076k05346l33709q85125q32901o86073q24852j57928l05443l15743
3106.2E83355064k94113n59349m36477l47710p63436q47358j00594k50740q21190j068268
3115.9E77865829o05239l76473l89938n7602m53873o85081j223412r54895j46217k17819
3125.5E72755280l47939q51059o39305k62642m33083q11157p19070m26407q15392q35151
3135.2E66614075p86057p06138p92084m95835m15191n15976P0572o11649q67576l30582
3144.8E61163559j18179n87654j272355p35359n36194m28466m25454m17823n16892
3153.5E56125183q31566n01899q09327o78711n05447j022453r03168l79982k66609
3162.2E50226021n91126p65381q79287m29268l33061m64440k68097m37431p41158j040802
$$ y = [587958260, 587902184, 587696838, 587363129, 586478004, 585645103, 584959030, 584134178, 583976250, 583670807, 583355064, 583060951, 582501602, 582065125, 581717415, 580953979, 580106621, 580006027, 579755287, 578934097, 577865829, 577260590, 576884117, 576494179, 576436577, 575982704, 575297623, 574074211, 573119316, 572973099, 572755280, 572407341, 571556282, 570916977, 570654335, 570221252, 569410095, 568691025, 568264618, 567449226, 566614075, 565828018, 565121880, 564329796, 563833961, 563418770, 562902794, 562973366, 562361717, 561494141, 561163559, 561045380, 560457726, 559185371, 558450012, 557913818, 557485352, 557059898, 556642075, 556125183, 555293617, 554791718, 553982391, 553303680, 552798233, 551775780, 550872612, 550492630, 550226021, 549634895, 548869514, 547990227, 547560959, 547227898, 546763458, 546495361, 546057930, 545316772, 544275970]
3171.8E44275970m76112l37181p03812p83615o28471k85530o43654m51546o39953j321373
3181.5E38004723j138001l98178R995k99187k91748q26493p87811l63808q55445p90520
3191.1E32263527o27899p72095q07571l49274k79999m61464n55191p56416l51830n89714
3200.8E26712074j162033q86917j53084o65588j163025k42996q2817k53716o40449
3209.4E21461449r18656q32939o45447l96766p92542o02798l31269j11999j13754o63872
3219.1E16051407r98917q84666m28810m74053o39190r84498m89616j64451o31295k23961
3228.7E10131950n85174m40750m51775j168060n21813m15001q14132m31748j25656
3237.4E05177841l03192m29726q40149m69207m48952j104813n9127P9574m72603l56636
$$ y = [544275970, 543799858, 543462677, 542758865, 541975250, 541346779, 541061249, 540417595, 539966049, 539326096, 538004723, 536866722, 536468544, 536478539, 536179352, 535887604, 535061111, 534273300, 533909492, 533054047, 532263527, 531635628, 530863533, 530055962, 529706688, 529426689, 528965225, 528410034, 527653618, 527301788, 526712074, 525550041, 524663124, 524510040, 523844452, 522681427, 522438431, 522355614, 522101898, 521461449, 520542793, 519709854, 519064407, 518667641, 517875099, 517272301, 516941032, 516829033, 516715279, 516051407, 515052490, 514167824, 513739014, 513264961, 512625771, 511641273, 511151657, 510987206, 510355911, 510131950, 509546776, 509106026, 508654251, 507486191, 506964378, 506549377, 505735245, 505303497, 505177841, 504874649, 504444923, 503604774, 503135567, 502686615, 501581802, 501522675, 501602249, 501129646, 500773010]
3247E00773010l27720n31464o77338n44662j352463p36198K00233l03230m66919l86810
3256.7D95646439k62413m41323k58598m54903n47828n84145p18193l71437p27654j60064
3266.3D91119881J01585k87285k86636k10724l27492o49109m234n42755n56221m52232
3276D87904778j067429l53050n70221j53351j48277o32782j81427j35346j05972o81686
3285.6D83875237m93737j29356j36681j39084l77655l66325n70221k16103j73149l53737
3295.3D80919189m03976n18684p17621r41353m29535l02505j58730o25343p50046K25067
3304.9D76296463j83792n04837k28577o20498j236458o80580L46756q278j162148p10907
3314.6D71307144N65300j99394j065102j333389o59447J21384m55933L2730l48091
$$ y = [500773010, 500445290, 499913826, 499236488, 498691826, 497339363, 496603165, 496803398, 496500168, 496033249, 495646439, 495384026, 494942703, 494684105, 494229202, 493681374, 493097229, 492379036, 492007599, 491279945, 491119881, 491221466, 490934181, 490647545, 490436821, 490109329, 489460220, 489455986, 488913231, 488357010, 487904778, 486837349, 486484299, 485914078, 485760727, 485612450, 484979668, 484798241, 484662895, 484556923, 483875237, 483381500, 483252144, 483115463, 482976379, 482598724, 482232399, 481662178, 481446075, 481272926, 480919189, 480515213, 479996529, 479278908, 478337555, 477908020, 477605515, 477446785, 476821442, 476071396, 476296463, 476112671, 475607834, 475379257, 474758759, 473522301, 472841721, 473188477, 473180199, 472018051, 471307144, 471872444, 471673050, 470607948, 469274559, 468615112, 468736496, 468280563, 468313293, 467965202]
3323.2D67965202j022834n91050n40542n90210j354981j427917m88663k0981m71573
3331.9D61456451n68695m94232p58591k91481n45043j088601j090278n83077j84440
3340.6D55852013q00286j155624r83887m39300m04854n91011l91884j50414k86293
3349.3D50648460p31544q62923j199112n26657j63765q93898r70573l70903M80499
3357.9D45409584j44348q94356q75587n09911m09431p73430j91536k58026n28145p80945
3367.6D40043869o11877l7232o53686o41671o92405o65894l26919n84679l83072j20773
3377.2D35325661l76282n22423M6539n12733j150246j19018L59459k43378m25301j08490
3386.9D32273788m64363l2882L22189k63062k32086p93533q98743l44238l23753k78588
$$ y = [467965202, 466942368, 466351318, 465810776, 465220566, 463865585, 462437668, 461949005, 461928024, 461456451, 460887756, 460393524, 459634933, 459343452, 458798409, 457709808, 456619530, 456036453, 455852013, 455051727, 453896103, 452912216, 452472916, 452068062, 451477051, 451085167, 450934753, 450648460, 449916916, 449053993, 447854881, 447328224, 447164459, 446270561, 445299988, 444929085, 445409584, 445265236, 444370880, 443495293, 442985382, 442575951, 441802521, 441610985, 441352959, 440824814, 440043869, 439431992, 439394760, 438741074, 438099403, 437406998, 436741104, 436414185, 435829506, 435446434, 435325661, 434949379, 434426956, 434473495, 433960762, 432810516, 432691498, 433050957, 432807579, 432382278, 432273788, 431809425, 431776543, 432098732, 431835670, 431603584, 430810051, 429911308, 429567070, 429243317, 428964729]
3396.5D28964729p2288J19667j59264j18294j93252n28107k01568n646m02947m72984
3406.2D26930046R7504L88946j99585p00454q5602J38473m0435K1286k80381j02653
3415.8D26167145l1128m03214k16941L37409j71394n12924M81186M45556K56157J35231
3425.5D26487083j57814M2191j45874q1596J90734M37546M30603L48053K90032j36338
3435.1D27704620J28975L57895K16637O981j18523M49257K72903P8698M99916J59988
3444.7D29757347P74880J071853l50723j07308N07393M45633K97165N01862J031570
3453.4D33929672L74680J00326J71051L61596J092147P02248K45628M33503O73484
3462.1D38084335L75862M15307J117897Q12301K53754L98636O31523J71890m7111P32154
$$ y = [428964729, 428892441, 429012108, 428852844, 428734550, 428541298, 428013191, 427811623, 427805977, 427403030, 426930046, 427027550, 427416496, 427216911, 426516457, 426430855, 426569328, 426528893, 426550179, 426269798, 426167145, 426136017, 425732803, 425515862, 425853271, 425681877, 425168953, 425650139, 426095695, 426351852, 426487083, 426329269, 426371460, 426225586, 426143990, 426334724, 426772270, 427202873, 427550926, 427840958, 427704620, 427833595, 428191490, 428408127, 428415108, 428296585, 428745842, 429018745, 429097443, 429597359, 429757347, 430532227, 431604080, 431253357, 431146049, 431653442, 432099075, 432396240, 432898102, 433929672, 434304352, 434404678, 434575729, 434937325, 436029472, 436731720, 436977348, 437410851, 438084335, 438460197, 438875504, 439993401, 440805702, 441059456, 441458092, 442089615, 442261505, 442214394, 442946548]
3471.7D42946548R89800N65414M41780M31557M54979P49397R36623J113625N75523
3480.4D49205246K05650M28658M40178J282577R13849L94058P61605J77650K96440
3489.1D54105911Q01239P45774R49783J602173J038208M92935Q80165j07803J04713
3497.8D60613098J184960P32879L87345Q67385N55573M28276J202202J154251J246300
3506.5D68372269P18116R15795M59823l28331J544228J003685N62935R68056O81076
3515.1D74897652Q75168M13017P76367J004448Q39538J014214J515999J075096l40843
3523.8D82070656L13568R17015J033287Q68683J431427J100960N18913J186714J091347
3532.5D90532570J209183Q26377J295929N33982j52474J892815J744308J084252K98691
$$ y = [442946548, 443936348, 444501762, 444943542, 445375099, 445830078, 446579475, 447516098, 448629723, 449205246, 449410896, 449839554, 450279732, 451562309, 452476158, 452870216, 453631821, 453809471, 454105911, 454907150, 455652924, 456602707, 458204880, 459243088, 459736023, 460616188, 460508385, 460613098, 461798058, 462530937, 462918282, 463785667, 464341240, 464769516, 465971718, 467125969, 468372269, 469090385, 470006180, 470466003, 470137672, 471681900, 472685585, 473248520, 474216576, 474897652, 475772820, 476185837, 476962204, 477966652, 478806190, 479820404, 481336403, 482411499, 482070656, 482384224, 483301239, 484334526, 485203209, 486634636, 487735596, 488254509, 489441223, 490532570, 491741753, 492568130, 493864059, 494398041, 494245567, 496138382, 497882690, 498966942, 499265633]
3541.2D99265633R85946J702118J168556J17798m76303J727677P74269J873550K160454
3549.9E09299698J304741J648369q33626J508827J520195J161614K082481Q06122J970787
3558.5E20469208J242294N09338O20957J886062J250039O68716L666496m7683N24864
3567.2E30790291N54466k37503L746948J742974J525993J423187J192169J651078J519355
3575.9E43908958J600571R18160K474556J302795Q68263J789170J231002J347542J383591
3584.6E56824608L563042J365852q16574R49173l30315L416138L986931L183784K22550
3593.2E72365189L73230L270416n82810J930886K723846R15604K921409J007195P19871
3601.9E85644836K160263K246666K695656L016548J094284j422691L479271O7673L61671
$$ y = [499265633, 500251579, 501953697, 503122253, 503240051, 502763748, 504491425, 505265694, 507139244, 509299698, 510604439, 512252808, 511419182, 512928009, 514448204, 515609818, 517692299, 518498421, 520469208, 521711502, 522220840, 522841797, 524727859, 525977898, 526646614, 530313110, 530265427, 530790291, 531344757, 531107254, 534854202, 536597176, 538123169, 539546356, 540738525, 542389603, 543908958, 545509529, 546427689, 548902245, 550205040, 551073303, 552862473, 554093475, 555441017, 556824608, 560387650, 561753502, 560936928, 561886101, 561555786, 564971924, 568958855, 572142639, 572365189, 572738419, 576008835, 575426025, 577356911, 580080757, 580996361, 583917770, 584924965, 585644836, 587805099, 590051765, 592747421, 595763969, 596858253, 595435562, 598914833, 598982506, 599344177]
3610.6E99344177O957321J186638j502990L410110q964M097480M163170O7177J783791
3619.3F19497910L08113J261253K991333K509613K045975K398910J724854K257423
3627F34995384N798836j946030p437744N804405N588951N096894J154098n13305L052902
3635.7F51594391L401947K057953N29327J916809K775727K346115J003494J462479
3643.4F67088242L086624L256073M556122j306992j719894N628509m96826k352982
3651.1F77738876J078568N212021L857040M029999L842773p059478L077774N713348
3658.8F97490921J408310N25284O33926K383118O56509J271515K004013J453552M495926
3667.5G12323074J987076j293640j068268m782181M114304P522202O851196l344498
$$ y = [599344177, 606301498, 607488136, 605985146, 609395256, 609386292, 613483772, 617646942, 617714119, 619497910, 619806023, 621067276, 624058609, 626568222, 628614197, 631013107, 632737961, 634995384, 640794220, 638848190, 631410446, 637214851, 642803802, 647900696, 649054794, 648541489, 651594391, 654996338, 657054291, 657583618, 659500427, 662276154, 664622269, 665625763, 667088242, 670174866, 673430939, 677987061, 676680069, 674960175, 680588684, 680091858, 677738876, 678817444, 684029465, 687886505, 691916504, 695759277, 688699799, 691777573, 697490921, 698899231, 699424515, 700058441, 702441559, 703098068, 704369583, 706373596, 707827148, 712323074, 714310150, 713016510, 711948242, 707166061, 711280365, 718802567, 725653763, 722309265]
3675.2G22309265j7364731N162354Q665619M838409j416931L36533K240676J281586
3682.9G26052780N69840p5379J259461M479141N236511q406525k178955O714249n996551
3691.6G27654572N72509M892655Q26263J408997k3499J16196J076126L75595K927246
3700.3G39826660K436524n523682j886978M763489J901550j8463N91202J938552K001725
3709G46030579n631485L739242K426148r605942M968338K966614l38059J122818J851807
3717.7G47530060J30310l016968J590347M520264l773651l017960M033661J16043m62417
3726.3G47649689k195130R73053L323365J32064M045411k827301m081040Q631668k119064
3735G53532715j1087952K287369M518280Q76007K150574K568741l451233K923050R268036
$$ y = [722309265, 704944534, 710106888, 718772507, 723610916, 722193985, 722530518, 724771194, 726052780, 726622620, 726547241, 727806702, 732285843, 737522354, 729115829, 726936874, 733651123, 727654572, 728227081, 733119736, 733945999, 735354996, 735331497, 735447693, 736523819, 736899414, 739826660, 742263184, 736739502, 734852524, 739616013, 741517563, 741499100, 742090302, 744028854, 746030579, 740399094, 744138336, 746564484, 736958542, 741926880, 744893494, 744555435, 745678253, 747530060, 747660370, 744643402, 746233749, 750754013, 746980362, 743962402, 747996063, 748112106, 747649689, 745454559, 746427612, 749750977, 749883041, 753928452, 751101151, 747020111, 755651779, 753532715, 742444763, 744732132, 749250412, 750126419, 752276993, 754845734, 751394501, 754317551, 763585587]
3743.7G63585587j0416108j2170333Q615341N289077N769272k821121q345108Q235931
3751.4G57742538q270263m804535O806717N072174K739181m726638K679290M454270
3759.1G61692734p823410q96225M125213J074219K03095K748870l223800l744736M320602
3767.8G58476562M561081j844711q086243K322083K771530N77774J059418n4016P05948
3776.5G60489426P02667K484894m30909n883178J616363J197815Q70590J027680l489151
3785.2G58586197p44629J961899J990127J041718j125107r86862k57034Q24432J53427
3793.8G61444168N36041J758805l835144k053070K830276L193893M263916p590789
3801.5G60548096q691483M779663L520737M166794L400421r229508k599029N095520
$$ y = [763585587, 753169479, 740999146, 749614487, 754903564, 760672836, 757851715, 749506607, 757742538, 749472275, 744667740, 751474457, 756546631, 759285812, 754559174, 757238464, 761692734, 753869324, 752973099, 757098312, 758172531, 758375626, 761124496, 757900696, 754155960, 758476562, 763037643, 761192932, 753106689, 755428772, 758200302, 758778076, 759837494, 759783478, 760489426, 761192093, 763676987, 763246078, 757362900, 758979263, 760177078, 761047668, 762075348, 758586197, 757841568, 759803467, 761793594, 762835312, 761710205, 760723343, 760466309, 761290741, 761444168, 761980209, 763739014, 759903870, 757850800, 760681076, 763874969, 768138885, 760548096, 751856613, 756636276, 760157013, 764323807, 767724228, 758494720, 755895691, 760991211]
3809.3G60991211K344894n8899l50189J85623J553803L761673l120804j0650024N723037
3817.9G60380325N260620K872315j83258j5163727K642288M775238J603928K415771
3825.7G64603500k35061m112625K09808K545776K946015m97055p345734L977280O083069
3834.3G68174973p035141N28183Q403320q474732l675079O309967n115814J123581
3842.1G60239258O478271k368087l216782K596664Q98056K59705J572571j861267Q60443
3850.7G65458832L383255n141449n9891j5525131N516205R582672j685486r75266L064957
3859.4G63618698L237915J466599n686951M72107M625549n792389l355789M093704
3867.1G62679443M691315L408585j0061722n927429N367660O037140J485825q437882
$$ y = [760991211, 763336105, 763277206, 762927017, 763112640, 764666443, 768428116, 765307312, 754657288, 760380325, 765640945, 768513260, 768330002, 753166275, 755808563, 760583801, 762187729, 764603500, 764368439, 760255814, 760465622, 763011398, 765957413, 765460358, 758114624, 762091904, 768174973, 761139832, 761668015, 770071335, 761596603, 757921524, 764231491, 759115677, 760239258, 766717529, 764349442, 761132660, 763729324, 764627380, 764887085, 766459656, 764598389, 765458832, 768842087, 763700638, 763640747, 748115616, 753631821, 763214493, 761529007, 760553741, 763618698, 766856613, 768323212, 762636261, 763108368, 767733917, 761941528, 758585739, 762679443, 767370758, 770779343, 760717621, 754790192, 760157852, 766194992, 767680817, 759242935]
3874.8G59242935K420960K992706o37817K135696L555679o315536o000748N831757
3882.6G63225632J043853J226731K190933j0910950L541642M029998P15638L054657
3890.3G68118134k164383o979676K167282K761078j352081J407166N65643J016846
3898G65540009K56881p047729N515136J398774l384400M260254l587417j991196J14822
3906.7G61075134J053925K164612K97622j44043o24160K41241r0408k78549J143569
3915.3G64838943J422577l094482k802506L156891l83224j770554K081147J096496
3923.1G64545288P65457k647171j848984K343369J084747J39008j141358N57328K188034
3931.7G65985718k820206j542816J305542L68576O67725j3504l97263m8599K02713
$$ y = [759242935, 761663895, 764656601, 764018784, 766154480, 769710159, 763394623, 757393875, 763225632, 764269485, 765496216, 767687149, 756776199, 760317841, 764347839, 765063477, 768118134, 765953751, 758974075, 761141357, 763902435, 762550354, 763957520, 764523163, 765540009, 765796890, 758749161, 764264297, 765663071, 762278671, 766538925, 762951508, 760960312, 761075134, 762129059, 764293671, 764591293, 764447250, 763823090, 764064331, 763973923, 763695374, 764838943, 766261520, 763167038, 760364532, 763521423, 763138199, 761367645, 763448792, 764545288, 765310745, 762663574, 760814590, 763157959, 764242706, 764381714, 763240356, 763797684, 765985718, 763165512, 761622696, 762928238, 763296814, 763964539, 763951035, 763553772, 763505173, 763707886]
3940.4G63707886J723556N12924l181915p65915R14307J060028M00772j724625P41578
3949.1G63388596q95081j884537K035904M22516J05896L52478j32675J00784o36215
3957.8G62857666L16849o12259J26419P33261j115723J86768N03159O6528J19705K28424
3967.4G63410797K78549l34930l281L57743n47104p74842O06156N14602o62002o09589
3977.1G62236099O67343P30820m68140j29547L67508L61252l75595n78537K12250J43432
3986.7G63166885Q5450k6017j99051m23278j3581M4785N3787L99323n77164J77002
3996.3G62688141O15616J35803M81644k64130
4000.2G63657074
$$ y = [763707886, 765431442, 765944366, 762762451, 761996536, 762910843, 763970871, 764371643, 762647018, 763388596, 762493515, 760608978, 762644882, 763067398, 763173294, 763525772, 763393097, 763493881, 762857666, 763174515, 762562256, 762688675, 763421936, 762306213, 762492981, 762996140, 763062668, 763182373, 763410797, 763689346, 763354416, 763351135, 763708878, 763161774, 762386932, 762993088, 763507690, 762845688, 762236099, 762903442, 763634262, 763166122, 763036575, 763404083, 763765335, 763389740, 762811203, 763023453, 763166885, 763252335, 763226318, 763027267, 762603989, 762590408, 762635193, 762688980, 763088303, 762511139, 762688141, 763303757, 763439560, 763921204, 763657074]
##END=$$ End of the data block
