##TITLE=$$ Begin of the data block
##JCAMP-DX=5.00 $$ ACD/SpecManager v 10.08
##SPECTROMETER/DATA SYSTEM=Varian
##DATE=08 Jan 2013 16:01:02
##DATA TYPE=INFRARED SPECTRUM
##DATA CLASS=XYDATA
##ORIGIN=
##OWNER=
##NPOINTS=3735
##FIRSTX=399.26403809
##LASTX=4000.35498047
##MAXX=4000.35498047
##MINX=399.26403809
##MAXY=81.36564636
##MINY=42.47391129
##XFACTOR=1.0000000000
##YFACTOR=0.000000100000000
##FIRSTY=58.86801910
##DELTAX=0.96440572
##XUNITS=1/CM
##YUNITS=TRANSMITTANCE
##XYDATA=(X++(Y..Y))
399.3E88680191R23958L603058O764869J1245614L38783k65312Q310470k92511q372917
407.9F10936203p648010r36585R769860L20739m819145K388306k465210k946129O90231
416.6F05290260q1711k452812j177177m45252Q11806m19k999459O824799M194031l692704
426.3F06271362P61910l008385r21059L79296k364083K327614n01060l278160r49211
434.9E98718224P02781Q50182K593841l81088l954201K443467L006210j140099k928962
443.6E99910355j816788K946281J319886K402916O93664q93822K440148l282967k677955
452.3F01041718K444534j448822K374687K185783o074752m092827P836189L894577
460F08161087r354820p144661N439186K394180J93176J70327J337967J253090l275261
$$ y = [588680191, 589604149, 593207207, 599972076, 611217690, 611556473, 611291161, 619601631, 619309120, 610936203, 603288193, 602351608, 612121468, 612442207, 607623062, 610011368, 607546158, 604600029, 605290260, 605208549, 602755737, 601578560, 601133308, 601945114, 601944695, 598945236, 605770035, 609964066, 606271362, 607033272, 604024887, 603103828, 603483124, 601119041, 603446655, 602945595, 599667435, 598718224, 599421005, 600271187, 602865028, 602483940, 598529739, 600973206, 603979416, 602839317, 599910355, 598093567, 601039848, 602359734, 604762650, 605456314, 604562492, 607002640, 603719673, 601041718, 603486252, 602037430, 604412117, 606597900, 600523148, 596430321, 604266510, 608161087, 598806267, 591661606, 597100792, 599494972, 599688148, 599858475, 601196442, 602449532, 599174271]
468.7E99174271j013108r10530j424827m628182m642296L519135L630485J246987l4867
477.4E94917068J095887L53546j743279k69088m96331k511177m138450k20223J954155
486.1E88942108L961601O043129L79067l188973j804771l411560l320809m87937q33130
494.7E86278725J60942L959541M780426L063126k076569k021675j124229l817864K780800
503.4E91983223J631737l210488j287040K148437K958183j096954k244148J119728
511.1E92002678k84157k982902k170906L9787K028656J836357Q507M81147Q45528n46532
520.8E91258163l011589l853912j55716J885185q42819j299820q0566M7531K359238
529.5E86305695K53028r43489J942025R54704k539444m377976r8609K624015m27818
$$ y = [599174271, 598161163, 597250633, 595825806, 591197624, 586555328, 590074463, 593704948, 594951935, 594917068, 596012955, 596366501, 594623222, 594354134, 593857803, 591346626, 587208176, 586987953, 588942108, 592903709, 598946838, 599325905, 596136932, 594332161, 590920601, 587599792, 587111855, 586278725, 586439667, 590399208, 595179634, 598242760, 596166191, 594144516, 593020287, 589202423, 591983223, 593614960, 590404472, 589117432, 591265869, 594224052, 593127098, 590882950, 592002678, 591718521, 588735619, 586564713, 586604500, 588633156, 590469513, 590478020, 590959167, 591804695, 591258163, 588246574, 584392662, 584236946, 586122131, 585279312, 583979492, 583898926, 583946457, 586305695, 586558723, 585615234, 587557259, 588511963, 585972519, 581594543, 581495934, 584119949, 583692131]
538.1E83692131Q1787J667481L45115m6310n0316k607803j825867p38449j661949M83932
547.8E79339752O44570J281318J684418l08647j603584j045113l35693j283074p72743
556.5E77601204j864319j36566K048836j50528k1210O7558Q58002N45158j104087j415139
566.1E76428909m11911J842690O05087J15166N51224K56462k28958l11280R08547j209107
575.8E78546829k597275m0664J491585O01882j36375J022530N07660J7013o09741n35851
585.4E78267593P74575k33231j245117m41437k61536m77066R70078J240959N2376l16811
595E78330383K01187R88007O16379j478462k749710n85900J618805J878319L27835
603.7E79146843q73413J58195O35338o11534k144394j226158j215210j520309R77935
$$ y = [583692131, 583773918, 585441399, 585786514, 585740204, 585689888, 583082085, 581256218, 580517769, 578855820, 579339752, 579984322, 581265640, 582950058, 582641411, 581037827, 579992714, 579657021, 578373947, 577601204, 575736885, 575600319, 577649155, 577498627, 577477417, 577544975, 578402977, 578948135, 577844048, 576428909, 576016998, 577859688, 578464775, 578579941, 579131165, 579387627, 579158669, 578847389, 579755936, 578546829, 575949554, 575908890, 577400475, 578002357, 577865982, 578888512, 579396172, 579413185, 578803444, 578267593, 579042168, 578808937, 577563820, 577122383, 576860847, 576383781, 577353859, 578594818, 578647194, 578330383, 578531570, 579519577, 580135956, 578657494, 575907784, 575321884, 576940689, 578819008, 579146843, 578273430, 578431625, 579066963, 578455429, 576311035, 575084877, 573869667, 572349358, 573327293]
612.4E73327293J137276k26974r4719O36291n26695p80983P25899J016845J261254
621.1E76475487K365j033020l90663K534752L283271R20334M18930j444778o28586
629.8E80138092O07948L89366K566987K519188J143569O01960J234359J691513J091500
638.4E91984482n81665j414414R42574J290016M88167Q24585J117592J318321O92825
647.1E96662483J58158j14022M36859K60430o45409M31748J073036Q69331J377335
655.8F00509949O76574l68156n04951j012688o49071p0419J79825P89451J068115J503067
665.4F02121696L70255m766960j2826729Q968582O164360J352349M730j14136L41454
674.1F01615601J238365Q78258J188583J066131P69806J498261R53560n85747j15929
$$ y = [573327293, 574464569, 574237595, 574142876, 574779167, 574252472, 573471489, 574197388, 575214233, 576475487, 576477852, 575444832, 575054169, 577588921, 580872192, 581792526, 582211456, 580766678, 580138092, 580746040, 581135406, 583702393, 586221581, 587365150, 587967110, 589201469, 590892982, 591984482, 591402817, 589988403, 590930977, 592220993, 592709160, 593533745, 594651337, 595969658, 596662483, 596820641, 596706619, 597143478, 597403908, 596758499, 597190247, 598263283, 599132614, 600509949, 601186523, 600818367, 600313416, 599300728, 598651657, 598581238, 598761063, 599550514, 600618629, 602121696, 602491951, 597724991, 584898262, 593866844, 600031204, 601383553, 601388283, 601274147, 601615601, 602853966, 603732224, 604920807, 605986938, 606756744, 608255005, 609208565, 608622818, 608506889]
682.8F08506889J521912J632652M69780R9869J120148R21707M79698J245689J791192
691.5F17789536J153221o33393n56221O52657Q34770P94754Q15697P05490Q1139L49769
701.1F21987419Q57735N00336N86662J080551K70081q44880K56577N84373J161080
709.8F26439934K483139Q69293k13509k89840M08516J100807J1139l04489l27683P80220
719.5F30957527J426468J563721J561508m98200r8152K71035J09252J220246P92923
728.1F37306328J407203J725922J085663R26437L23639m22439J60064J006928q34961
736.8F42684784n27725J598434K33612n2871J821289J028137J52435K9144l86047J236649
746.5F47817841O43463m6311J444855Q46481M24347N69458J324692P69043m00848K79922
$$ y = [608506889, 610028801, 611661453, 612131233, 612231102, 613351250, 614272957, 614752655, 615998344, 617789536, 618942757, 618309364, 617753143, 618405800, 619240570, 620035324, 620851021, 621556511, 621637650, 621987419, 622845154, 623345490, 623932152, 625012703, 625282784, 624437904, 624694481, 625278854, 626439934, 628923073, 629792366, 629578857, 629289017, 629697533, 630798340, 630809479, 630504990, 630177307, 630957527, 632383995, 633947716, 635509224, 635011024, 634912872, 635183907, 635293159, 636513405, 637306328, 638713531, 640439453, 641525116, 642451553, 642775192, 642352753, 642512817, 643519745, 642684784, 642157059, 643755493, 643989105, 643936234, 645757523, 646785660, 646938095, 646967239, 646581192, 647817841, 648461304, 648414993, 649859848, 650706329, 651130676, 651700134, 653024826, 653793869, 653393021, 653672943]
756.1F53672943r8877P13577J815567Q39920Q77381J876755R25979l94058J81198O23627
765.7F61034012p8812o93207K22550N15518R88159J667252R08813k54669j351166J64261
775.4F63122711j62353r50775O16455K50091N34821R27581L79715n31616K02103J144028
785F65532761m8371l46603k59400J181717R93042j59530J034469J094208m79965n96695
794.7F67945633J095657k15072q76541n60227p43561P64313K85568l14026j293640
803.4F66088104j600647l63159n92499j007690r50775j015244r49173j18408j292038
812F58198471k130737p35092L74221m92553k095414o06918J2818Q33969J178207j82495
821.7F54354477J090469K82822m24118J180115K465667K571412J737365K299423K036820
$$ y = [653672943, 653574066, 654287643, 656103210, 656943130, 657820511, 659697266, 660623245, 660229187, 660410385, 661034012, 660955200, 660261993, 660484543, 661000061, 661988220, 663655472, 664564285, 664309616, 662958450, 663122711, 662960358, 662009583, 662626038, 662876129, 663410950, 664338531, 664718246, 664186630, 664388733, 665532761, 665484390, 665137787, 664878387, 666060104, 667053146, 666893616, 667928085, 669022293, 668542328, 667945633, 669041290, 668826218, 667949677, 667389450, 666645889, 667410202, 667695770, 667381744, 666088104, 664487457, 664124298, 663531799, 662524109, 661573334, 660558090, 659608917, 659490509, 658198471, 656067734, 655332642, 655706863, 655214310, 653118896, 652511978, 652524796, 653358765, 654536972, 654354477, 655444946, 655727768, 655303650, 656483765, 658949432, 661520844, 663258209, 665557632, 667594452]
830.4F67594452J648178J225510J113891J965790K279282K260284K263489J978836
838.1F82329712K10419M98275J519089J176834J087494J232147P16935M7225J362229
846.8F90180359J516113J928024J189423m00925M84696Q44421J117859K09656J040192
855.4F98109818J987228K047272K055587N63507R86176L6316J28632L18222j95237
864.1G06037521L25165k63519P45849N50232j66397n63049l82004j022644k195587
872.8G03065567j127777q69141k12936l45307K28119r5214r16214R24758L02887q90960
882.4G00063782j576309m27704k5635j237946k79312L35617o2561j116714k97165q02078
892.1F94573975j327668L09601n94940j281967n14527J093598Q85086n42679j060104
$$ y = [667594452, 669242630, 670468140, 671582031, 673547821, 675827103, 678087387, 680350876, 682329712, 682540131, 683038406, 684557495, 685734329, 686821823, 688053970, 688770905, 688818130, 690180359, 691696472, 693624496, 694813919, 694412994, 694897690, 695742111, 696859970, 697069626, 698109818, 700097046, 702144318, 704199905, 704763412, 705749588, 705785904, 705914536, 706232758, 706037521, 706362686, 706099167, 706845016, 707395248, 707228851, 706665802, 706283798, 705261154, 703065567, 701937790, 701068649, 700855713, 700510406, 700738525, 700643311, 699727097, 700651855, 700954742, 700063782, 698487473, 698059769, 698034134, 696796188, 696516876, 696852493, 696789932, 695673218, 695376053, 694573975, 693246307, 693555908, 692960968, 691679001, 691164474, 692258072, 693143158, 692600479, 691540375]
900.8F91540375j354599q81882m67834N90896O86188R58633J748124J807937J770477
909.4F96398315N22232m7683N42831O12717r87396r42536n23758q26263j72959j176376
919.1F93399124j174316j355438j770173j406555j570358k165833k504959j044082
926.8F80407410j885224k589493j594314j433792j593323j807327q62732j079483j146698
935.5F66415024j221085j453171k35672l58734q16192j005173q30917q77381j065521
944.2F58551178q84628j179810r81369r23691n93414J01776N31616K96250o0120j12686
953.8F54745102q21076j037063j189880j664429k124176j256104r14917k043075j198426
962.5F42495956r81826j368256j175613j789322j705170j378593j372071j554565j546593
$$ y = [691540375, 690185776, 689303894, 688836060, 689426956, 690113144, 691071777, 692819901, 694627838, 696398315, 696920547, 696872864, 697415695, 698028412, 697041016, 696098480, 695574722, 694748459, 694575500, 693399124, 692224808, 690869370, 689099197, 687692642, 686122284, 683956451, 681451492, 680407410, 678522186, 675932693, 674338379, 672904587, 671311264, 669503937, 668641205, 667561722, 666415024, 665193939, 663740768, 663505096, 663146362, 662330170, 661324997, 660494080, 659616699, 658551178, 657666550, 656486740, 655505371, 654581680, 653988266, 654090042, 654621658, 654917908, 654857788, 654745102, 653924026, 652886963, 651697083, 650032654, 647908478, 646652374, 645737457, 643694382, 642495956, 641514130, 640145874, 638970261, 637180939, 635475769, 634097176, 632725105, 631170540, 629623947]
971.2F29623947j310730j868172k096138j657409k218552k737236k444305k400742
978.9F12890663k738495l017273k831573l306160l785858l462563k802811k525444
986.6E88420486l251228l566284l442574l171005k641640k379455k066765j385727
994.3E66515808j426544k006264k350654j829911j485519k311058j672783j656075
1002E51777000k395324j686783j626053k075767j954003j030846r77821j328735j763535
1010.7E36938133j964950j615143j595688j082420j479226j182365j430397k196197
1018.4E24391747j813393k292366j785545j281357q94280j420021j881637j348534
1026.1E11674614j303482j107178j555366p07245j048470j474037j079636j027031
$$ y = [629623947, 628313217, 626445045, 624348907, 622691498, 620472946, 617735710, 615291405, 612890663, 610152168, 607134895, 604303322, 600997162, 597211304, 593748741, 590945930, 588420486, 585169258, 581602974, 578160400, 574989395, 572347755, 569968300, 567901535, 566515808, 565089264, 563083000, 560732346, 558902435, 557416916, 555105858, 553433075, 551777000, 549381676, 547694893, 546068840, 543993073, 542039070, 541008224, 540030403, 538701668, 536938133, 534973183, 533358040, 531762352, 530679932, 529200706, 528018341, 526587944, 524391747, 522578354, 520285988, 518500443, 517219086, 516324806, 514904785, 513023148, 511674614, 510371132, 509263954, 507708588, 507001343, 505952873, 504478836, 503399200, 502372169]
1033.8E02372169L27378M24423P27959J075668J591339J362991J517792J043587j33476
1042.5E10309830J308441M65965J38664l50113r52606m45327j323433r07250j464538
1051.2E06779633j042176j651306k027206n39437l91197L12424o67076r07517k09388
1059.9D99656754J200561R85565J255074K602348J139221J825753J158371J445236
1067.6E11268883J922607J520004J697808K82249J267014K3308o27404M18663L00637
1076.3E18073769J67160k41204R15413R58748R34601j76621M17977R82933l37830O17028
1085.9E22311974K65388J097832O72760M05578K155037J826973J112404J026154J483841
1094.6E32357941l41988o73981N31578J369591J710854J158180J719742K90909K45056
$$ y = [502372169, 502699547, 503123970, 503851929, 504927597, 506518936, 507881927, 509399719, 510443306, 510309830, 511618271, 512084236, 512222900, 511872787, 510920181, 510474854, 509151421, 508244171, 506779633, 505737457, 504086151, 502058945, 501519508, 501128311, 501440735, 500773659, 499866142, 499656754, 500857315, 501842880, 503097954, 505700302, 506839523, 508665276, 509823647, 511268883, 513191490, 514711494, 516409302, 516691551, 517958565, 517981873, 517354469, 517773132, 518073769, 518240929, 517999725, 518915138, 519873886, 520808487, 520631866, 521049843, 522032776, 521694946, 522311974, 522577362, 523675194, 524347954, 524753532, 526908569, 528735542, 529847946, 530874100, 532357941, 532015953, 531341972, 531873550, 533243141, 534953995, 536112175, 537831917, 538122826, 538367882]
1103.3E38367882N74684O81267P45964p68357N09682M25911O5003O45446N97687R17130
1112.9E42762299P81555Q30192J53122L40081J33895L19939O69708k96096M88433N91469
1122.6E46774597M11682Q93097Q52661N8060q17375m2267J064644J926536K652359
1131.2E53773994K133637Q29163J373825J892547J208153J345367J787262J489792
1139E65833740O72798O69556J076431J495400J643562J411324Q36868m1122l29781
1147.6E73268776k94075q0109j49498m0245K07825M94385Q60634j37864q39500j229668
1157.3E72060661j207428n74493r45168o74705j6213N30816R75265O64864N94520J568909
1166.9E72977028K306404K079582J645813J264458J933021K300873L066635L405190
$$ y = [538367882, 538942566, 539623833, 540369797, 539601440, 540111122, 540537033, 540602036, 541247482, 541845169, 542762299, 543543854, 544374046, 544527168, 544867249, 545001144, 545321083, 545990791, 545694695, 546183128, 546774597, 547186279, 548079376, 548932037, 548990097, 548172722, 548130455, 549195099, 551121635, 553773994, 555907631, 556736794, 558110619, 560003166, 561211319, 562556686, 564343948, 565833740, 566506538, 567176094, 568252525, 569747925, 571391487, 572802811, 573639679, 573598557, 573268776, 572974701, 572894592, 572745094, 572704849, 572912674, 573407059, 574267693, 574129829, 573290329, 572060661, 570853233, 570278740, 569333572, 568658867, 568642654, 569173470, 570148735, 570813599, 571408119, 572977028, 575283432, 577363014, 579008827, 580273285, 582206306, 584507179, 587573814, 590979004]
1174.6E90979004K427521K421684K327499J840706J123200J145401J553459K435722
1182.4F06254196K504692J328163J408883J779556J907654J005859R36584Q51021L1624
1191F18008232M75235K88086J71547J36299M6578J3008j02654m35448p56225Q2092
1200.7F17926750l23868j092376j092873r08813k15912j81198k64969j09253M74548
1209.4F14212036P5188r07479n10330m71534o32477m70772k26326J07117Q4648l39432
1219F10920639m74167M616j90811n29862p24754r44633p78962n56717l25470k54325
1228.6F06145554o9123q5411k61955p37305r37156j61248l53317q82149m89273J50910
1238.3F02319527J88675R4223N17463N11055O4583q13713o80618l21236r01031n85671
$$ y = [590979004, 593406525, 595828209, 598155708, 599996414, 601119614, 602265015, 603818474, 606254196, 608758888, 610087051, 611495934, 613275490, 615183144, 616189003, 617125587, 617976608, 618008232, 618483467, 618771553, 618943100, 619079399, 619125977, 619138985, 619036331, 618600883, 617844658, 617926750, 617602882, 616510506, 615417633, 614508820, 614292908, 614111710, 613846741, 613737488, 614212036, 614287224, 613379745, 612869415, 612397881, 611765404, 611294632, 611068306, 611175423, 611260071, 610920639, 610446472, 610451088, 610260277, 609730415, 609005661, 608061028, 607282066, 606725349, 606399879, 606145554, 606076431, 605991020, 605729065, 604991760, 604054604, 603893356, 603540039, 602657890, 602168617, 602319527, 602508202, 602602425, 603119888, 603630943, 603695526, 602881813, 602201195, 601879959, 600978928, 600393257]
1247.9F00393257J52702N65033M99115J54610l05557J24016k4605j181412n29976l90472
1257.6E99456711l29094K59399L55759J126404Q94394M00314L92418L56140j58920
1266.3F02753525j86234K33650K39258J118546J284828P91283R01718J679458J430664
1274.9F10246696K9107J72424M10728M08860N86204O90880J247559J379852J629333
1283.6F16801643J591874R30862N27916M4289N20515J024895L48167Q32253J200790
1292.3F23823204R02519J292801J045151J73416l15208r3079O943K2201k8152J37062
1301.9F26966858N22537M42772O3858l22189j10550m62036p88384n10597o07567r76105
1311.6F24218597j343650m41323M72336M44794j28594k39181K89116j41259j64718
$$ y = [600393257, 600545959, 601110992, 601610107, 601764717, 601459160, 601583176, 601558571, 600377159, 599847183, 599456711, 599127617, 599387016, 599742775, 600869179, 601763573, 602163887, 602556305, 602912445, 602753525, 602567291, 602800941, 603040199, 604158745, 605443573, 606234856, 607136574, 608816032, 610246696, 610275803, 610448227, 610858955, 611267815, 611854019, 612544899, 613792458, 615172310, 616801643, 618393517, 619324379, 619852295, 619896584, 620417099, 621441994, 621790161, 622622414, 623823204, 624725723, 626018524, 627063675, 627237091, 626921883, 626828804, 626835747, 626857948, 626829796, 626966858, 627489395, 627932167, 627996025, 627673836, 627563286, 627101250, 626312866, 625802269, 625194702, 624218597, 622874947, 622433624, 622905960, 623350754, 623222160, 622982979, 623272095, 623130836, 622966118]
1320.3F22966118K63443N49126M89997L46222Q29201Q99429O19240J00060k20719o35223
1329.9F26206894r62982j080132p46345J3389J44310J3581l48664K74163L54690o18667
1339.6F23250237j47019J95274O13366L20167O32172J357155N78651N43251O01654
1348.2F27944908O38962K71492k61498p50465q36983m63371o13556K57988N40886M04396
1357.9F27132759j15929m65774k25296m63982r66873k015762N87616P05642m13818
1366.6F23758583K1896m01535R3346Q5068K136j09177j010704q76884k36855M90418
1376.2F21816292M77562N40046J15281p2861L98445j95465j300926j656952o99654
1384.9F19421768m45022l38097p92770l19977L03879n31083n39321j004181j077729
$$ y = [622966118, 623229561, 623778687, 624268684, 624614906, 625444107, 626343536, 626962776, 627062836, 626842117, 626206894, 625243912, 624163780, 623417435, 623430824, 623575134, 623588715, 623240051, 623514214, 623868904, 623250237, 623103218, 623298492, 623911858, 624232025, 624864197, 626221352, 626800003, 627343254, 627944908, 628583870, 628855362, 628593864, 627843399, 627006416, 626543045, 625929489, 626187477, 626728363, 627132759, 627016830, 626551056, 626325760, 625861778, 624894905, 622879143, 623466759, 624172401, 623758583, 623780479, 623378944, 623472290, 623557358, 623559494, 623450317, 622439613, 621562729, 621325874, 621816292, 622293854, 622833900, 622949181, 622876320, 623274765, 623079300, 621778374, 620121422, 619421768, 618976746, 618638649, 617845879, 617525902, 617829781, 617298698, 616759377, 615755196, 614677467]
1393.6F14677467k641258l582230o49375p64695p05337k152596j266708p0076j260757
1402.2F01584435j157494j467362l149223k050629n71823j178436j524963r96247r58252
1410.9E88530006o20079p84225r44748j060905j281701j534690j343308j90010k218781
1419.6E78551559M80729J321678R4223j73455j236991N53398N99670j44310O25649
1428.3E80672150N1727M7684N11512J477585J098290R88846J948433J085433r87091
1437E86894569O15540K433586J176872J156769J865006J138992J304779N06477J225815
1445.6E98318405J218224M80156N18036J419715J716042N82047J138572Q71048J393929
1454.3F07656174J249733K3193k52762m72641L817520K677040K965126J759148J374054
$$ y = [614677467, 612036209, 608453979, 607804604, 607039909, 606334572, 604181976, 602915268, 602845192, 601584435, 600426941, 598959579, 595810356, 593759727, 593187904, 592009468, 590484505, 589488258, 588530006, 587909927, 587125702, 586180954, 585120049, 583838348, 582303658, 580960350, 580770340, 578551559, 579032288, 580353966, 580448189, 580274734, 579037743, 579591141, 580190811, 580046501, 580672150, 580723877, 580771561, 581283073, 582760658, 583858948, 584847794, 586796227, 587881660, 586894569, 587510109, 589943695, 591120567, 592277336, 594142342, 595281334, 596586113, 597092590, 598318405, 599536629, 600016785, 600534821, 601954536, 603670578, 604252625, 605391197, 606262245, 607656174, 608905907, 608929100, 608676338, 608203697, 612021217, 614698257, 617663383, 619422531, 620796585]
1463F20796585K407494j81046J855927K419662K392082J708794J422577K092476k55280
1471.7F34659271j90506K616997M579964L250351R44214K594299K749023J854935R78928
1480.3F54037476L51104N99976J145935J099319R43451J277314j9150j40915R83200
1489F60277710j698914j68533J174622L69491o69479o64139p85141m343414J708755
1497.7F55200958L35388k563247K47345m57382p62558n63813L45154o74896o603394
1506.4F44503555n865135K768517L379593K70156J415024o39877j747589J63574j145935
1515.1F43101883l73993k502823j949043K677955J965790k033004l626252J156655
1522.8F38417168K567024J889725k683716j67160R91745l40653R73358P40967J60446
$$ y = [620796585, 623204079, 623023033, 624878960, 627298622, 629690704, 631399498, 632822075, 634914551, 634659271, 634468765, 637085762, 641665726, 644916077, 645860291, 648454590, 651203613, 653058548, 654037476, 654388580, 654988556, 656134491, 657233810, 658177261, 659454575, 659435425, 659294510, 660277710, 658578796, 658410263, 659584885, 659954376, 659284897, 658620758, 657835617, 653492203, 655200958, 655536346, 652973099, 653220444, 652763062, 652000504, 651436691, 651781845, 651106949, 644503555, 638638420, 641406937, 644786530, 645056686, 646471710, 645831833, 644084244, 644247818, 643101883, 642727890, 640225067, 638276024, 640953979, 642919769, 640886765, 637260513, 638417168, 640984192, 642873917, 640190201, 640023041, 641014786, 640674133, 641647491, 642388458, 642548904]
1531.5F42548904j09558j031341k231255J946297Q01239K88544J856918l867645m827271
1540.1F35374832L169212J464501p58019J431160Q16269j402664K000580M77676K96936
1548.8F42870483r95712j473617K292785J311798P78122k801361Q38165K868653P04422
1557.5F46393738q241692j0127945Q379898L565026K412109O2408p49130k100410j461640
1566.2F38132362j48162j511460j506309p136650O51779M07982j963654j234055j220817
1574.9F24471016j581383j1378174P49169j142807l446617l237610l804245j932640
1582.6E98696709l875580k205429l223572k914581k948761m666443l238487m832650
1590.3E70791206k568931l861313k450562k709884l507233j833343m034157j915322
$$ y = [642548904, 642439346, 641408005, 639176750, 641123047, 641924286, 642212830, 644069748, 640202103, 635374832, 638544044, 640008545, 639250526, 640681686, 641497955, 640095291, 642095871, 642573547, 642870483, 641874771, 640401154, 642693939, 644005737, 644783859, 641982498, 642820663, 645689316, 646393738, 638152046, 628024101, 636403999, 639969025, 642381134, 642443542, 641694412, 639594002, 638132362, 637984200, 636472740, 634966431, 627829781, 628481560, 628889542, 626925888, 625691833, 624471016, 622889633, 611511459, 612260628, 611117821, 607671204, 604433594, 600629349, 598696709, 594821129, 592615700, 589392128, 586477547, 583528786, 578862343, 575623856, 570791206, 568222275, 564360962, 561910400, 559200516, 555693283, 553859940, 549825783, 547910461]
1598E47910461l891029k690239l332176l205109j768417l430824o34766k056122j131592
1606.7E25770187l091659j663933j685219l126297l74679k760468j68533j419068L51296
1615.4E11831627j007691p573432K989044m26636N81818j772881J01547j025619k930412
1624E00767365K048263N417K086677j323318J59454K82173k89344M69513l12882K376557
1633.7E06269875M26864j989364r75037K884407J934319J010627J720276J84288J973152
1642.4E13439407J63041K251358J984405j716804J847877M39453L676605J489563L704300
1651E27279205L338166l447152j704902K331047N223160K392311K625465J650620K102508
1659.7E41790428K268791J930085K540855J023331L679084J992226K154236K479362
$$ y = [547910461, 544019432, 541329193, 537997017, 534791908, 533023491, 529592667, 528957901, 526901779, 525770187, 522678528, 521014595, 519329376, 516203079, 515828400, 513067932, 512899399, 511480331, 511831627, 510823936, 503250504, 506239548, 505812912, 506394730, 504621849, 504723396, 503697777, 500767365, 502815628, 502821045, 504907722, 503584404, 503743858, 504026031, 503736687, 504206200, 503893318, 506269875, 506696739, 504707375, 503732338, 506616745, 508551064, 509561691, 511281967, 511466255, 513439407, 513602448, 515853806, 517838211, 516121407, 517969284, 518408737, 522085342, 523574905, 527279205, 530617371, 527170219, 525465317, 527796364, 533019524, 535411835, 538037300, 539687920, 541790428, 544059219, 545989304, 548530159, 549553490, 553232574, 555224800, 557379036, 559858398]
1667.4E59858398J984940J056252J819191M395942J546059M137573M016914J172066
1675.1E79987335Q10089L266182L846550K193985K565422J438065L772850M269066
1682.9F02149544j126442R77974N022468N829735L163948J935539L126145K983436
1690.6F24062347L665734L390922M007111L958702K214012k397156M316635N402375
1698.3F48620682N290146O08749l541489P230683M936905L055420J600418K121353
1706F69922867J302566K223893K904663Q87222J292648K421189K626571K479096p38602
1714.7F85322113r7046L854599K031708n554657K475815K908478J600036J457138P17316
1723.4F94715500Q26263J755600J532822M55856O44226J592026j366348o37436L272247
$$ y = [559858398, 561843338, 562899590, 564718781, 569114723, 570660782, 574798355, 578815269, 579987335, 580797424, 584063606, 587910156, 590104141, 592669563, 594107628, 597880478, 602149544, 601023102, 602001076, 607023544, 612853279, 616017227, 617952766, 621078911, 624062347, 627728081, 631119003, 635126114, 639084816, 641298828, 638901672, 643218307, 648620682, 653910828, 654519577, 650978088, 658208771, 663145676, 666201096, 667801514, 669922867, 671225433, 673449326, 676353989, 677241211, 678533859, 680955048, 683581619, 686060715, 685322113, 685225067, 689079666, 691111374, 685556717, 688032532, 690941010, 692541046, 693998184, 694715500, 695541763, 697297363, 698830185, 699286041, 699930267, 701522293, 700155945, 699518509, 702790756]
1732G02790756K767792j929092l569565N122528M009399J440354K020340l22419j344757
1740.7G10985336L418732K165070R2315K135468L805771K723159J742173J384048J289063
1749.4G29741135L535537l11279R78088M897004K873458K720719K546387J06353J890869
1758.1G48978271K400437K003403K645187j743698j78147L352585J891556J587448
1765.8G60937042K053375J781922j794052J984787L576431j008759k779083n81741
1773.5G64169922M211273J868439m11530K268296R99984J542435J64337j185913J100235
1782.2G74727478J719284J125031j061936N85633J624832R89227J134949J633377K87246
1790.9G82765121p77511j829987J0224L142242O50635m55322J357040J521301K88544
$$ y = [702790756, 705558548, 703629456, 700059891, 705182419, 709191818, 710632172, 712652512, 712330093, 710985336, 714404068, 716569138, 716661453, 718796921, 722602692, 725325851, 727068024, 728452072, 729741135, 733276672, 732965393, 733943481, 738840485, 741713943, 744434662, 746981049, 747087402, 748978271, 751378708, 753382111, 756027298, 754283600, 754105453, 757458038, 759349594, 760937042, 762990417, 764772339, 762978287, 764963074, 768539505, 767530746, 764751663, 764169922, 768381195, 770249634, 769838104, 772106400, 773106384, 774648819, 774813156, 773627243, 774727478, 776446762, 777571793, 776509857, 777095490, 778720322, 779709549, 780844498, 782477875, 782765121, 781987610, 780157623, 780167847, 783310089, 783960724, 783505402, 784862442, 786383743, 786672287]
1799.5G86672287l46375K145234k23008J26801J414795j4572K21634J96533M53491
1808.2G90646820J133652J066437q40302P84302J478271K90909L91312l89633K44140
1816.9G94805908n62057M44565J377334N18570J275482J48468P49283L61328k659683
1825.6G96459198R6283J629333J025620j080475k411270K119293L121262P68127J38703
1834.3H01866074K3269j82495l75748p72094R39102M77219R32540O72303Q93936K26593
1843.9H04700699m946747K142715J966324m28695l23181O58340J207352L34854Q08563
1852.6H06120224l9597L1662p2555j85547M92325l78342q0490k7695O11878L52859
1862.2H06824722L83606L35007k0447N82962p45163J53275p94831j440277J031266
$$ y = [786672287, 786325912, 788471146, 788248138, 788374939, 789789734, 789775162, 789996796, 790193329, 790646820, 791780472, 792846909, 792006607, 792790909, 794269180, 794560089, 794951401, 794561768, 794805908, 794243851, 794688416, 796065750, 796584320, 797859802, 798008270, 798757553, 799118881, 796459198, 796555481, 798184814, 799210434, 798129959, 795718689, 797837982, 800959244, 801727371, 801866074, 801889343, 801706848, 801331100, 800559006, 801498108, 801975327, 802907867, 803580170, 804474106, 804700699, 799753952, 801896667, 803862991, 803434296, 803111115, 803769455, 804976807, 805311661, 806120224, 806080627, 806112289, 806039734, 805854187, 806346512, 805968170, 805887680, 805859985, 806471863, 806824722, 807208328, 807543335, 807522888, 808105850, 807360687, 807513962, 806719131, 805278854, 806310120]
1870.9H06310120J502075J362762J11389j2588p5607N26657P8964m18167K7084q5754
1880.6H09326935N73654l78342q7433k26516o027J107177K46887P55539n74951j609344
1890.2H09127579O83288O04401l36990Q2397J7090j55716J207275M39453M52042M654
1899.8H12125473q13293j80054k79160K65427j05896K25830N62363N31616M66995k67181
1909.5H12532120n13001m82101L63693m75235j29166K2812K63291J364288j326828
1918.2H11619873Q7967J087494P1258j47247j530456n92347N56946N90592K73132O60095
1927.8H12677307k3880j11084O35071j4648k59934r92584k60773j11999k6322M94919
1937.5H12006073M96979R08737j42212L86887j188507k259064Q37936K87171k49558
$$ y = [806310120, 807812195, 809174957, 809286346, 809273758, 809198151, 809724808, 809803772, 809385605, 809412689, 809326935, 809900589, 809522247, 809434814, 809208298, 809202271, 810309448, 810556335, 811311874, 810736923, 809127579, 809810867, 810415268, 810078278, 810160675, 810177765, 810022049, 811229324, 811668777, 812120819, 812125473, 811312180, 811132126, 810852966, 811118393, 811012497, 811238327, 811800690, 812332306, 812799301, 812532120, 812019119, 811537018, 811900711, 811425476, 811296310, 811319122, 811582413, 812946701, 811619873, 811707840, 812795334, 812866592, 812719345, 811188889, 810596542, 811153488, 811744080, 812017212, 812677307, 812653427, 812542343, 813177414, 813162766, 812902832, 811910248, 811649475, 811537476, 811511154, 812006073, 812503052, 813411789, 813269577, 813656464, 812467957, 810208893, 811046829, 811334000, 811084442]
1946.1H11084442R8419Q87146N70908M26178L34625l44009j26953o58722p24640n42298
1955.8H11005096R7352K61535N26581P99484k52456l5782k53754l84445m58374k99378
1965.4H11005859M5700o68029L48282J028594Q99430J93939l17688k89688l67966l64609
1975.1H11513824o56280p9880J94092L07770N10101K86865j96304k92053j07041p18460
1984.7H10762634k90680j66702k69699m5853M96140J187668k17667j008377r2087M34876
1994.3H10790253j31226p28302j55640J76621L66211j60751l815J59530k18582j48239
2004H09946060k51846j75934l82309k53296j22909K41165J97830k19421K0523J31912
2013.6H09131775K90832m53262n93414l14255j03836J56326N6000M41132j41297r9182
$$ y = [811084442, 811182861, 812070007, 812640915, 813067093, 813401718, 813057709, 812930756, 812272034, 811547394, 811005096, 811102448, 811363983, 811890564, 812690048, 812437592, 812401810, 812148056, 811763611, 811305237, 811005859, 811051559, 810383530, 810731812, 811760406, 812659836, 812853775, 812536087, 812246399, 811878433, 811513824, 810857544, 810777664, 810971756, 811279526, 811789627, 812076492, 811880188, 811588135, 811481094, 810762634, 810471954, 810305252, 810035553, 809989700, 810485840, 811673508, 811455841, 810447464, 810355377, 810790253, 810659027, 809930725, 809775085, 809951706, 810317917, 810157166, 810153351, 810312881, 810094299, 809946060, 809694214, 809518280, 809135971, 808882675, 808759766, 809000931, 809198761, 808979340, 808999863, 809131775, 809422607, 808969345, 808375931, 808061676, 807957840, 808114166, 808170166, 808611298, 808470001, 808370819]
2023.3H08370819j11160m66080j78223O7597M07715k10266l63694m16031K29416L97263
2032.9H07727356o44226l82309j06659J3046l23944M6311K93808M8446Q4076l24707
2042.6H06431198l9749m94537l78952k61460j3733O79016J86615O8284l72468k26593
2052.2H05577621m42810k94342L33405j68305k32543n11399L43933N02854k04621l74450
2061.9H04529343j83716N46264k18811n04226k71530N0659J49231L2577N02625J80969
2071.5H04813385q3389o05011l46680J17340l3645j45417n7449K75574l45917J1597
2081.1H03600388L01284L7918k99453n70603j02005k43683J59073J99890K15989J52816
2090.8H03451614m6692R1401k45591j24969p82166k27203M31900O9351J36185q1482
$$ y = [808370819, 808259659, 807793579, 807615356, 807682953, 808090668, 807880402, 807516708, 807100677, 807330093, 807727356, 807083130, 806700821, 806594162, 806607208, 806283264, 806329575, 806623383, 806671829, 806755905, 806431198, 806391449, 805896912, 805517960, 805256500, 805242767, 805921783, 806108398, 806176682, 805804214, 805577621, 805134811, 804840469, 805173874, 805005569, 804773026, 804261627, 804605560, 805108414, 804903793, 804529343, 804345627, 804891891, 804673080, 804168854, 803897324, 803947983, 804097214, 804129791, 804632416, 804813385, 804729996, 804124985, 803778305, 803895645, 803862000, 803716583, 803659134, 803934708, 803588791, 803600388, 803901672, 803939590, 803640137, 803069534, 802967529, 802723846, 802882919, 803082809, 803298798, 803451614, 803404922, 803496323, 803250732, 803125763, 802343597, 802116394, 802548294, 802617645, 802753830, 802672348]
2100.4H02672348J89133l02887j12610N8136l43628k56882k27890L08914N2414o0577
2110.1H01976471j85700j43280o8512j3198N722o53839J42593O4621k53067j27030
2119.7H00744781j39389K57187M8142K90832m23126l20663K33001q5296L0288j04599
2129.4H00531158M25187K20947j8387o9962j95083P9269j21994p1716k46201q6822
2139H00446396K1591L7537j47248k90298J67465K21634K45972p7362K33230r4299m88510
2149.6H00276108K64892K42615K98920K0675Q316p5836l98407k23388j85624n2490
2159.3H00175781P5302M00238J47553Q3008j88370p9269N16357J4343j8081k44599
2168.9H00882263k30102k21558J86691K98615m07639M11454J87683o1036J53656J72120
$$ y = [802672348, 802861481, 802558594, 802445984, 802504120, 802160492, 801903610, 801675720, 801984634, 802037048, 801976471, 801790771, 801647491, 801578979, 801565781, 801571503, 800917664, 801060257, 801124878, 800871811, 800744781, 800605392, 800862579, 800910721, 801201553, 800778427, 800457764, 800690765, 800605469, 800635757, 800531158, 800956345, 801177292, 801158905, 801088943, 800893860, 800973129, 800851135, 800779419, 800533218, 800446396, 800467987, 800505524, 800358276, 800067978, 800235443, 800457077, 800703049, 800625687, 800858917, 800764618, 800276108, 800541000, 800783615, 801082535, 801103210, 801111526, 801035690, 800637283, 800413895, 800228271, 800175781, 800251083, 800651321, 800798874, 800881882, 800693512, 800614243, 801130600, 801144943, 801126862, 800882263, 800652161, 800430603, 800617294, 800915909, 800508270, 800919724, 801107407, 801046371, 801200027, 801372147]
2178.5H01372147K00271k11639K26745P4845q7738j91880Q7204J2970o05316M4556
2188.2H00922165K90222M00238M5776L6622M2495l36685K3346M5014J43432p1258K44827
2198.8H01786194J33056j78070J63727J17798J87454k30484K38953M0207n94864j82114
2208.4H01481857K99607N95474o8970J97296K24228J4878j09635n03616j70136j69143
2218.1H01791840J01242M4250L06778K07825M1656K72522k72369m5853j06964J66474
2227.7H02507401l0289k98767N4245j984M29535j20010o7597j4343k00272q4686j43585
2238.3H02029648K47650k59323K79007N33905L8147j12381l62930j52894k95639O5308
2248H02010498k2888L4256J32446q8653J18331n2795J52359j33743k45209k81448k24533
$$ y = [801372147, 801572418, 801360779, 801587524, 801662369, 801574631, 801382751, 801469955, 801482925, 800877609, 800922165, 801212387, 801612625, 801658401, 801695023, 801737518, 801400833, 801424179, 801469193, 801612625, 801541367, 801786194, 801919250, 801741180, 801904907, 802022705, 802210159, 801979675, 802218628, 802258835, 801663971, 801481857, 801781464, 802376938, 802307968, 802505264, 802729492, 802744370, 802634735, 802131119, 801960983, 801791840, 801893082, 801937332, 802244110, 802451935, 802493591, 802766113, 802493744, 802447891, 802340927, 802507401, 802477112, 802178345, 802232590, 802230606, 802660141, 802540131, 802472534, 802458191, 802257919, 802173233, 802029648, 802277298, 802017975, 802296982, 802830887, 802869034, 802756653, 802393723, 802240829, 801945190, 802010498, 801987610, 802021866, 802154312, 802065659, 802183990, 802131195, 802283554, 802149811, 801904602, 801623154, 801398621]
2258.6H01398621r2545j57089L39660J95923J24970k96631q3771J93863k45590j11694
2268.2H01265717k52305J59073J63193J56708m9820q6823K95868j69296o1722m11072
2277.9H01009521j43508K31781O790J04065J48086K04163k33154k40098n43594j71509
2287.5H00372543k39563n47485J14212m8370M07486k22245k83737Q1558l04260p70950
2297.2G98559189j134567L63311k84347j50147L00217l31268Q2931p18231n43823j014786
2306.8G95128479q49915p72857n71823J57852q58154L58352K86637L14483n63507j484680
2316.4G91144867m02145j555024j104965j257553o36520l19214q33206o09513j017990
2325.1G83408737J77536r44824k91672p58056p20444K77862p51724J608734K32086
$$ y = [801398621, 801306076, 801148987, 801488647, 801684570, 801809540, 801512909, 801429138, 801623001, 801377411, 801265717, 801013412, 801172485, 801335678, 801492386, 801442566, 801355743, 801651611, 801482315, 801420593, 801009521, 800866013, 801097794, 801104584, 801208649, 801356735, 801560898, 801327744, 801087646, 800544052, 800372543, 800132980, 799585495, 799699707, 799651337, 800058823, 799836578, 799552841, 799634399, 799330139, 798559189, 797424622, 797787933, 797503586, 797353439, 797653656, 797322388, 797405319, 796687088, 796143265, 795128479, 794278564, 793505707, 792933884, 793091736, 792233582, 792591934, 792878571, 793193054, 792629547, 791144867, 790742722, 789187698, 788082733, 786825180, 786188660, 785869446, 785036240, 784426727, 783408737, 783586273, 782641449, 782349777, 781591721, 780871277, 781149139, 780397415, 782006149, 782238235]
2333.8G82238235k23236p41806j894455k59170k2278K79541j63498P56455j236573
2342.5G78733215j544647J095581J211472J124344J825332L199845Q09021j601105
2350.2G84853058j816483j922531k075882k321777j742096k190552k652893j827774
2357.9G68303070M72412K021866R47495m87137j594620j05286J219025K205810R81827
2366.6G73964462O22101K011414J800918J230011N71823J928025J719207R21708P37075
2375.3G85506744Q03605J100769N71289J088791R53216J299744J596145P88193K96021
2383.9G94004517J10550M10614j48545L3417M21295j71356j95694L96423O16761j62278
2393.6G95315704k60772n72052p11823l25012o4468L14559o9351j12381l45764j03836
$$ y = [782238235, 782014999, 781273193, 779378738, 779119568, 779097290, 779376831, 779213333, 779969788, 778733215, 777188568, 778284149, 779495621, 780619965, 782445297, 785645142, 786454163, 784853058, 783036575, 781114044, 779038162, 776716385, 774974289, 772783737, 770130844, 768303070, 768775482, 770797348, 771744843, 771257706, 769663086, 769557800, 770776825, 772982635, 773964462, 774586563, 776597977, 778398895, 779628906, 780200729, 782128754, 783847961, 784769669, 785506744, 786310349, 787411118, 787982407, 789071198, 790024414, 791324158, 792920303, 793708496, 794004517, 794115067, 794525681, 794377136, 794410553, 794831848, 794660492, 794464798, 794861221, 795477982, 795315704, 795054932, 794482880, 793771057, 793446045, 793381577, 793696136, 793626785, 793514404, 793168640, 793064804]
2403.2G93064804J69678O4621K43377l86199l75596j53274j53961o60172k83356O84815
2412.9G92214737J84631j90811p33948k98004m8980l94593p2403o5994N46875K58942
2422.5G91400452o02951p81022l81011R2926Q5907j27488n34286l37982k68174K80533
2432.2G88826904L27912n79987k82898R9869j62811l45536j91650m76685k78091J9379
2441.8G86956406k2889M6845o0349L35541n84564p34940k4185j69983j8310o27442
2451.5G85096130n12390j54266J36108K10877j34201J678l48968j24436j05209m32892
2461.1G83632431l55835j43127k76947k61307J38397m24576k49557P1640K39563j21079
2470.7G82249603p89184j79596j48239l59497o94123r994K76336n18722n9052j23367
$$ y = [793064804, 793234482, 793299103, 793542480, 793156281, 792780685, 792627411, 792473450, 791813278, 791529922, 792214737, 792399368, 792208557, 791474609, 791176605, 791127625, 790733032, 790660629, 790594635, 791141510, 791400452, 790797501, 790016479, 789635468, 789728394, 789814301, 789686813, 789152527, 788814545, 788546371, 788826904, 789154816, 788574829, 788291931, 788391800, 788228989, 787883453, 787691803, 787215118, 786937027, 786956406, 786933517, 786980362, 786920013, 787255554, 786670990, 785936050, 785911865, 785741882, 785723572, 785096130, 784583740, 784429474, 784565582, 784776459, 784642258, 784643936, 784294968, 784170532, 784065323, 783632431, 783276596, 783133469, 782856522, 782595215, 782733612, 782309036, 782059479, 782131119, 782370682, 782249603, 781460419, 781280823, 781132584, 780773087, 780078964, 780068970, 780345306, 779826584, 779767532, 779644165]
2480.4G79644165l71551o48652m14810l3874J03912k1515o35910j06811j37635l81
2490G77376938m32282q71505L8986k10114k71606l68271k31400k69241l47977J77536
2499.7G74591064N6687P9422p44476q32444l0060K3270l44467o42777j60903j31989
2509.3G71863327k30331j99967K2659o9580l86123k88315m94614l87039m11835j36032
2519G69282150K48032K55127j69525o48270l88184n52063m32891m14124l33557J13602
2528.6G66960297J31149J1673k7771K68555l28446m94690m70199p04499m80499l86505
2538.2G64479065J47018k98919l8910N49392k23999n17730l97949l37677p13349l92914
2547.9G62254028j11541n3788M8752n6000J68000l60184m03290l65829k52304k03019
$$ y = [779644165, 779272614, 778623962, 778209152, 778175278, 778279190, 778257675, 777621765, 777514954, 777377319, 777376938, 776944656, 776073151, 776112137, 775902023, 775630417, 775262146, 775030746, 774761505, 774413528, 774591064, 774647751, 774727173, 773982697, 773150253, 773120193, 773143463, 772798996, 772156219, 771995316, 771863327, 771632996, 771433029, 771455688, 771386108, 770999985, 770711670, 770217056, 769830017, 769418182, 769282150, 769530182, 769785309, 769615784, 768967514, 768579330, 768027267, 767594376, 767180252, 766846695, 766960297, 767091446, 767103119, 767075348, 767343903, 767015457, 766520767, 766050568, 765346069, 764865570, 764479065, 764626083, 764327164, 764288254, 764837646, 764613647, 764095917, 763697968, 763360291, 762646942, 762254028, 762142487, 762088699, 762137451, 762081451, 762249451, 761889267, 761485977, 761120148, 760867844, 760664825]
2557.5G60664825n53283j43814k14386P2479j1597m83474l3875J99661l53164q27256
2567.2G58316116m01916m14810n26429n36422j31531M27170M64248J53122q97522p14264
2576.8G55737762k57873j8616l2425n97229k84347j08185K2125l16238k6703L26309
2586.5G54444580n33752o92444m39987j79978m30755j95542J12915J45264N3177n83954
2596.1G51699524k87781m22668m62189n04150o31257j29089k65961j25198n722L05405
2605.7G49170914J50451l75900n59006q00323l30277l37371n35355l86810K15835L79791
2615.4G46591949k12554k56806m52499m48685n00107n66940n10788j56326L11737j48011
2625G43650970m56924l99704m0054k03400o19278m15573l38516n30014o03028k68478
$$ y = [760664825, 760111542, 759967728, 759753342, 759825821, 759814224, 759330750, 759296875, 759496536, 759143372, 758316116, 757914200, 757499390, 756972961, 756436539, 756305008, 756732178, 757196426, 757349548, 756452026, 755737762, 755479889, 755461273, 755428848, 754831619, 754547272, 754439087, 754461212, 754144974, 754118271, 754444580, 753910828, 753218384, 752778397, 752598419, 752167664, 751972122, 752085037, 752230301, 752283478, 751699524, 751411743, 750989075, 750526886, 750022736, 749391479, 749262390, 748996429, 748871231, 748865509, 749170914, 749321365, 748945465, 748386459, 747586136, 747255859, 746918488, 746383133, 745996323, 746212158, 746591949, 746379395, 746122589, 745670090, 745221405, 744721298, 744154358, 743643570, 743487244, 743798981, 743650970, 743194046, 742794342, 742754288, 742550888, 741931610, 741516037, 741177521, 740647507, 740044479, 739776001]
2634.7G39776001k75574K03781L58353k41394m56924n54734l65677p59887q66165p27997
2644.3G36089783j6251O00586j44882k31934n55649l41339M0436k60391k94800p09381
2654G34176178m80652k95715j33286Q5068j75400m26178m29992k39716k84348m9057
2663.6G31746902l03955n09643l91312j0071K70996l04794j83868l36380l94516l40576
2673.3G29242783n78919k35290L891L52096k53525o52160k01264l74069m49600j9531
2682.9G26834412K6016n08423l02734j85166m75082m11835O2866j51062p40432q6441
2692.5G24062119p8660j78146j48544l62549k72446n00335m84543l62396L74755J29242
2702.2G22178497l95965j59226p28607n19409k57492l51410l57742j38245J10397P1793
$$ y = [739776001, 739500427, 739704208, 740062561, 739821167, 739364243, 738809509, 738443832, 737683945, 736817780, 736089783, 736073532, 736674118, 736529236, 736297302, 735741653, 735400314, 735440750, 735180359, 734885559, 734176178, 733695526, 733399811, 733266525, 733351593, 733176193, 732750015, 732320023, 732080307, 731795959, 731746902, 731442947, 730933304, 730541992, 730531921, 730802917, 730498123, 730314255, 729977875, 729583359, 729242783, 728663864, 728428574, 728432465, 728784561, 728531036, 727878876, 727677612, 727303543, 726853943, 726834412, 726860428, 726352005, 726049271, 725864105, 725389023, 724977188, 725040054, 724888992, 724148560, 724062119, 723983459, 723805313, 723656769, 723294220, 723021774, 722521439, 722036896, 721674500, 722049255, 722178497, 721782532, 721623306, 720894699, 720375290, 720117798, 719766388, 719408646, 719270401, 719380798, 719452591]
2711.8G19452591J98822j07040O7367l1814p16019r85336l29667P630m51508K48642
2721.5G17353668Q1940k11945L13721K70386m49143j080551m15039l81241j38397J5717
2731.1G15359116k70691L5705r7961J12152j52130K8305O3782o72150l32184j45035
2740.8G13928909m29763o27747j38474O2867J98974N65796J14441l21655n46112k61231
2750.4G12546005l98330o02494j72806r231M9820J42746O10l68805n3406k60162l48816
2761G10525131N7297l74451k09579k25678m78439k52838M9515R9334r3536l39355o38581
2771.6G08118820l38058l84827j18256K16141q6212M4556j06659n54810n66330K594
2781.3G06226959n01175q74481m84390p01599n9738N47866M39911l53851o77948l42484
$$ y = [719452591, 719651413, 719544373, 719611740, 719579926, 718863907, 717878571, 717548904, 717556534, 717105026, 717353668, 717435608, 717223663, 717537384, 717807770, 717358627, 716278076, 715863037, 715481796, 715343399, 715359116, 715088425, 715124130, 715026169, 715138321, 714986191, 715014496, 715078278, 714406128, 714073944, 713928909, 713499146, 712871399, 712732925, 712795792, 712994766, 713560562, 713675003, 713353348, 712807236, 712546005, 712147675, 711545181, 711372375, 711363144, 711412964, 711555710, 711556320, 711187515, 711134109, 710873947, 710525131, 710582428, 710207977, 709998398, 709772720, 709294281, 709041443, 709090958, 709190292, 709096756, 708757401, 708118820, 707780762, 707395935, 707277679, 707493820, 707407608, 707452164, 707345505, 706790695, 706224365, 706226959, 705725784, 704851303, 704366913, 703665314, 703605576, 704153442, 704593353, 704239502, 703561554, 703219070]
2790.9G03219070m42581m21524o42166j83868m07029p11593J15280j47858p39135o96564
2800.5F98942032j94016l75442m55322l38669p67288o46744m18091J24741J61514k93656
2810.2F95739059o81228o92749k30866p20596j033173p60955n02472m43879l16085
2818.9F90357056j88446j66779J66168n71213j283035j114349q38165m78516l74451
2827.6F85508270n94864p58438m35104p49741q63113m24042m73099p05032j052628
2836.2F79452209n37338m39987j318512j385193r42688j147613j586991j322784j205368
2844.9F69565735j382599j684113k003173j908570j721191j637268j099396k12402
2852.6F57917023l90778n79300j82953l5019j18255k18582k9221k76718l3417L07007
$$ y = [703219070, 702776489, 702354965, 701712799, 701528931, 701121902, 700410309, 700525589, 700377731, 699638596, 698942032, 698748016, 698372574, 697917252, 697578583, 696811295, 696164551, 695746460, 695871201, 696032715, 695739059, 695057831, 694365082, 694134216, 693413620, 692380447, 691619492, 691117020, 690673141, 690357056, 690168610, 690001831, 690167999, 689596786, 688313751, 687199402, 686361237, 685882721, 685508270, 684913406, 684154968, 683719864, 682970123, 682107010, 681682968, 681209869, 680504837, 679452209, 678914871, 678474884, 677156372, 675771179, 674828491, 673680878, 672093887, 670771103, 669565735, 668183136, 666499023, 664495850, 662587280, 660866089, 659228821, 658129425, 657917023, 657526245, 656946945, 656763992, 656728973, 656610718, 656392136, 656362915, 656086197, 656052780, 656359787]
2862.3F56359787Q1406O2561m69284o85044n63125n54962m53949o23398n97916m53949
2871.9F52102127l24631K4186k67258q81272n62133j09558J8005o70242j347046o25458
2881.6F47356720l3493j52817n34363m85000n87235p42950n15976q94470r32923r95941
2891.2F41481552q89358m21906j30768k10609q37441q95385r80874m67109k27814o63643
2900.8F35756645p77206j075478l21693j93024n52254o82029o28891j8196p03698j164207
2910.5F29639969j367722j392631r68323j059990q34122p68089j039925j257514j044732
2919.2F19906921j188545j287346r46045o29234j7395k28004m0017L25089O56967P96242
2928.8F17348633k30980j96266m6120j71471L55149N33218M22592Q21572Q81576L34816
$$ y = [656359787, 656441193, 656503754, 656034470, 655349426, 654786301, 654231339, 653777390, 653153992, 652556076, 652102127, 651777496, 651801682, 651534424, 650653152, 650091019, 649981461, 649999466, 649329224, 647982178, 647356720, 647323227, 647170410, 646636047, 646151047, 645563812, 644820862, 644304886, 643410416, 642477493, 641481552, 640592194, 640170288, 640039520, 639828911, 638991470, 638096085, 637115211, 636648102, 636420288, 635756645, 634979439, 633903961, 633582268, 633389244, 632836990, 632154961, 631526070, 631507874, 630804176, 629639969, 628272247, 626879616, 625911293, 624851303, 624017181, 623249092, 622209167, 620951653, 619906921, 618718376, 617431030, 616484985, 615855751, 615838356, 615610352, 615570335, 615895424, 616552391, 617348633, 617117653, 616921387, 616875267, 616703796, 617058945, 617592163, 618014755, 618836327, 619717903, 620052719]
2938.5F20052719O98166R01260Q67501P23381J86271m3411J86386P20673M35066K35787
2948.1F24963799P0915K39296P80677K52266n1994l54576l06969L84331P54089N69191
2957.7F27301025K64206M78516J64680q9340L75328P17926K90757j1025Q1711M01611
2967.4F29975395J129990N65033L43971P23763O26258Q71659M89425L30162L04375
2976.1F35360031R3384M73404O98166M43001K72560K81753K09503J96457p3509K2354
2985.7F37977104L99628K07367m17862k09770O18438L52059L51333K22550j18981j71241
2995.3F39210625n37072j85508k17018l63961k97813k79465k91023k19421J13411n74608
3005F36358147l95432k76680j076126n57213Q6594o2447m10499j33782j71852l95393
$$ y = [620052719, 620750885, 621652145, 622519646, 623243027, 623429298, 623385887, 623572273, 624292946, 624728012, 624963799, 625034714, 625274010, 626054687, 626306953, 626254959, 625900383, 625593414, 625977745, 626731834, 627301025, 627565231, 628043747, 628208427, 628119087, 628494415, 629212341, 629503098, 629492073, 629573784, 629975395, 631105385, 631670418, 632014389, 632738152, 633364410, 634236069, 634725494, 635055656, 635360031, 635453415, 635926819, 636624985, 637067986, 637340546, 637622299, 637831802, 638028259, 637954750, 637977104, 638376732, 638584099, 638166237, 637956467, 638574905, 638926964, 639278297, 639500847, 639381866, 639210625, 638673553, 638488045, 638271027, 637907066, 637609253, 637329788, 637038765, 636819344, 636932755, 636358147, 635962715, 635686035, 634609909, 634052696, 634139290, 634076843, 633666344, 633532562, 633360710, 632965317]
3014.6F32965317n87425q98476l24288j52168l90625o70051n43671k43187l83453j29776
3024.3F28642197l20092p57331p18995n51185o69060m36706k10686n28031j26419k78091
3033.9F24045601n35965n66063q27370l53622q02994j122665l20168l03650m03518
3042.6F18809586k21177m41894p33681m78630k28538r57833j129303n26199o84433
3051.3F13407898o20537m61807k41127j13678m99420m26560n23529o74476q65250p06711
3060.9F08274803n14488q73108o28319o28662m07638j56670l0975M5967o35491p81135
3070.6F03664284q83942m92134l17154n20363j6670m44107n92613n76783q37860k68135
3080.2E98714523J44501m31290j075897o30035l35312m32854l10287r8877n83725j241455
$$ y = [632965317, 632377892, 631479416, 631155128, 631002960, 630612335, 629942284, 629398613, 629155426, 628771973, 628642197, 628322105, 627564774, 626845779, 626294594, 625625534, 625188828, 624978142, 624450111, 624323692, 624045601, 623509636, 622943573, 622116203, 621762581, 620959587, 619836922, 619516754, 619213104, 618809586, 618588409, 618146515, 617412834, 616934204, 616705666, 615747833, 614618530, 614092331, 613407898, 612787361, 612325554, 612084427, 611970749, 611471329, 611044769, 610521240, 609846764, 608981514, 608274803, 607760315, 606887207, 606258888, 605630226, 605222588, 605065918, 605034943, 605080910, 604445419, 603664284, 602780342, 602288208, 601971054, 601450691, 601434021, 600989914, 600397301, 599820518, 598982658, 598714523, 598859024, 598427734, 597351837, 596721802, 596386490, 595953636, 595643349, 595544472, 594960747, 593719292]
3089.9E93719292o73676n2566j62049j079025j236343m68140k03667M1199j65024o56090
3099.5E89063911r04617k80228L7079m78439k92168o57119p88041l00064p48672j041794
3109.1E83609848p80678m31595j602J6823l07236q22067j207542o49300n32188m87442
3118.8E78407021P7705l57056r39750j137963n69572r0447n08766r37996p26585J00784
3128.4E73317375j15623p32079r28039n86663k02369q39119r09119p83730n53054m76876
3138.1E67190704q92028n74952l48587q8386k15225j002236r20410l14064o25496j046295
3147.7E61163025o09665n88150k12746J0453q56858r53750n84259l71399m78401p84417
3157.4E55733833q38432p21207k74315m83665q20389m64363o64444o68678n40390j012917
$$ y = [593719292, 593045616, 592993050, 592831001, 591751976, 590515633, 590047493, 589843826, 589885025, 589720001, 589063911, 588159294, 587879066, 587916145, 587437706, 587145538, 586488419, 585700378, 585400314, 584651642, 583609848, 582829170, 582397575, 582395973, 582412796, 582105560, 581283493, 580075951, 579426651, 578894463, 578407021, 578484726, 578127670, 577187920, 576049957, 575480385, 575389938, 574881172, 573943176, 573216591, 573317375, 573201752, 572469673, 571541634, 570954971, 570752602, 569913483, 569004364, 568220634, 567667580, 567190704, 566298676, 565723724, 565375137, 565286751, 565071526, 564069290, 563148880, 562834816, 562209320, 561163025, 560553360, 559965210, 559752464, 559762917, 558906059, 557952309, 557368050, 556996651, 556518250, 555733833, 554895401, 554174194, 553899879, 553416214, 552595825, 552131462, 551467018, 550798340, 550257950, 549245033]
3167E49245033p12204m5891n2223p41958j171227r75189o86913l84750m65698j59149
3176.6E43849831n64423j370850m60052k32620p00837o78634p02438m91906k53944
3185.3E38394127o68831r04884l96920n90972q57544o52810m42428o76003j056022
3194E32147713n30968l64342m01840p76596j106644n44929l18718n96771j043358m33274
3203.6E26030273m21562p46193j50375o79169j015243p17392j78032j51024n89638
3212.3E21381645m66270o42777o54449o66771k76108n7487q46291r47723n53399n72471
3222E15697899n53589n20096q24280n98220n72091p05490l01704m7951m3449j152764
3231.6E10378265j499633q18787j90353Q8844o41403n66635m57497n80063n72739n62973
$$ y = [549245033, 548532829, 548486938, 548434715, 547692757, 546521530, 545546341, 544859428, 544474678, 544008980, 543849831, 543285408, 541914558, 541454506, 541221886, 540521049, 539842415, 539139977, 538648071, 538394127, 537725296, 536820412, 536423492, 535832520, 534974976, 534322166, 533879738, 533203735, 532147713, 531616745, 531252403, 530850563, 530073967, 528967323, 528422394, 528103676, 527506905, 526463547, 526030273, 525608711, 524862518, 524712143, 524032974, 523017731, 522300339, 522122307, 521971283, 521381645, 520915375, 520272598, 519618149, 518951378, 518675270, 518617783, 517771492, 516823769, 516270370, 515697899, 515144310, 514624214, 513799934, 513201714, 512629623, 511924133, 511622429, 511574478, 511531029, 510378265, 508878632, 508059845, 507869492, 507958336, 507316933, 506750298, 506292801, 505712738, 505139999, 504577026]
3241.3E04577026k80799j31798q8730j286240j188850j74027k45437k0485j37596k71416
3250.9E00751648r32579j109505m12292m95339o54144n20897Q4648K52075l53851p76634
3260.5D95833130m57420k99569o62346j012039q52508J53961j01852l86467j82038
3269.2D92032852n49354n54352k58637N76783m15116j285629m85115n12428l33901
3277.9D88215103p20177o65817k11716j61094J80206o43425r87778j90391K03552j44653
3287.5D84873810p27654m93202j1444j54114j02501J33019m81339o95419l10745n70069
3297.2D81460342j174163j038208l36838l0632r804l70522k23655J33781m17671p72018
3306.8D77220612p37954q33435q84704n85289k11678L7232o32134r72442o2905m80385
$$ y = [504577026, 504296227, 504164429, 504075699, 502789459, 501600609, 501426582, 501181145, 501160660, 501023064, 500751648, 499819069, 498709564, 498297272, 497801933, 497147789, 496626892, 496711540, 496963615, 496609764, 495833130, 495375710, 495076141, 494413795, 493401756, 492549248, 492703209, 492601357, 492214890, 492032852, 491483498, 490929146, 490670509, 491247292, 490832176, 489546547, 489061432, 488549004, 488215103, 487494926, 486829109, 486617393, 486456299, 486636505, 485993080, 485005302, 484814911, 485018463, 484873810, 484146156, 483652954, 483641510, 483487396, 483384895, 483517914, 483036575, 482341156, 482030411, 481460342, 480286179, 479247971, 478911133, 478880501, 478870697, 478500175, 478276520, 478410301, 477992630, 477220612, 476482658, 475649223, 474764519, 474179230, 473967552, 474004784, 473372650, 472400208, 472337303, 471856918]
3316.5D71856918p36351k39257l42637n15251q84819o03714l78151n44357m42162k70996
3326.1D66899223o74438j483307j174507p97386n56870k05726l87955n97649p60116
3334.8D60261269n73273m83589o94351n81894n76439j048203j075897o09436o11877
3343.5D54006310o54450o01921p10640p27959k35710k40631r55315p74231m65621l04909
3353.1D48334923l08190q69407j043778p71255l01323k08397o09016n40009k91519
3361.8D43392029n49851l98979l04756q29582r17511n79910L7269k14424q54149o47621
3371.4D38132515n94978o95572m20876p3814n47905n10674j95007p89337n15633l10974
3381.1D33477745n70183l20816k36892n65186m96254l39394k36358O89468J45188o51589
$$ y = [471856918, 471120567, 470881310, 470538673, 470023422, 469138603, 468534889, 468156738, 467612381, 467170219, 466899223, 466224785, 464741478, 463566971, 462769585, 462212715, 462006989, 461619034, 461021385, 460261269, 459687996, 459204407, 458510056, 457928162, 457351723, 456303520, 455227623, 454618187, 454006310, 453351860, 452749939, 452039299, 451311340, 451075630, 450834999, 449879684, 449105453, 448639832, 448334923, 448026733, 447157326, 446113548, 445342293, 445040970, 444832573, 444223557, 443683548, 443392029, 442842178, 442443199, 442138443, 441308861, 440391350, 439811440, 439848709, 439634285, 438780136, 438132515, 437537537, 436841965, 436421089, 436347275, 435799370, 435288696, 435093689, 434304352, 433788719, 433477745, 432907562, 432586746, 432349854, 431784668, 431288414, 430949020, 430712662, 431402130, 431547318, 430895729]
3390.7D30895729j59988p03087j101227o29501j26419J92375L61442k83813o72836
3399.4D27772675J90l77350k53105M2992l34053j84517l92418m6310j74981p60917
3409.1D25292206l82843J06315P02629K64206m19006k58026j95046k7275j90086O6834
3418.7D24959908N74646j71051n56565o7825J47819j3466J27450L73725J8349R2583
3428.3D25485573q9760n417R66530M08173m29039j9837L49121K42081L6583m959K73857
3439D27212906M7493M7722P66754K30217J02196L77731O99005J024551n25856P5455
3448.6D30058174Q70094L57476O75010N30930M48685N46989R16557N65720R3193O56090
3458.2D35718918N07469J41830L09906O59066J01471L93409J031266M71763N52979
$$ y = [430895729, 430735741, 430032654, 428931427, 428301926, 428175507, 428367882, 428729324, 428445511, 427772675, 427772865, 427395515, 427142410, 427185402, 426851349, 426666832, 426274414, 426228104, 426053123, 425292206, 424909363, 425015678, 425718307, 425982513, 425563507, 425305481, 425110435, 425083160, 424893074, 424959908, 425534554, 425363503, 424806938, 424739113, 424886932, 424873466, 425000916, 425374641, 425392990, 425485573, 425395813, 425390396, 426356926, 426765099, 426336060, 426316223, 426665344, 426907425, 426944008, 426939049, 427212906, 427260399, 427308121, 428074875, 428305092, 428407288, 428785019, 429484024, 430508575, 429982719, 430058174, 430928268, 431285744, 431960754, 432491684, 432940369, 433487358, 434403915, 434969635, 435062828, 435718918, 436226387, 436368217, 436678123, 437337189, 437438660, 437832069, 438863335, 439335098, 439888077]
3466.9D39888077M12788O10123P42721M64631P29637P23648P02209J92833M11797Q97484
3476.6D45775948L23333N49393R14917N72433P53899N80330K70271J277695J159439
3485.2D52177658M24538O72722M71725O0844Q15239J553040Q42056Q47893P17201M48380
3494.9D59031296O64902k37198N21469J357956J217231R21326L25852M92630O45332
3503.6D64940796N06096M50744J318016J386910J115837N45616k74658J372719J363525
3512.2D72725601R92928Q18138M87022J548691J308975L64228k78435Q08372J600991
3520.9D80376511Q90007L94706k68974Q56361J834832J503753M72222N15556J210594
3529.6D87785568J414757J099434M72221J599922J353837R09462N95054J62125J769142
$$ y = [439888077, 440300865, 440910988, 441653709, 442118340, 442847977, 443571625, 444273834, 444466667, 444878464, 445775948, 446099281, 446648674, 447563591, 448136024, 448889923, 449470253, 449740524, 451018219, 452177658, 452602196, 453274918, 453746643, 453807487, 454622726, 456175766, 457017822, 457865715, 458582916, 459031296, 459696198, 459459000, 459980469, 461338425, 462555656, 463476982, 463802834, 464295464, 464940796, 465446892, 465897636, 467215652, 468602562, 469718399, 470264015, 469989357, 471362076, 472725601, 473718529, 474536667, 475023689, 476572380, 477881355, 478245583, 477967148, 478775520, 480376511, 481266518, 481661224, 481392250, 482248611, 484083443, 485587196, 486059418, 486574974, 487785568, 489200325, 490299759, 490771980, 492371902, 493725739, 494635201, 495230255, 495392380, 497161522]
3538.3D97161522J245651P54090Q46672P69424J327858K087021J163902k14004J105423
3547E06247559J21994K051086K863770J265564J023445j038666J536331J789627J169052
3555.6E17029762K029915O87599J796494J446647J91231J52664J980935J692047J241302
3564.3E28248596M131279J8845m6425Q94394j51825L323173J305848J205711J438675
3573E40368271J578331J793671J133689J588173O41671K553749K521438J156006J731567
3581.7E55066566J711960J522942J146049L392296J741829n86357O31447p43904L037338
3590.4E66920166L035355K768898J395263R92089L211670k44828K126847K699699P08160
3599E83613319K540474O65970J232071K291145J933213K359810K576599J905708R54
$$ y = [497161522, 498407173, 499161263, 500007935, 500777359, 502105217, 504192238, 505356140, 505142136, 506247559, 506369553, 508420639, 511284409, 512549973, 513573418, 512534752, 514071083, 515860710, 517029762, 519059677, 519747276, 521543770, 522990417, 523181648, 523334312, 525315247, 527007294, 528248596, 532379875, 532398720, 532352295, 533246689, 533094864, 536418037, 537723885, 538929596, 540368271, 541946602, 543740273, 544873962, 546462135, 547103806, 549657555, 552178993, 553334999, 555066566, 556778526, 558301468, 559447517, 562839813, 564581642, 563995285, 564626732, 563882828, 566920166, 569955521, 572724419, 574119682, 575111771, 578323441, 578078613, 580205460, 582905159, 583613319, 586153793, 586819763, 588051834, 590342979, 592276192, 594636002, 597212601, 599118309, 599119263]
3607.7E99119263L958435L67431n1155O434365k4300j847687M542389O92177L927994
3616.4F17118912L974762L42560J894454l17535Q33664K806702K352447K019959K833137
3625.1F33859062K492523K696305O902122K92587j0374221M941101O176224M617156
3632.8F51602859K91291j69525L268432L815384K412796j06735J629028K639466K612533
3641.5F67995529J572113J028748K813186L322831M827346r18884k149200M741745
3649.2F83233414j332856r14611J506500N271835M031906L536072L802948n891876
3656.9F93243332L180389M953766R55658O70014L52935K577744J127853J190186J737594
3665.6G09989471J010209M417343K545700q52509j433792n378723L836365P341842
$$ y = [599119263, 603077698, 603445129, 603393974, 609828339, 609804039, 607956352, 612498741, 613190918, 617118912, 621093674, 621436234, 623330688, 623013153, 623846817, 626653519, 629005966, 631025925, 633859062, 636351585, 639047890, 645950012, 646242599, 635868378, 640809479, 646985703, 651602859, 651894150, 651724625, 654993057, 658808441, 661221237, 661114502, 662743530, 665382996, 667995529, 669567642, 670596390, 673409576, 676732407, 681559753, 680640869, 678491669, 683233414, 681900558, 680985947, 682492447, 687764282, 691796188, 695332260, 699135208, 693243332, 696423721, 701377487, 702333145, 703003159, 703356094, 705933838, 707061691, 708251877, 709989471, 710999680, 715417023, 717962723, 717110214, 715676422, 710297699, 714134064, 721475906]
3673.3G21475906O996308k377091j5676880M757538P767334M464417j755982J93940
3681G25845490K835693J528702O11877J74561O36139L256607M534072o991348q56399
3689.7G31575394P311096n763092J98822M711456J79749Q78830m50592k7619J756363
3698.4G40370407Q53958K759629K629470m982910k703018L913651K052230P11289N20859
3707G46125565K387847L854447o494446K108154J728440j0025864O217651L565140
3714.8G49466934q5754O06689J295395O05545k583923J995239M432297m806442l602219
3723.4G47323761N033569J439438j698685l353042J036377L875351O13556L091049
3731.2G57361374k953796k529068R267730j603012j1494522R63059L344039J175843
$$ y = [721475906, 728472214, 726095123, 710418243, 715175781, 722943115, 727407532, 725651550, 725845490, 728681183, 730209885, 730821762, 730996323, 731632462, 734889069, 739423141, 732431793, 731575394, 738886490, 733123398, 733322220, 738033676, 738213425, 739092255, 738641663, 738614044, 740370407, 741224365, 743983994, 746613464, 741630554, 738927536, 742841187, 744893417, 745604706, 746125565, 748513412, 752367859, 745873413, 747981567, 749710007, 739684143, 745901794, 749466934, 749381180, 749987869, 751283264, 751888809, 749304886, 751300125, 755732422, 750925980, 747323761, 752357330, 753796768, 752098083, 748745041, 749781418, 753656769, 754270325, 757361374, 754407578, 751878510, 761146240, 759543228, 748048706, 749011765, 752355804, 753531647]
3738.9G53531647K274933K614517k871857K662354Q628845j1301880j0622101R506607
3746.6G54423065N374069N151291n114898r246674R318390o321259l474426O920929
3754.3G57030487M585342K177582n141906K263183M295349p349396q12225L659897
3762G60708313R89075O95266K444001l788300l106232M213105M573517j249314q595581
3770.7G56883850K842331L364639M67072J181412k14005L50647K38419K501068j39008
3779.4G67476425p112732J873245J826020O04019K066040k110596j417694P74460R02557
3788G64881744Q65784p16782n16357N07584Q05664k66724R19952K122651m564057k478790
3797.7G61560669L307877L715972M459839q577499q064346N235061K881470M507141
$$ y = [753531647, 755806580, 758421097, 755549240, 758211594, 766840439, 755538559, 744916458, 754423065, 759797134, 764948425, 759833527, 750586853, 759905243, 753583984, 750109558, 757030487, 761615829, 763793411, 758651505, 760914688, 765210037, 757860641, 757048416, 760708313, 761697388, 762392654, 764836655, 761048355, 757942123, 762155228, 766728745, 765479431, 756883850, 759726181, 763090820, 763557892, 764739304, 764525299, 764875946, 765114365, 767615433, 767476425, 760363693, 762236938, 764062958, 764666977, 766733017, 764622421, 763204727, 763979187, 764881744, 765747528, 765030746, 764514389, 765021973, 765827637, 765560913, 766480865, 768603516, 764039459, 761560669, 764868546, 768584518, 773044357, 764466858, 756402512, 761637573, 764519043, 769026184]
3805.4G69026184M215012r633561l016586M781647J901627O8893Q6060m38462J125870
3814.1G68116684N014725j410599j1434097M504852M699554K969361n06439j6381531
3821.8G55572510L206405N965729K193985K224732q74405m336319O33392K584152L614502
3830.5G70784683k37655q391571M539260O434327p106781m44489O127243r137878j867905
3839.2G60699234P598038m502945R52911O642761k772293l386917K358170N62439m273
3847.8G68147125J076966j449280J796341M203109m879760Q23669j2943115L224106
3855.6G59999161P854233k421952n94177K475052K439651K388611m903488N98373N134964
3864.2G72970428p023239m143600M305038M766999M333648q507538o321640N358353
$$ y = [769026184, 773241196, 763607635, 760591049, 765372696, 767274323, 767343216, 767429276, 766990814, 768116684, 773131409, 771720810, 760286713, 764791565, 769491119, 772460480, 771954041, 755572510, 758778915, 764744644, 766938629, 769163361, 768288956, 763952637, 764586029, 767170181, 770784683, 770547028, 762155457, 766694717, 773129044, 766022263, 765577774, 771705017, 762567139, 760699234, 768297272, 763794327, 764747238, 771389999, 768617706, 765230789, 767588959, 768151398, 768147125, 769224091, 767774811, 769571152, 773774261, 768894501, 769718170, 756775055, 759999161, 767853394, 765431442, 764837265, 767312317, 769751968, 772140579, 767237091, 767835464, 772970428, 765947189, 761803589, 766108627, 770875626, 775209274, 766701736, 760380096, 765738449]
3871.9G65738449N976563J278457r699020J210251L013839k02636K323684L642121
3879.7G73281708n820008n452957N648804J053085J414185J761932j1701355L604813
3887.4G63790207M114532J128388M150543p03430p209168O33164K460022l73459J458588
3896.1G69449387l6545N91965k2660o476288O162415Q21152m455643N078430k715454
3904.7G68396759k563477j34277J266022J539230o42853M04816k99225K61536Q89969
3913.4G69118500l19824M75235J248321l358078k288666L943329m12140k317581K005997
3922.1G68095093R00879P09304k311096k356949J884308J475220Q18863j414795p37762
3930.8G67063065J517257k191009k69318J849671l45002M49677R94491M197o95191
$$ y = [765738449, 771715012, 772993469, 763294449, 764504700, 767518539, 767315903, 769639587, 773281708, 767461700, 762008743, 767657547, 768710632, 770124817, 771886749, 760185394, 763790207, 767904739, 769033127, 773183670, 772480240, 765271072, 765904236, 768364258, 767990799, 769449387, 769412842, 770004807, 769982147, 763505859, 769668274, 770489426, 766033783, 771112213, 768396759, 765833282, 765699005, 766965027, 768504257, 767861404, 768266220, 767966995, 768228531, 769118500, 768798676, 769273911, 770522232, 767164154, 764875488, 768818817, 768406677, 766089096, 768095093, 768995972, 769705276, 767394180, 765037231, 766921539, 768396759, 769215622, 767800827, 767063065, 768580322, 766389313, 766119995, 767969666, 767624664, 768074341, 769068832, 769073029, 768377838]
3939.5G68377838m51584J233979j28251l346633M13055J716385Q43048L47137k384948
3948.1G66620026K89535J19629j193390K293167J11771m12903L70865m68674j76697
3956.8G67553329j010208O70243L98101j5335L30353j289825P0495L34244l71017j99204
3966.5G66471176K40784N98984j11924O8436M04739q9798q08410R7198J149292m87976
3976.1G67532501r35211L83987N4093J53580R24301r4910p67746l1204K94266l31040
3985.7G67182617k99759J23062p629L51028n7144k01111J22529O8740O70166l4637
3995.4G67917862p30896L27530L39279n56412K00272
4000.2G67497635
$$ y = [768377838, 767926254, 769160233, 769031982, 765685349, 766098404, 767814789, 768657837, 769004974, 766620026, 766909561, 767029190, 765835800, 768128967, 768240738, 767827835, 768198700, 767730026, 767553329, 766543121, 767213364, 767611465, 767596130, 767926483, 766636658, 766707153, 767041397, 766670380, 766471176, 766711960, 767310944, 767199020, 767267456, 767672195, 767582397, 766773987, 766871185, 768020477, 767532501, 766597290, 766981277, 767035370, 767188950, 768113251, 768018341, 767250595, 767219391, 767513657, 767182617, 766882858, 767005920, 766998291, 767349319, 767292175, 767091064, 767213593, 767282333, 767952499, 767917862, 767186966, 767514496, 767853775, 767297363, 767497635]
##END=$$ End of the data block
