##TITLE=$$ Begin of the data block
##JCAMP-DX=5.00 $$ ACD/SpecManager v 10.08
##SPECTROMETER/DATA SYSTEM=Varian
##DATE=08 Jan 2013 15:02:02
##DATA TYPE=INFRARED SPECTRUM
##DATA CLASS=XYDATA
##ORIGIN=
##OWNER=
##NPOINTS=3735
##FIRSTX=399.26403809
##LASTX=4000.35498047
##MAXX=4000.35498047
##MINX=399.26403809
##MAXY=70.43825531
##MINY=35.82499313
##XFACTOR=1.0000000000
##YFACTOR=0.000000100000000
##FIRSTY=52.85739517
##DELTAX=0.96440572
##XUNITS=1/CM
##YUNITS=TRANSMITTANCE
##XYDATA=(X++(Y..Y))
$$ plain form
399.3 528573952 521321220 531938057 534438515 530982437 529555283 537794418 537582779 522201157
407 522201157 524860153 528413696 523040428 524777985 524153709 521961632 518998070 516521301 518286247
415.7 518286247 523757629 529930992 539651070 532595711 526357956 532803116 532277527 529391022 527973404
424.3 527973404 525064926 526830292 522901802 521845779 523708153 521592140 520336571 519759560 521210365
433 521210365 521230736 520477753 524456711 529741592 528541069 525228233 523254204 522940216 525490379
441.7 525490379 526739807 528742981 530016556 529386482 525031815 518730888 519947548 522714043 526066818
450.4 526066818 525767021 522192078 521501160 520857697 521215210 524288063 532235641 533437729 529378471
459.1 529378471 527306633 519990425 516076241 514985313 516828918 516025429 514207649 519044228 520847664
$$ packed form
399.3E28573952p252732J0616837K500458l456078j427154Q239135k11639j5381622
407E22201157K658996L553543n373268J737557o24276k192077k963562k476769J764946
415.7E18286247N471382O173363R720078p055359o237755O445160n25589k886505j417618
424.3E27973404k908478J765366l928490j056023J862374k116013j255569n77011J450805
433E21210365K0371p52983L978958N284881j200523l312836j974029l13988K550163
441.7E25490379J249428K003174J273575o30074m354667o300927J216660K766495L352775
450.4E26066818k99797l574943o90918o43463L57513L072853P947578J202088m059258
459.1E29378471k071838p316208l914184j090928J843605q03489j817780M836579J803436
$$ plain form
467.7 520847664 522800751 526119308 525877495 525597763 522742043 518210220 517187653 518297081 515591583
476.4 515591583 512010651 513830223 515122795 515258636 514846268 512515831 513850174 518651276 522181664
485.1 522181664 521599197 519231186 520171738 519384499 518540840 519875603 518027611 514944000 512194557
493.8 512194557 511453056 511983910 512900810 513673592 513432426 516251297 519805946 518384590 513314705
502.5 513314705 511906319 512646675 515418396 516580200 513631554 515120201 514478073 510973778 512296829
511.1 512296829 513643684 512548332 511285744 511766930 512469368 513104935 513933144 512822151 510597992
519.8 510597992 508865204 508871880 509662056 509710770 509067192 509334908 509392891 509580650 511390762 509929314
529.5 509929314 506554413 505861664 506136093 506114960 506340942 507428780 507917786 507086563 507050247 506220703
$$ packed form
467.7E20847664J953087L318557k41813k79732k855720m531823j022567J109428k705498
476.4E15591583l580932J819572J292572J35841m12368k330437J334343M801102L530388
485.1E22181664n82467k368011R40552p87239q43659J334763j847992l083611k749443
493.8E12194557p41501N30854R16900P72782k41166K818871L554649j421356n069885
502.5E13314705j408386P40356K771721J161804k948646J488647o42128l504295J323051
511.1E12296829J346855j095352j262588M81186P02438O35567Q28209j110993k224159
519.8E10597992j732788O676P90176M8714o43578K67716N7983J87759J810112j461448
529.5E09929314l374901o92749K74429k1133K25982J087838M89006q31223l6316q29544
$$ plain form
539.1 506220703 505231476 506759415 507004623 505667648 505146103 505429764 505240135 503067856 503452187
547.8 503452187 504851990 504378853 504554024 503581429 501379509 500970840 502598114 501797676 500511322
556.5 500511322 501489944 500924187 500616570 500304718 498912735 500001106 502550392 503048897 501867790
565.1 501867790 501109657 500948906 500260239 499227943 499957466 500786324 501551208 503222542 503056755
573.8 503056755 502730408 502793846 500506439 499226723 500558014 500878448 500448875 501427689 500724907
582.5 500724907 500226517 501807060 502163010 501970062 502732506 501908417 500388680 501757050 503246002
591.2 503246002 502533073 501718712 501794548 501889801 502309532 504158821 504397316 503580589 503494034 503193588
600.8 503193588 503754120 503503761 501875305 501019669 500775185 500350227 500925446 501732483 501373329 500525703
$$ packed form
539.1E06220703r89227J527939K45208j336975n21545K83661j89629k172279L84331
547.8E03452187J399803m73137J75171r72595k201920m08669J627274q00438j286354
556.5E00511322R78622n65757l07617l11852j391983J088371K549286M98505j181107
565.1E01867790p58133j60751o88667j032296P29523Q28858P64884J671334j65787
573.8E03056755l26347O3438k287407j279716J331291L20434m29573R78814p02782
582.5E00724907m98390J580543L55950j92948P62444q24089j519737J368370J488952
591.2E03246002p12929q14361P5836R5253M19731J849289K38495q16727q6555l00446
600.8E03193588N60532k50359j628456q55636k44484m24958N75219Q07037l59154q47626
$$ plain form
610.5 500525703 499668465 499839516 499199677 498140450 498318748 498849754 499633102 499083214 498300819 498113785
620.1 498113785 498470573 498897057 499269753 500866547 501510048 501909866 503001785 503481140 503483162 503702927
629.8 503702927 505306168 506632576 506899605 506993675 507325478 507763519 508461304 509501419 510172081
638.4 510172081 511560745 512943306 514022255 514437027 513378983 513289032 513937759 514991188 516073570
647.1 516073570 516614532 516748352 516860046 518104553 518230286 518673782 520850487 521406784 520339851
655.8 520339851 519753189 520052338 519523773 518550110 518192139 518719940 518731689 517810669 518067093 518727531
665.4 518727531 520108681 523365631 527548637 524538765 521988182 521737785 522470894 521895447 521610680
674.1 521610680 521697845 521606293 522853546 525137558 526281090 526393204 527214890 528697357 528720856 528206444
$$ packed form
610.5E00525703q57238J71051o39839j059227J78298N31006P83348n49888p82395j87034
620.1D98113785L56788M26484L72696J596794O43501L99818J091919M79355K022K19765
629.8E03702927J603241J326408K67029R4070L31803M38041O97785J040115O70662
638.4E10172081J388664J382561J078949M14772j058044q9951O48727J053429J082382
647.1E16073570N40962J33820J11694J244507J25733M43496K176705N56297j066933
655.8E20339851n86662K99149n28565r73663l57971N27801J1749r21020K56424O60438
665.4E18727531J381150L256950M183006l009872k550583k50397P33109n75447k84767
674.1E21610680Q7165r1552J247253K284012J143532J12114Q21686J482467K3499n14412
$$ plain form
683.8 528206444 528685112 528768578 528911362 529745445 530418816 530742493 531684990 532875328 533311081 533313942
693.4 533313942 533077240 532781868 532201843 532186279 532315865 532485809 534170151 535315132 535134354 534874840
703.1 534874840 534943390 535569191 536085892 536163635 536226463 536551895 537432137 538600769 538536186 538378410
712.7 538378410 539087753 539700165 540600166 540972176 540879364 540909195 541341133 541847610 540978394 540691299
722.3 540691299 542524834 543783379 543745956 544541702 545239296 546270905 547288017 547277985 547599220
731 547599220 547234840 548423233 549787788 549183464 549302864 549306526 550145683 550832596 550748558 551612358
740.7 551612358 552717056 553429756 553194504 553449783 554038086 555006866 556285744 556461639 555988655
749.3 555988655 556078110 557449722 557735634 557856216 558861504 559071999 559341621 559845772 560787544 562113914
$$ packed form
683.8E28206444M78668Q3466J42784Q34083O73371L23677R42497J190338M35753K861
693.4E33313942k36702k95372n80025j5564J29586J69944J684342J144981j80778k59514
703.1E34874840O8550O25801N16701P7743O2828L25432Q80242J168632o4583j57776
712.7E38378410P09343O12412R00001L72010r2812K9831M31938N06477q69216k87095
722.3E40691299J833535J258545l7423P95746O97594J031609J017112j0032L21235
731E47599220l64380J188393J364555o04324J19400L662Q39157O86913q4038Q63800
740.7E51612358J104698P12700k35252K55279N88303R68780J278878J75895m72984
749.3E55988655Q9455J371612K85912J20582J005288K10495K69622N04151R41772J326370
$$ plain form
759 562113914 563394508 563977280 563819084 563743248 564306145 565105286 564552917 564048386 564884109 565458565
768.6 565458565 565293465 566119995 566661072 566081619 566359749 566261139 566209068 566579704 566671486 566848946
778.3 566848946 566782455 566456833 565875511 565753326 566144104 567253456 568445396 569941330 570278244
787 570278244 568681488 569381599 570407333 570044441 569741669 570050964 570242577 569480972 569404030 569425201
796.6 569425201 570655937 571188164 570848045 571386185 570490837 569523926 568161926 567582054 567439995
805.3 567439995 566312027 565244255 563822708 563201752 562650070 562182808 561415138 560591774 560307159
814 560307159 559436035 558808441 558454247 558200455 557429352 557666397 559032326 559470406 559612274 560173950
823.6 560173950 561173630 562470779 564835052 566700554 568581276 569983521 570182953 572491760 574810867
$$ packed form
759E62113914J280594N82772j58196p5836N62897P99141n52369n04531Q35723N74456
768.6E65458565j65100Q26530N41077n79453K78130r8610n2071L70636R1782J77460
778.3E66848946o6491l25622n81322j22185L90778J109352J191940J495934L36914
787E70278244j596756P00111J025734l62892l02772L09295J91613p61605p6942K1171
796.6E69425201J230736N32227l40119N38140q95348r66911j362000n79872j42059
805.3E67439995j127968j067772j421547o20956n51682m67262p67670q23364k84615
814E60307159q71124o27594l54194k53792p71103K37045J365929M38080J41868N61676
823.6E60173950R99680J297149K364273J865502J880722J402245J99432K308807K319107
$$ plain form
832.3 574810867 576761475 578240509 579979248 582128029 582939339 584449043 585350189 587105942 588298798
841 588298798 588398895 589745445 590669670 592057190 592689819 593204689 593881836 594848366 595723801 596307182
850.6 596307182 597712479 597353745 597576141 598349113 599230385 600665970 601198807 602303810 604244232
859.3 604244232 606621437 606724205 605959663 605904617 606529083 607610664 607574272 607743263 607089005 606931458
868.9 606931458 606346169 604947052 604492607 603463478 602801476 602267761 602353630 601873856 600777588
877.6 600777588 600493851 600222359 600301514 599721947 599143448 598856354 598845406 598597260 597730217 596824379
887.3 596824379 595854683 596019402 595809669 595008812 594628258 594524574 594218216 593762970 593913612 593556633
896.9 593556633 593451233 593608170 593196373 592508736 591932144 591407890 590939293 591151237 591791840 593618660
$$ packed form
832.3E74810867J950608J479034J738739K148781Q11310J509704R01146J755753J192856
841E88298798J00097J346550R24225J387520O32629N14870O77147R66530Q75435N83381
850.6E96307182J405297l58734K22396P72972Q81272J435585N32837J105003J940422
859.3F04244232K377205J02768p64542n5046O24466J081581l6392J68991o54258j57547
868.9F06931458n85289j399117m54445j029129o62002n33715Q5869m79774j096268
877.6F00777588k83737k71492P9155n79567n78499k87094j0948k48146q67043r05838
887.3E96824379r69696J64719k09733q00857l80554j03684l06358m55246J50642l56979
896.9E93556633j05400J56937m11797o87637n76592n24254m68597K11944O40603J826820
$$ plain form
906.5 593618660 595402145 596896515 598120804 598224754 598784142 599238510 599518661 598989906 598061142
915.2 598061142 597467842 597181473 596923180 595639076 594605103 592802162 591649170 590674820 588072472
923.9 588072472 586710434 586166801 584954491 582747917 581114693 579917793 578806458 577705002 575885277
932.6 575885277 574669609 572938766 571619835 571104927 570669174 570393906 569433556 569115944 568851318
941.3 568851318 567836838 566413116 565460701 564316559 562523956 561778564 561105232 560567703 560466576
949.9 560466576 560630493 560382462 559668427 560147095 560131073 558788986 557560501 556905098 555620728
958.6 555620728 553749924 552033920 550459557 549632835 548764229 548122520 547501183 546524696 545810852
967.3 545810852 544643707 543382225 542200241 540858040 539019699 536856155 535436745 534520302 533158455
$$ packed form
906.5E93618660J783485J494370J224289J03950N59388M54368K80151n28755r28764
915.2E98061142n93300k86369k58293j284104j033973j802941j152992r74350k602348
923.9E88072472j362038n43633j212310k206574j633224j196900j111335j101456j819725
932.6E75885277j215668j730843j318931n14908m35753k75268r60350l17612k64626
941.3E68851318j014480j423722r52415j144142j792603p45392o73332n37529j01127
949.9E60466576J63917k48031p14035M78668j6022j342087j228485o55403j284370
958.6E55620728j870804j716004j574363q26722q68606o41709o21337r76487p13844
967.3E45810852j167145j261482j181984j342201j838341k163544j419410r16443j361847
$$ plain form
976 533158455 531457214 530177269 529078484 526930389 523886604 521357079 518145790 514509773 511956902
984.7 511956902 509536667 507457924 505222206 502827301 501039314 498669548 495977097 493841972
992.4 493841972 491999474 490554008 488901634 486252861 483720627 481977882 480177498 478746605
1000.1 478746605 477628632 475874519 474982071 474485207 472781219 470732079 469000053 467321815 465328712
1008.8 465328712 463985291 462397003 460720329 459893074 458464928 457085342 455734215 454672356
1016.5 454672356 453259468 451461525 450046959 448302193 447159729 445359077 443763084 442365799
1024.2 442365799 440796661 440272598 439120827 438403587 437756386 437055359 436411781 435600815 434880447
1032.9 434880447 433660927 433928490 434570236 435022469 436466026 438110847 439157028 440445404 442126694
$$ packed form
976E33158455j701241j279945j098785k148095l043785k529525l211289l636017k552871
984.7E11956902k420235k078743k235718k394905j787987k369766k692451k135125
992.4D93841972j842498j445466j652374k648773k532234j742745j800384j430893
1000.1D78746605j117973j754113q92448m96864j703988k049140j732026j678238j993103
1008.8D65328712j343421j588288j676674q27255j428146j379586j351127j061859
1016.5D54672356j412888j797943j414566j744766j142464j800652j595993j397285
1024.2D42365799j569138n24063j151771p17240o47201p01027o43578q10966p20368
1032.9D34880447j219520K67563O41746M52233J443557J644821J046181J288376J681290
$$ plain form
1041.6 442126694 443126602 443936806 443942642 443683662 443545074 443644829 443652458 442926407 442625809 441739693
1051.2 441739693 441139832 440872612 440368996 440219765 439833336 439075203 438027687 438300743 438171425
1059.9 438171425 438259697 439896965 440799026 441153221 442300911 444820480 446048965 446260414 446785278
1068.6 446785278 448000679 449044228 448736229 449848022 450630112 450145569 450135536 450614853 451257248
1077.2 451257248 451543198 451809692 452076492 452834435 452755318 452687950 452612534 452303467 453756218 454547081
1086.9 454547081 455009651 455559654 455764351 456729927 458245354 459632072 460254173 460953751 461569901
1095.6 461569901 462538109 463197365 463052483 463670120 464578285 464769135 464705582 465557709 466270447 466488914
1105.2 466488914 466718903 468076935 470106049 470616913 470784149 470526772 470786591 471477280 471685066
$$ packed form
1041.6D42126694R99908Q10204N836k58980j38588R9755P629p26051l00598q86116
1051.2D41739693n99861k67220n03616j49231l86429p58133j047516K73056j29318
1059.9D38171425Q8272J637268R02061L54195J147690K519569J228485K11449N24864
1068.6D46785278J215401J043549l07999J111793P82090m84543j0033M79317O42395
1077.2D51257248K85950K66494K66800P57943p9117o7368p5416l09067J452751P90863
1086.9D54547081M62570N50003K04697R65576J515427J386718O22101O99578O16150
1095.6D61569901R68208O59256j44882O17637R08165J90850o3553Q52127P12738K18467
1105.2D66488914K29989J358032K029114N10864J67236k57377K59819O90689K07786
$$ plain form
1113.9 471685066 472817001 473678932 474255371 474838982 475486755 475910606 475982170 476121979 475474968 475054550
1123.5 475054550 475137901 475588036 476714821 477847366 478047562 478182106 479629478 481457253 483239288
1132.2 483239288 484043007 484810562 486719780 488098068 488566017 489343796 491215248 493101845 494547462
1140.9 494547462 495422325 495680008 496419449 497772026 498349762 497864952 498599625 499955673 500327110
1149.6 500327110 500450096 500153313 499881630 499635315 499413986 499549294 499431343 499348564 498660469 497687416
1159.2 497687416 497753105 498079796 497912788 497632523 497790565 498366661 499000931 499648705 500679245 502733650
1168.9 502733650 505535545 507660446 509324379 511547852 514044991 516050682 518051453 520346146
1176.6 520346146 522294807 523806953 525176620 526709518 528563080 530715675 532451820 534181519
$$ packed form
1113.9D71685066J131935Q61931N76439N83611O47773M23851P1564J39809o47011m20418
1123.5D75054550Q3351M50135J126785J132545K00196J34544J447372J827775J782035
1132.2D83239288Q03719P67555J909218J378288M67949P77779J871452J886597J445617
1140.9D94547462Q74863K57683P39441J352577N77736m84810P34673J356048L71437
1149.6E00327110J22986k96783k71683k46315k21329J35308j17951q2779o88095r73053
1159.2D97687416O5689L26691j67008k80265J58042N76096O34270O47774J030540K054405
1168.9E02733650K801895K124901J663933K223473K497139K005691K000771K294693
1176.6E20346146J948661J512146J369667J532898J853562K152595J736145J729699
$$ plain form
1184.3 534181519 535912857 537309990 538440628 539090538 539926605 540131607 540263672 540754089 541052361
1193 541052361 541144447 540687027 540112686 539432945 539360008 539149170 538647423 538241997 537044601 535728073
1202.6 535728073 534410858 533495064 532697830 531626396 530841408 530310287 530237236 530515556 530557899 529827118
1212.3 529827118 528998489 528359413 527765503 527231064 526449738 526166229 526155014 525862007 525931015 526391830
1221.9 526391830 526036148 525128860 525034065 524759064 523930969 523061981 522106209 521681709 521851540 521627769
1231.5 521627769 520807877 520270767 520066643 519885597 519629021 519419327 519559669 519579124 519197044 518897209
1241.2 518897209 518862190 518737335 518535881 518589935 519089165 519251442 518428421 517636528 517201080 516904488
1250.8 516904488 516517372 516292076 516339073 515769386 515568504 516005211 516002426 515933456 516060104 516412849
$$ packed form
1184.3E34181519J731338J397133J130638O49910Q36067K05002J32065M90417K98272
1193E41052361R2086m57420n74341o79741p2937k10838n01747m05426j197396j316528
1202.6E35728073j317215r15794p97234j071434p84988n31121p3051K78320M2343p30781
1212.3E29827118q28629o39076n93910n34439p81326k83509j1215k93007O9008M60815
1221.9E26391830l55682r07288r4795k75001q28095q68988r55772m24500J69831k23771
1231.5E21627769q19892n37110k04124j81046k56576k09694J40342J9455l82080k99835
1241.2E18897209l5019j24855k01454N4054M99230J62277q23021p91893m35448k96592
1250.8E16904488l87116k25296M6997n69687k00882M36707k785o8970J26648L52745
$$ plain form
1260.5 516412849 516549911 516461525 516691399 517108574 517314377 517443810 518178978 518906136 519305420 519808617
1270.1 519808617 520434952 521196365 521630859 522018280 522848473 523673363 524141617 524961090 525824661 526334076
1279.8 526334076 527122498 527765160 528464317 529357300 530305405 531258850 531993446 532665100 533064728 533440590
1289.4 533440590 533852386 534086075 534327240 535123177 535953255 536412392 536778107 536883354 537134094 537049866
1299 537049866 536819153 536679039 536612701 536830559 536777916 536644173 536569519 536732140 536466064 535854568
1308.7 535854568 535535393 535204735 534751053 533630867 532797508 532226944 531690750 531786880 531835556 532228203
1318.3 532228203 533003578 533615646 534169655 534515190 534908257 535383644 535462837 535444183 535488129 535490227
1328 535490227 535519791 534981995 534668312 534664993 534540291 534434319 534083405 534012909 533655281 533193398 533236809
$$ packed form
1260.5E16412849J37062q8386K29874M17175K05803J29433P35168P27158L99284N03197
1270.1E19808617O26335P61413M34494L87421Q30193Q24890M68254Q19473Q63571N09415
1279.8E26334076P88422O42662O99157Q92983R48105R53445P34596O71654L99628L75862
1289.4E33440590M11796K33689K41165P95937Q30078M59137L65715J05247K50740q4228
1299E37049866k30713j40114o6338K17858n2643j33743p4654J62621k66076o11496
1308.7E35854568l19175l30658m53682j120186q33359n70564n36194R6130M8676L92647
1318.3E32228203P75375O12068N54009L45535L93067M75387P9193j8654M3946K098
1328E35490227K9564n37796l13683l319j24702j05972l50914p0496l57628m61883M3411
$$ plain form
1338.6 533236809 533730392 533873367 533651695 534261436 534672050 535240784 535932312 536113548 536298828 536499214
1348.2 536499214 537105789 536868629 536657333 536644745 536014481 535757561 535498123 535179405 535027275 535255699
1357.9 535255699 534906921 534784584 535227509 535307503 535670509 534271660 533864479 533977509 533183861 532663383
1367.5 532663383 531795158 531304932 531290550 531712570 532084351 532117538 531792603 531228600 531651993 531641350
1377.2 531641350 531358337 531163750 530951424 530374985 529344101 528524399 527910118 527671661 527767715 528266258
1386.8 528266258 526764488 525348816 525057030 523772278 522812653 521982536 521235542 519155197 516055717
1395.5 516055717 515772400 515531540 514681892 512289429 510517616 510041237 508855515 507438698 506345253
1404.2 506345253 503773308 501254120 500642548 500128250 499332809 498282852 497167511 496422615 495558357
$$ packed form
1338.6E33236809M93583J42975k21672O09741M10614N68734O91528J81236J85280K00386
1348.2E36499214O06575k37160k11296j2588o30264k56920k59438l18718j52130K28424
1357.9E35255699l48778j22337M42925P9994L63006j398849m07181J13030p93648n20478
1367.5E32663383q68225m90226j4382M22020L71781L3187l24935n64003M23393j0643
1377.2E31641350k83013j94587k12326n76439j030884q19702o14281k38457R6054M98543
1386.8E28266258j501770j415672k91786j284752r59625q30117p46994k080345l099480
1395.5E16055717k83317k40860q49648k392463j771813m76379j185722j416817j093445
1404.2E06345253k571945k519188o11572n14298p95441j049957j115341p44896q64258
$$ plain form
1412.8 495558357 495087967 494382629 493303223 492454185 491690407 491582336 488090591 487418709 489361115
1421.5 489361115 490175095 490703964 490547943 490949898 491968307 492191811 492617989 492790985 492481079
1430.2 492481079 492686996 493663177 494204445 494962349 497255173 499273148 498976097 499249306 501464806
1438.9 501464806 502750893 503420792 504766426 505485573 506372147 507063675 508162880 509900665 510888100
1447.6 510888100 510785675 512220154 514264183 515001755 515675545 516539383 517869987 518908997 519258842
1456.2 519258842 519545708 518944435 521203194 522597656 524883919 526717033 528095894 530646057 530493279
1464.9 530493279 530556831 532132988 533933983 535706139 537417221 540378227 542835388 543653641 543720856
1473.6 543720856 546078148 549510384 550360489 550943031 553271523 555327911 556396370 556303177 556820488
$$ packed form
1412.8D95558357m70390p05338j079406q49038p63778j08071l491745o71882J942406
1421.5D89361115Q13980N28869j56021M01955J018409K23504M26178J72996l09906
1430.2D92481079K05917R76181N41268P57904K292824K017975k97051K73209K215500
1438.9E01464806J286087O69899J345634P19147Q86574O91528J099205J737785R87435
1447.6E10888100j02425J434479K044029P37572O73790Q63838J330604J039010L49845
1456.2E19258842K86866o01273K258759J394462K286263J833114J378861K550163j52778
1464.9E30493279O3552J576157J800995J772156J711082K961006K457161Q18253O7215
1473.6E43720856K357292L432236Q50105N82542K328492K056388J068459r3193N17311
$$ plain form
1482.3 556820488 558207321 559312706 560127029 561676102 562309113 561383972 562875862 562465286 560189095
1491 560189095 560478172 560778122 560314674 560362930 561356201 556967239 556956749 557073250 554664536 555133934
1500.6 555133934 554633636 553649559 553256493 554409218 556115837 554526215 548044930 546454697 547709465
1509.3 547709465 547452469 548965302 548618088 546823311 547810669 548072853 547598190 545686684 542794075
1518 542794075 543913536 546188354 545553398 542267723 541790428 542343864 544082603 542295074 541849022
1526.6 541849022 542551193 541165428 540543900 540694427 540919456 540694885 540263290 537232056 538073959
1535.3 538073959 539255371 540024719 542055244 539860039 535520515 536992645 538099976 536193542
1543 536193542 536960716 537684441 535106773 536487846 536899872 537654648 537795067 536041565 536782570
$$ packed form
1482.3E56820488J386833J105385Q14323J549073O33011r25141J491890m10576k276191
1491E60189095K89077K99950m63448M8256R93271m388962j0490J16501k408714M69398
1500.6E55133934n00298r84077l93066J152725J706619j589622o481285j590233J254768
1509.3E47709465k56996J512833l47214j794777R87358K62184m74663j911506k892609
1518E42794075J119461K274818o34956l285675m77295N53436J738739j787529m46052
1526.6E41849022P02171j385765o21528J50527K25029k24571m31595l031234Q41903
1535.3E38073959J181412P69348K030525k195205m339524J472130J107331j906434
1543E36193542P67174P23725k577668J381073M12026P54776J40419j753502P41005
$$ plain form
1551.7 536782570 537103043 538419571 536231155 534970665 537196693 540534134 540713768 529373016
1559.4 529373016 528790665 529734993 531107788 531103630 531220245 529205971 527226372 527400856 526974106
1568.1 526974106 527484016 520065880 518212776 517998734 516273918 515020142 514342766 515101509 504575958
1576.8 504575958 503726807 503067474 501497002 499765205 496165657 494061623 490682297 488712082 485853195
1585.5 485853195 483395081 481136131 478116264 476437645 473116951 471731453 468760376 466839561
1593.2 466839561 464887161 461959572 460663185 457756844 456560555 454097519 452867012 451164322
1600.9 451164322 449592476 448771286 446066856 445119820 443096695 442728119 440999184 440194130 439344025
1609.6 439344025 437164764 437558403 435875854 435961571 434943275 435890236 437897644 430857887 431572800
$$ packed form
1551.7E36782570L20473J316528k188416j260490K226028L337441J79634j1340752
1559.4E29373016n82351R44328J372795m158J16615k014274j979599J74484m26750
1568.1E26974106N09910p418136j853104k14042j724816j253776o77376P58743j0525551
1576.8E04575958q49151o59333j570472j731797l599548k104034l379326j970215k858887
1585.5D85853195k458114k258950l019867j678619l320694j385498k971077j920815
1593.2D66839561j952400k927589j296387k906341j196289k463036j230507j702690
1600.9D51164322j571846q21190k704430r47036k023125l68576j728935q05054q50105
1609.6D39344025k179261L93639j682549Q5717j018296R46961K007408p039757P14913
$$ plain form
1618.2 431572800 431495476 432287636 431677513 432602386 432850533 429567947 429810791 429709625 431959457
1626.9 431959457 431204910 430434532 430998650 431729050 432362251 431918488 433826027 435326042 434411888
1635.6 434411888 432143478 433986931 434631805 435458755 436962318 436456451 437891350 437958565 439645042
1644.3 439645042 442229004 442012215 442872925 441741982 443649063 444718208 447226639 450231056 455204086
1653 455204086 448287239 446025925 449438019 450908279 452460785 453263893 454518127 455927505 457294884
1661.6 457294884 458992500 458096352 460384979 461814537 463371086 465480461 467679367 468547630 468418121
1670.3 468418121 472202148 473078537 475475159 479070244 480526505 480378227 482951546 485893440 487505188
1679 487505188 490685501 492035027 494892807 500227051 503827553 503028221 502913818 507307549 510657883
$$ packed form
1618.2D31572800p7324P92160o10123R24873K48147l282586K42844j01166K249832
1626.9D31959457p54547p70378N64118P30400O33201m43763J907539J500015r14154
1635.6D34411888k268410J843453O44874Q26950J503563n05867J434899O7215J686477
1644.3D39645042K583962k16789Q60710j130943J907081J069145K508431L004417M973030
1653D55204086o916847k261314L412094J470260J552506Q03108J254234J409378J367379
1661.6D57294884J697616q96148K288627J429558J556549K109375K198906Q68263j29509
1670.3D68418121L784027Q76389K396622L595085J456261j48278K573319K941894J611748
1679D87505188L180313J349526K857780N334244L600502p99332j14403M393731L350334
$$ plain form
1687.7 510657883 513119621 515977783 517723732 520272903 523075294 526563110 531169090 537040367
1695.4 537040367 536294441 537977486 542765083 548432617 552029915 545255241 551381378 556400871
1703.1 556400871 559746132 561516991 564159470 566341858 568245888 571927414 574281197 575418282
1710.8 575418282 577456894 579885559 582731857 583354874 583295860 587180595 591147842 586213264 587376671
1719.5 587376671 590516472 592444038 594159737 595445328 596130180 597462502 598736420 599570732 600739746
1728.2 600739746 602606850 602312012 601746140 605313148 609674606 609239502 603447876 606410751 609994049
1736.9 609994049 611868401 615001945 615945740 612816277 615813675 618781586 618797302 619464684 622445297
1745.5 622445297 625348091 627604408 629202232 629410515 632960625 634537163 634256592 637698517 640003738
$$ packed form
1687.7E10657883K461738K858162J745949K549171K802391L487816M605980N871277
1695.4E37040367p45926J683045M787597N667534L597298o774674O126137N019493
1703.1E56400871L345261J770859K642479K182388J904030L681526K353783J137085
1710.8E75418282K038612K428665K846298O23017n9014L884735L967247m934578J163407
1719.5E87376671L139801J927566J715699J285591O84852J332322J273918Q34312J169014
1728.2F00739746J867104k94838n65872L567008M361458m35104n791626K962875L583298
1736.9F09994049J874352L133544R43795l129463K997398K967911J5716O67382K980613
1745.5F22445297K902794K256317J597824K08283L550110J576538k80571L441925K305221
$$ plain form
1754.2 640003738 642571182 645611725 645192261 646140289 648485031 650614777 654225845 653536835 652142944
1762.9 652142944 654856415 656556625 657865219 659668732 661662445 659701080 660808105 664943314
1770.6 664943314 666717224 665243454 661831055 664778671 666963654 666140900 667634964 668405151 670167236
1779.3 670167236 671144943 669950256 670657501 672150116 673418045 672869720 672832870 674281235 675230865
1788 675230865 675733109 677363586 678609238 679584122 677932892 676071472 678881226 680120239 679454956
1796.7 679454956 680058365 682017593 682666397 680975342 682647171 682471237 682356796 684063034 684651794
1805.3 684651794 685166473 685301285 685257263 685842896 686673508 685489502 685773697 686954880 687309723
1814 687309723 688375854 688785553 689603882 689219513 689022903 689816360 689830856 690535507 690215607 691125412
$$ packed form
1754.2F40003738K567444L040543m19464R48028K344742K129746L611068o89010j393891
1762.9F52142944K713471J700210J308594J803513J993713j961365J107025M135209
1770.6F64943314J773910j473770l412399K947616K184983q22754J494064P70187J762085
1779.3F70167236R77707j194687P07245J492615J267929n48325l6850J448365R49630
1788F75230865N02244J630477J245652R74884j651230j861420K809754J239013o65283
1796.7F79454956O03409J959228O48804j691055J671829j75934j14441J706238N88760
1805.3F84651794N14679J34812m4022N85633Q30612j184006K84195J181183L54843
1814F87309723J066131M09699Q18329l84369j96610P93457J4496P04651l19900R09805
$$ plain form
1823.7 691125412 692880783 691083069 690408859 692115402 694432602 695602798 692062683 691295929 693011551
1832.3 693011551 693064957 693324356 694104538 694785309 694658127 693641739 694647903 695062637 695777817
1841 695777817 696455841 697843628 699255829 693307495 694023819 696070633 696098328 695994339 696597290
1849.7 696597290 697628326 697527161 698059921 698226700 698241348 698045502 697681656 697969971 697897644 698217621
1859.3 698217621 698116150 698620987 699188461 699593735 699807892 699834900 700640182 700345001 701120071 700836563
1869 700836563 698580780 698480530 699394760 700414963 700331726 700662766 700744553 700935516 701323700 701311951
1878.6 701311951 701096344 700468597 700763550 700706863 701157684 701220398 700738449 701168976 701112595 702315369
1888.3 702315369 703035049 701226425 700746231 701439896 701669693 701905289 701800461 700694275 701324158
$$ packed form
1823.7F91125412J755371j797714o74210J706543K317200J170196l540115p66754J715622
1832.3F93011551N3406K59399P80182O80771j27182j016388J006164M14734P15180
1841F95777817O78024J387787J412201n948334P16324K046814K7695j03989O02951
1849.7F96597290J031036j01165N32760J66779J4648j95846l63846K88315p2327L19977
1859.3F98217621j01471N04837N67474M05274K14157K7008Q05282k95181P75070k83508
1869G00836563k255783j00250R14230J020203q3237L31040Q1787J90963L88184j1749
1878.6G01311951k15607o27747K94953n6687M50821O2714m81949M30527n6381J202774
1888.3G02315369P19680j808624m80194O93665K29797K35596j04828j106186O29883
$$ plain form
1896.9 701324158 702066650 702157059 702058487 702207489 702643509 702192307 702198257 702059250 702022171 702146378
1906.6 702146378 702177048 702461624 702581406 702443161 701935806 702424545 702416840 702620163 702687454 702618713
1916.2 702618713 704382553 702595673 700752258 701877060 702262421 702775116 702539368 701660156 701787949
1924.9 701787949 702179031 702125931 702245865 702248230 702457886 702547150 702212296 702391510 701990585 702017822
1934.6 702017822 701941681 701504593 701492538 701524200 701862488 701898651 703093262 703034515 700559998 700828018
1944.2 700828018 701679001 701705322 701321182 701172409 700988693 700707397 700767975 700924988 700709839 700643692
1953.8 700643692 701026535 700760345 700662308 700521393 700287247 700230255 700010223 699857559 699716873 700223160
1963.5 700223160 700149994 700180435 700758896 700487976 699973679 699552078 699600067 699533005 699587631 699543304 699341888
$$ packed form
1896.9G01324158P42492R0409r8572J49002M36020m51202N950j39007l7079J24207
1906.6G02146378L0670K84576J19782j38245n07355M88739p705K03323O7291o8741
1916.2G02618713J763840j786880j843415J124802L85361N12695k35748q79212J27793
1924.9G01787949L91082n3100J19934K365K09656Q9264l34854J79214m00925K7237
1934.6G02017822p6141m37088j2055L1662L38288L6163J194611n8747k474517K68020
1944.2G00828018Q50983K6321l84140j48773j83716k81296O0578J57013k15149o6147
1953.8G00643692L82843k66190r8037j40915k34146n6992k20032j52664j40686N06287
1963.5G00223160p3166L0441N78461k70920n14297m21601M7989o7062N4626m4327k01416
$$ plain form
1974.1 699341888 699400177 699211578 699117508 698621292 698535080 698775406 699227524 699581833 699285431 699247971
1983.7 699247971 698636246 698295517 698206406 698089752 697749634 697038574 697779388 698382721 697549667 697077942
1993.4 697077942 697780380 698139267 697889786 697801590 697271423 697181168 697277069 697138062 696847839 696658859
2003 696658859 696533813 696378326 696573868 696354752 696328735 696080780 695613098 695516052 695305252 695163193
2012.7 695163193 694906464 694926682 695073471 695125732 694691162 694663086 694818268 694211273 694238205 694366608
2022.3 694366608 694466095 694182205 693775024 693582840 693169098 693256836 692941971 692773743 692615585 692537079
2032 692537079 692830658 692527466 692314682 692115784 691712723 690822449 690466690 690796509 691142044 691098557
2041.6 691098557 690639801 691050568 690903244 690801010 690841675 690397339 690310669 689876862 689764633 689616928
$$ packed form
1974.1F99341888N8289j88599r4070m96216q6212K40326M52118L54309k96402l7460
1983.7F99247971o11725l40729q9111j16654l40118p11060P40814O03333q33054m71725
1993.4F97077942P02438L58887k49481q8196n30167r0255R5901j39007k90223j88980
2003F96658859j25046j55487J95542k19116k6017k47955m67682r7046k10800j42059
2012.7F95163193k56729K0218J46789N2261m34570k8076J55182o06995K6932J28403
2022.3F94366608R9487k83890m07181j92184m13742Q7738l14865j68228j58158p8506
2032F92537079K93579l03192k12784j98898m03061q90274l55759L29819L45535m3487
2041.6F91098557m58756M10767j47324j02234M0665m44336q6670m33807j12229j47705
$$ plain form
2051.2 689616928 689781342 689881287 689389114 689263535 689182281 689528198 689757309 689647293 689139633 688793488
2060.9 688793488 688807907 688502808 688451004 688439713 688334885 688144379 688500061 688521042 688123169 688305893
2070.5 688305893 688333282 688521042 688362198 688067322 687621002 687203217 687132187 686939392 687255630 687380676
2080.2 687380676 687307281 686830902 686714096 687034836 686750183 686600952 686218109 686174316 686061935 685743408
2089.8 685743408 685618286 685621338 685761032 685296097 685259476 685114441 685066071 685318985 685216522 685125656
2099.5 685125656 684502182 684363708 684383316 684100876 683997192 683937607 683901596 683788757 683768005 683690033
2109.1 683690033 683723373 683549500 683531952 683362579 683287277 683553314 683020477 682864609 682834167 682638016
2118.7 682638016 682295761 682286911 682582169 681923904 681756744 681729050 681839905 682186661 682011032 681903152
$$ packed form
2051.2F89616928J64414R9945m92173j25579q1254L45917K29111j10016n07660l46145
2060.9F88793488J4419l05099n1804j1291j04828j90506L55682K0981l97873J82724
2070.5F88305893K7389J87760j58844k94876m46320m17785p1030j92795L16238J25046
2080.2F87380676p3395m76379j16806L20740k84653j49231l82843m3793j12381l18527
2089.8F85743408j25122L052J39694m64935l6621j45035m8370K52914j02463r0866
2099.5F85125656o23474j38474J9608k82440j03684n9585l6011j12839k0752p7972
2109.1F83690033L3340j73873j7548j69373p5302K66037n32837j55868l0442j96151
2118.7F82638016l42255q850K95258o58265j67160k7694J10855L46756j75629j07880
$$ plain form
2128.4 681903152 681935349 681880112 681472092 681697922 681498642 680949097 680936661 680695648 681002426 681519852
2138 681519852 681843948 681303177 680941772 681363525 681246185 681054230 680810013 680824203 680969162 680850067
2147.7 680850067 680412979 680501556 680757904 680459442 680698471 680731049 680853882 680815964 680720825 680824661
2157.3 680824661 680439453 680384445 679970093 679807663 679804382 679952850 680534744 680810318 681190948 681010818
2167 681010818 680941467 680704651 680315399 680106430 679906311 680306854 680183029 680358505 680758667 680774307
2176.6 680774307 680776749 680686035 680789795 680813904 681061630 680841980 680283585 680000229 680078201 680199203
2186.3 680199203 680016937 680369949 680769501 680990601 681003036 681117172 680998917 680635605 680824203 680795593
2195.9 680795593 680900574 680713730 680581055 680832748 680770340 680717850 680723419 681137924 681180038 681070404
$$ packed form
2128.4F81903152L2197n5237m08020K25830j99280n49545j2436k41013L06778N17426
2138F81519852L24096n40771l61405M21753j17340j91955k44217J4190J44959j19095
2147.7F80850067m37088Q8577K56348k98462K39029L2578J22833l7918r5139J03836
2157.3F80824661l85208n5008m14352j62430l281J48468N81894K75574L80630j80130
2167F81010818o9351k36816l89252k08969k00119M00543j23825J75476M00162J5640
2176.6F80774307K442r0714J03760K4109K47726k19650n58395k83356P7972J21002
2186.3F80199203j82266L53012L99552K21100J2435J14136j18255l63312J88598k8610
2195.9F80795593J04981j86844j32675K51693o2408n2490N569M14505M2114j09634
$$ plain form
2205.5 681070404 680759506 680339813 680565414 680616379 680571060 680503311 680870590 680990906 680635452 680565567
2215.2 680565567 680739136 681154480 681139069 681265106 681255341 681024551 680736313 680434189 680596237 680525742
2224.8 680525742 680699768 680840836 680819473 680688324 680799179 681263046 681114883 681025162 680592194 680261230
2234.5 680261230 680335388 680402832 680372772 680087509 680406418 680425797 680331268 680460968 680375366 680363159 680589218
2245.1 680589218 681063690 680986328 680535889 680052948 680108643 680177231 680068207 680484619 680675278 680576935
2254.7 680576935 680438995 680745621 680714874 680606384 680667038 680497589 680749664 680332642 679994354 679940262
2264.4 679940262 680336914 680745850 680359497 680622864 680415039 680309906 680435638 680353394 680551758 680297394
2274 680297394 680268173 680165405 679892502 679756165 680070496 680104370 679921341 680212250 680127945 680154266 679821091
$$ packed form
2205.5F81070404l10898m19693K25601N0965m5319o7749L67279J20316l55454o9885
2215.2F80565567J73569M15344j5411J26037r765k30790k88238l02124J62048p0495
2224.8F80525742J74026J41068k1363j31149J10855M63867j48163q9721m32968l30964
2234.5F80261230P4158O7444l0060k85263L18909J9379r4529J29700q5602j2207K26059
2245.1F80589218M74472p7362m50439m82941N5695O8588j09024M16412J90659r8343
2254.7F80576935j37940L06626l0747j08490O0654j69449K52075m17022l38288n4092
2264.4F79940262L96652M08936l86353K63367k07825j05133J25732q2244J98364k54364
2274F80297394k9221j02768k72903j36337L14331L3874j83029K90909q4305K6321l33175
$$ plain form
2284.6 679821091 679782257 679828110 679890518 680523987 680162735 680008087 679997177 680177917 680427933 680494232
2294.3 680494232 680994873 680896454 681228561 681284256 681337662 681646118 681327209 681693344 681892700 681938095
2303.9 681938095 682205734 682832947 683277817 683491745 684462128 685102539 685643539 685528793 684957581 684969559
2313.5 684969559 685425415 686328888 686522675 686820221 687626801 688319321 688884430 689405441 690383606 690938034
2323.2 690938034 690978241 690951920 691347275 692504654 693391190 693801422 693819733 693606873 693363266 692885361
2332.8 692885361 693014069 693970184 695204315 695300369 694178085 694781876 695535202 694979324 695125427
2341.5 695125427 694983597 693986282 693189774 692206955 691343307 689731598 686508408 686299286 689543076
2350.2 689543076 691507416 693186188 694785538 695199814 696856232 699377518 701759186 700795670 700235291
$$ packed form
2284.6F79821091l8834M5853O2408O33469l61252j54648j0910J80740K50016O6299
2294.3F80494232N00641r8419L32107N5695N3406L08456l18909L66135J99356M5395
2303.9F81938095K67639O27213M44870K13928R70383O40411N41000j14746n71212J1978
2313.5F84969559M55856R03473J93787K97546Q06580O92520N65109N21011R78165N54428
2323.2F90938034M0207k6321L95355J157379Q86536M10232J8311k12860k43607m77905
2332.8F92885361J28708R56115J234131R6054j122284O03791P53326n55878J46103
2341.5F95125427j41830r97315p96508r82819q63648j611709l223190k09122L243790
2350.2F89543076J964340J678772J599350M14276J656418K521286K381668r63516n60379
$$ plain form
2358.9 700235291 700112228 700036163 701087189 700880814 699960480 696655350 695035324 694767227 694132996
2367.6 694132996 692820435 689470825 687819214 687857513 687617416 685876312 684153519 683074112 681300888
2376.2 681300888 679803772 678380356 677121353 676241531 675093002 673790817 673143311 672665405 671803207
2384.9 671803207 671340485 671183395 671080933 670617142 670293198 670198288 669915161 670119476 670037918 669777145
2394.6 669777145 669907150 670051651 669538422 668696365 668559799 668578873 668676834 668751526 668731232 668384476
2404.2 668384476 667952042 667993622 667904205 667909164 667807388 667695999 667271423 666569824 666448212 666185608
2413.8 666185608 666091843 666303101 666260376 666075134 666133499 666129761 665624237 665181503 665084763 665004501 664455338
2424.5 664455338 664199448 664058533 663942108 664197311 663920822 663640060 663351288 663132324 662997513 663046112
$$ packed form
2358.9G00235291j23063p6065J051026k06375r20334l305130j620026k68097o34231
2367.6F94132996j312561l349610j651611L8299k40097j741104j722793j079407j773224
2376.2F81300888j497116j423416j259003q79822j148529j302185o47506m77906q62198
2384.9F71803207m62722j57090j02462m63791l23944r4910k83127K04315q1558k60773
2394.6F69777145J30005J44501n13229q42057j36566J9074R7961P4692k0294l46756
2404.2F68384476m32434M1580q9417M959j01776j11389m24576p01599j21612k62604
2413.8F66185608r3765K11258m2725j85242N8365l738n05524m42734r6740q0262n49163
2424.5F64455338k55890j40915j16425K55203k76489k80762k88772k18964j34811M8599
$$ plain form
2434.1 663046112 663342361 662920380 662721558 662599716 662148361 661749496 661479721 661390381 661127472 661092911
2443.7 661092911 661118088 661119232 660716019 660102158 659878922 659773788 659864807 659736481 659389801 658811646
2453.4 658811646 658656769 658686371 658288879 658150558 657868958 658030014 657947998 657305222 657415771 657308273
2463 657308273 656939392 657126846 657089462 656354675 656056747 655853348 655315094 655179749 654714966 654126892
2472.7 654126892 654097137 654310455 654408951 654192276 653611145 653197632 653177643 652815781 652185516 651576614
2482.3 651576614 651332474 651318741 651337280 651572113 651689529 651692963 651217880 650622253 650242691 649751358
2492 649751358 649525681 649313202 648949509 648835144 648601074 648183365 648297195 648173599 647664337 647561493
2501.6 647561493 647520447 647249374 646547394 646022720 645483475 644933167 644958038 645001755 645175247 645106125
$$ packed form
2434.1F63046112K96249m21981j98822j21842m51355l98865k69775q9340k62909l4561
2443.7F61092911K5177J144m03213o13861k23236j05134R1019j28326l46680n78155
2453.4F58811646j54877K9602l97492j38321k81600J61056q2016o42776J10549j07498
2463F57308273l68881J87454l7384p34787k97928k03399n38254j35345m64783n88074
2472.7F54126892k9755K13318R8496k16675n81131m13513j9989l61862o30265o08902
2482.3F51576614k44140j3733J8539K34833J17416L434m75083n95627l79562m91333
2492F49751358k25677k12479l63693j14365k34070m17709J13830j23596n09262j02844
2501.6F47561493m1046k71073p01980n24674n39245n50308K4871M3717J73492o9122
$$ plain form
2511.2 645106125 644657822 644006500 643526688 643664322 643582458 643126221 642769241 642686005 642402344 641993866
2520.9 641993866 641784821 641664963 641685944 641629257 641526871 641270905 641170120 641045914 640649719 640214920
2530.5 640214920 639516296 638811455 638281975 638290825 638484688 638484116 638362541 638245697 638341789 638014259 637392540
2541.1 637392540 636685867 636368103 636203003 635928650 636032829 635746803 635483475 635376205 635199966 635078697
2550.8 635078697 635166245 635262756 634402771 633626556 633494873 633629608 633457031 632943153 632778130 632622223
2560.4 632622223 632518692 632349739 632254105 631953430 631558380 631510277 631341629 631189995 631018105 630957336
2570.1 630957336 630269928 629524765 629677658 629653702 629409714 628994865 628560028 628250084 628092384 627828827
2579.7 627828827 627646484 627723274 627494354 627320671 626802330 626605911 626509285 625683899 625350800 625314140
$$ packed form
2511.2F45106125m48303o51322m79812J37634q1864m56237l56980q3236k83661m08478
2520.9F41993866k09045j19858K0981n6687j02386k55966j00785j24206l96195m34799
2530.5F40214920o98624p04841n29480Q850J93863n72j21575j16844R6092l27530o21719
2541.1F37392540p06673l17764j65100k74353J04179k86026k63328j07270j76239j21269
2550.8F35078697Q7548R6511q59985p76215j31683J34735j72577n13878j65023j55907
2560.4F32622223j03531j68953r5634l00675l95050m8103j68648j51634j71890o0769
2570.1F30957336o87408p45163J52893k3956k43988m14849m34837l09944j57700k63557
2579.7F27828827j82343P6790k28920j73683n18341j96419r6626q25386l33099l6660
$$ plain form
2589.4 625314140 625110016 624901237 625262146 625258484 624558449 624275513 624062653 623857918 623277512 623008537
2599 623008537 622861214 622044106 621656532 621515579 621397324 621550217 621538010 621130867 621058006 620631104
2608.6 620631104 619775124 619662056 619344292 618972054 618512459 617935257 617864571 617766953 617727737 617664032
2618.3 617664032 617299042 616788101 616584015 616287003 615913391 615540314 614858856 614659081 614607430 614679260
2627.9 614679260 614709167 614452667 613996201 613510895 613704185 613225937 612405663 612121735 611816940 611492882
2637.6 611492882 610873337 610727272 610738831 610386505 610286293 610135536 609923744 609933434 609793701 609187050
2647.2 609187050 608309898 607507820 607187195 607106743 606889305 606573944 606608505 606630287 605931664 605624657
2656.9 605624657 605643806 605391197 605008507 604547081 604327812 603904495 603593025 603583984 603399239 603064423
$$ packed form
2589.4F25314140k04124k08779L60909l662p00035k82936k12860k04735n80406k68975
2599F23008537j47323q17108l87574j40953j18255J52893j2207m07143p2861m26902
2608.6F20631104q55980j13068l17764l72238m59595n77202p0686r7618l9216o3705
2618.3F17664032l64990n10941k04086k97012l73612l73077o81458j99775n1651P1830
2627.9F14679260K9907k56500m56466m85306J93290m78248q20274k83928l04795l24058
2637.6F11492882o19545j46065J1559l52326j00212j50757k11792R690j39733o06651
2647.2F09187050q77152q02078l20625q0452k17438l15361L4561K1782o98623l07007
2656.9F05624657J9149k52609l82690m61426k19269m23317l11470r041j84745l34816
$$ plain form
2666.5 603064423 602729416 602674789 602733574 602500076 601929016 601395454 601046524 600834885 600562439 600583992
2676.1 600583992 600527458 599856720 599844589 599984131 599599419 599193993 599080048 599065895 598503723 597983322
2685.8 597983322 597388382 597045975 597152977 597006912 596854515 596652107 596498680 596352272 596200180 595833473
2695.4 595833473 595315971 594786873 594455490 594386597 593762093 593494835 593490486 593371506 593322258 592853050
2705.1 592853050 592524223 592345924 592389107 592224464 592208366 592172928 591382065 590779305 590020027 589653206
2714.7 589653206 589708595 589809265 590004463 589841080 589835091 589610023 589376335 589132004 588976517 588794861
2724.4 588794861 588138084 587929993 587821732 587776413 587508698 587084618 586996460 586795692 586749001 586485176
2734 586485176 586184654 586010323 585957680 586091537 585813522 585474129 585179672 584840355 584803276 584990234
$$ packed form
2666.5F03064423l35007n4627N8785k33498n71060n33562l48930k11639k72446K1553
2676.1F00583992n6534o70738j2131J39542l84712m05426j13945j4153n62172n20401
2685.8E97983322n94940l42407J07002j46065j52397k02408j53427j46408j52092l66707
2695.4E95833473n17502n29098l31383o8893o24504k67258m349j18980m9248m69208
2705.1E92853050l28827j78299M3183j64643j6098l5438p90863o02760p59278l66821
2714.7E89653206N5389J00670J95198j63383n989k25068k33688k44331j55487j81656
2724.4E88794861o56777k08091j08261m5319k67715m24080q8158k00768m6691k63825
2734E86485176l00522j74331n2643J33857k78015l39393k94457l39317l7079J86958
$$ plain form
2743.7 584990234 584860344 584685364 584726219 584554939 584409180 584310150 583895836 583165627 582567291 582256584
2753.3 582256584 582560577 583051605 582943459 582945557 582832108 582450981 582230797 581923218 581120796 580469093
2762.9 580469093 580802612 581003036 580879822 580616951 580319138 580314484 580105400 579909821 579747467 579804802
2772.6 579804802 579975739 579778900 579133377 578280487 577688675 577048111 576631279 576662941 576872063 576760597
2782.2 576760597 576376610 576427994 576236191 575538750 575105476 575259514 575199585 574799156 574558334 573975716
2791.9 573975716 573451538 573376923 573393402 573096924 572763443 572834167 572517014 571492958 570793266 570780067
2801.5 570780067 570199471 569379463 569065094 568775902 568685188 568445396 568140526 567849503 567327156 567125053
2811.2 567125053 566899796 566352730 565858879 565208702 564609871 564328003 563730469 563112793 562723846 562300987
$$ packed form
2743.7E84990234j29890j74980M0855j71280j45759r9030m14314p30209n98336l10707
2753.3E82256584L03993M91028j08146K098j13449l81127k20184l07579q02422o51703
2762.9E80469093L33519K00424j23214k62871k97813m654k09084j95579j62354N7335
2772.6E79804802J70937j96839o45523q52890n91812o40564m16832L1662K09122j11466
2782.2E76760597l83987N1384j91803o97441m33274J54038n9929m00429k40822n82618
2791.9E73975716n24178p4615J6479k96478l33481P0724l17153j024056o99692j3199
2801.5E70780067n80596q20008l14369k89192r0714k39792l04870k91023n22347k02103
2811.2E67125053k25257n47066m93851o50177n98831k81868n97534o17676l88947m22859
$$ plain form
2820.8 562300987 561939659 561729279 561729126 561044388 560203934 559918900 559423714 558660316 557713280 557253571
2830.4 557253571 556878738 556174812 555684700 554860535 554229927 554097099 553669701 552850037 551853752 551027565
2840.1 551027565 550264664 548994102 547508698 546426964 545313835 543845711 542305450 541012077
2847.8 541012077 539797821 538386536 537438736 536735382 535579147 534777946 534687271 534661942 534580421 534660263
2857.4 534660263 534908791 534695053 534298973 534690094 534906693 534820251 535026398 534757385 534016228 533156242
2867.1 533156242 532365685 531876793 531629372 531160049 530715370 530776291 530529289 530148621 529927559 529264603
2876.7 529264603 528620758 528350830 527984085 527300529 526672897 526484680 526200676 525668449 525531197 525125084
2886.4 525125084 524401627 524058838 523713608 523121681 522206192 521581383 521155434 520548553 520065002 519215050
$$ packed form
2820.8E62300987l61328k10380j53o84738q40454k85034m95186p63398r47036m59709
2830.4E57253571l74833p03926m90112q24165o30608j32828m27398q19664r96285q26187
2840.1E51027565p62901j270562j485404j081734j113129j468124j540261j293373
2847.8E41012077j214256j411285r47800p03354j156235q01201r0675k5329q1521P9842
2857.4E34660263K48528k13738l96080L91121K16599q6442K06147k69013p41157q59986
2867.1E33156242p90557m88892k47421m69323m44679O0921k47002l80668k21062o62956
2876.7E29264603o43845k69928l66745o83556o27632j88217k84004n32227j37252m06113
2886.4E25125084p23457l42789l45230n91927r15489o24809m25949o06881m83551q49952
$$ plain form
2896 519215050 518554802 518542290 518091927 516962967 516401711 516338387 515960274 515715141 515131950 514084969
2905.7 514084969 513339767 513016739 512659187 512038689 511318474 510493126 509931107 509049797 507906914
2914.3 507906914 506947937 505872841 505093727 504017982 502567635 501718063 501559677 501311378 500982018
2923 500982018 500771942 500640106 501011658 500619164 500215149 500797234 501152840 501400681 501636238 501913986
2932.7 501913986 501790962 501949959 502720451 503044357 503218269 503606377 504607201 505224876 505322609 505727768
2942.3 505727768 506152382 506443024 506501389 507200317 507748260 507901344 508320465 508180504 508094101 508269997
2952 508269997 508668594 508725777 508259697 508634872 509264603 509534225 509834938 510424805 511087036 511309319
2961.6 511309319 511218643 511033936 511260719 511697235 511731033 512032585 512609901 513007545 513495064 514135094
$$ packed form
2896E19215050o60248j2512m50363j128960n61256o3324l78113k45133n83191j046981
2905.7E14084969p45202l23028l57552o20498p20215q25348n62019q81310j142883
2914.3E07906914r58977j075096p79114j075745j450347q49572j58386k48299l29360
2923E00982018k10076j31836L71552l92494m04015N82085L55606K47841K35557K77748
2932.7E01913986j23024J58997P70492L23906J73912L88108J000824O17675R7733M05159
2942.3E05727768M24614K90642N8365O98928N47943J53084M19121j39961q6403J75896
2952E08269997L98597N7183m66080L75175O29731K69622L00713N89867O62231K22283
2961.6E11309319r0676j84707K26783M36516L3798L01552N77316L97644M87519O40030
$$ plain form
2971.2 514135094 514944496 515411110 515542107 515711136 515714798 515882111 516186256 516682243 517169533 517261238
2980.9 517261238 517284279 517365227 517377052 517050018 516976204 517476387 518017159 518012733 517656364 517798462 518051186
2991.5 518051186 518141823 517843819 517323151 517079544 517096710 517353592 517101479 516833725 516693878 516221390
3001.1 516221390 515884705 515589180 515540581 515175247 514396782 514169960 514022255 513836784 514083443 514123535
3010.8 514123535 513842125 513453674 513055573 513184547 512666054 511496315 510677490 509967079 509928513 509936905
3020.4 509936905 509554863 509039803 508550949 508541069 508205109 507428894 506716652 506320496 506399994 506319847
3030.1 506319847 505604401 505037766 504919701 504236488 503456001 503356781 503305740 502946701 502710342 502314262
3039.7 502314262 501503487 500889549 500361176 499883118 499382591 498868790 498040428 497113266 496984367 496668396
$$ packed form
2971.2E14135094Q09402M66614J30997J69029L662J67313L04145M95987M87290R1705
2980.9E17261238K3041Q0948J1825l27034p3814N00183N40772m426l56369J42098K52724
2991.5E18051186R0637k98004n20668k43607J7166K56882k52113k67754j39847m72488
3001.1E16221390l36685k95525m8599l65334p78465k26822j47705j85471K46659M0092
3010.8E14123535k81410l88451l98101J28974n18493j169739q18825p10411l8566Q392
3020.4E09936905l82042n15060m88854r880l35960p76215p12242l96156P9498q0147
3030.1E06319847p15446n66635j18065o83213p80487r9220n1041l59039k36359l96080
3039.7E02314262q10775o13938n28373m78058n00527n13801q28362r27162j28899l15971
$$ plain form
3049.4 496668396 496415482 496390915 495803261 495204849 494583015 494031143 493630219 493298416 492912483 492544479
3059 492544479 492134590 491459427 491142616 491042824 490723877 490028343 489539604 489271622 488641129 488450470
3068.6 488450470 488417320 487973366 487213249 486563873 486466866 486162338 485542603 485480232 485863647 485369644
3078.3 485369644 484242401 483784599 483519287 483038673 482508545 481818810 481590309 481497879 480833015 480404282
3087.9 480404282 480116768 480103302 480131378 479406815 478769035 478098755 477586365 477414093 477126312 476869659
3097.6 476869659 476689796 476553040 475781288 475083008 474503822 473890495 474101257 474179077 473845177 473164520
3107.2 473164520 472557144 472093887 471248055 470669861 470335884 470081444 469662704 469122124 468791313 468799591
3116.9 468799591 468852005 468115692 467293167 467168999 466927605 465933762 465228271 465021248 464514046 463904419
$$ packed form
3049.4D96668396k52914k4567n87654n98412o21834n51872m00924l31803l85933l68004
3059D92544479m09889o75163l16811r9792l18947o95534m88739k67982o30493j90659
3068.6D88450470l3150m43954p60117o49376r7007l04528o19735o2371L83415m94003
3078.3D85369644j127243m57802k65312m80614n30128o89735k28501r2430o64864m28733
3087.9D80404282k87514j3466K8076p24563o37780o70280n12390j72272k87781k56653
3097.6D76869659j79863j36756p71752o98280n79186o13327K10762P7820l33900o80657
3107.2D73164520o07376m63257q45832n78194l33977k54440m18740n40580l30811Q278
3116.9D68799591N2414p36313q22525j24168k41394r93843p05491k07023n07202o09627
$$ plain form
3126.5 463904419 463180962 462642975 462389297 462203712 462011375 461769829 461134071 459866676 459041557
3135.2 459041557 458665695 458491058 458556099 458461876 457986603 457137642 456480446 455917168 455724564 455295258
3144.8 455295258 454143219 454047775 454283638 453534050 452737389 452314339 452083397 451692352 450990677 450579720
3154.5 450579720 450438156 449850693 448993835 448583031 448286133 447673492 447325592 446757126 445930023 445270844
3164.1 445270844 444667664 444655838 444289246 443510475 443103523 442923775 442625732 441537209 440302849
3172.8 440302849 439545441 439522438 439511909 439523087 439595718 438626137 437951393 437310219 436776009 436779137 436276703
3183.4 436276703 435789871 434968262 434120827 433884163 433944283 433290710 432197418 431931534 431525726 431041145
3193 431041145 430810509 430580025 429982452 429614143 429574814 428606262 428066139 427586098 426854858 426540833
$$ packed form
3126.5D63904419p23457n37987k53678j85585j92337k41546o35758j267395q25119
3135.2D59041557l75862j74637O5041r4223m75273q48961o57196n63278j92604m29306
3144.8D55295258j152039r5444K35863p49588p96661m23050k30942l91045p01675m10957
3154.5D50579720j41564n87463q56858m10804k96898o12641l47900n68466q27103o59179
3164.1D45270844o03180j1826l66592p78771m06952j79748k98043j088523j234360
3172.8D40302849p57408k3003j0529J1178P2631r69581o74744o41174n34210L128n02434
3183.4D36276703m86832q21609q47435k36664O0120o53573j093292k65884m05808m84581
3193D31041145k30636k30484n97573l68309l9329r68552n40123m80041p31240l14025
$$ plain form
3202.7 426540833 426290398 426328011 425882034 425331306 424680252 424037170 423652344 422850075 422410507 422215767
3212.3 422215767 421997948 421675301 421026421 420220451 419960022 420322990 419871178 418930244 418329353 417964859
3222 417964859 417801895 417656670 417356148 417083969 416366043 415263977 415359230 415348587 414575920 414365883
3231.6 414365883 414409447 414056931 412917404 412296104 412173843 411437492 410874290 410791092 410636330 410243645
3241.3 410243645 410069313 409950104 409776421 409337120 408677673 408361740 408151550 407811966 407188873 406803513
3250.9 406803513 406228180 405453758 405442810 405410614 405263100 405017700 404598007 404597931 404518051 403810768 403207932
3261.5 403207932 402966080 402478180 402026520 401446724 401180038 401467628 400870628 400162392 400555191 400712204
3271.2 400712204 400133247 399897995 399651527 398944435 398089371 397653809 397711105 397566452 397757301 397586250
$$ packed form
3202.7D26540833k50435L7613m45977n50728o51054o43082l84826q02269m39568j94740
3212.3D22215767k17819l22647o48880q05970k60429L62968m51812r40934o00891l64494
3222D17964859j62964j45225l00522k72179p17926j102066R5253j0643p72667k10037
3231.6D14365883M3564l52516j139527o21300j22261p36351n63202q3198j54762l92685
3241.3D10243645j74332j19209j73683m39301o59447l15933k10190l39584o23093l85360
3250.9D06803513n75333p74422j0948l2196j47514k45400m19693p6p9880p07283o02836
3261.5D03207932k41852m87900m51660n79796k66686K87590n97000p08236L92799J57013
3271.2D00712204n78957k35252k46468p07092q55064m35562N7296j44653J90849j71051
$$ plain form
3280.8 397586250 397067757 396958809 396599617 396387825 395769234 395177841 395466576 395785370 395572166 394864349
3290.4 394864349 394573174 394279976 393975258 393801842 393256340 393116798 392853241 392315292 392086182 391973152
3300.1 391973152 391985283 391987076 391640167 390837173 390439568 390200577 389303551 388593063 388765526 389203873
3309.7 389203873 389094086 388732491 388086853 387129669 386648102 386352234 386071701 386003571 385682831 385120316
3319.4 385120316 384734573 384570694 384371223 383936958 383443680 383380203 383183136 382213097 381658325 381469498
3329 381469498 380942993 380863037 380579948 379547958 378873367 378672523 378428001 377913818 377153091 376543999
3338.7 376543999 375939560 375529556 375799522 375597992 374641228 374205132 374224892 373848686 373035164 372742043
3348.3 372742043 373093033 373195801 372647896 371627388 370825958 370528946 370400848 370318222 370158424 369645195
$$ packed form
3280.8C97586250n18493j08948l59192k11792o18591n91393K88735L18794k13204p07817
3290.4C94864349k91175k93198l04718j73416n45502j39542k63557n37949k29110j13030
3300.1C91973152J2131J793l46909q02994l97605k38991q97026p10488J72463M38347
3309.7C89203873j09787l61595o45638r57184m81567k95868k80533o8130l20740n62515
3319.4C85120316l85743j63879j99471m34265m93278o3477j97067r70039n54772j88827
3329C81469498n26505p9956k83089j031990o74591k00844k44522n14183p60727o09092
3338.7C76543999o04439m10004K69966k01530r56764m36096J9760l76206q13522k93121
3348.3C72742043L50990J02768n47905j020508q01430k97012j28098q2626j59798n13229
$$ plain form
3357.9 369645195 369149208 369033966 369054337 368766747 368376312 368477783 368086624 367336235 367118568 366842957
3367.6 366842957 366386566 365969353 365902100 365248032 364599686 365006943 365354691 365741920 365174065 364241562
3377.2 364241562 364121170 363641205 363546104 363569641 363090286 362753906 362792892 362840042 362228279 361787949
3386.9 361787949 361755791 361767502 361902580 361734734 361376343 361029243 360554047 360434647 360776329 361027679
3396.5 361027679 360872803 360719681 360977821 360594292 359874916 359790840 359536095 359346581 359308701 359304733
3406.2 359304733 359649658 359734612 359177513 358563652 358635750 358777809 358675995 358903465 358953362 358488808
3415.8 358488808 358249931 358303719 358589973 358985786 358715286 358516846 358486633 358405533 358591614 358608437
3425.5 358608437 358980331 359339523 359064064 358812561 358847923 358666267 358875351 359578171 359576797 359790459
$$ packed form
3357.9C69645195m95987j15242K0371k87590l90435J01471l91159p50389k17667k75611
3367.6C66842957m56391m17213o7253o54068o48346M07257L47748L87229n67855r32503
3377.2C64241562j20392m79965r5101K3537m79355l36380L8986M7150o11763m40330
3386.9C61787949l2158J1711J35078j67846l58391l47100m75196j19400L41682K51350
3396.5C61027679j54876j53122K58140l83529p19376q4076k54745j89514l7880l968
3406.2C59304733L44925Q4954n57099o13861P2098J42059j01814K27470M9897m64554
3415.8C58488808k38877N3788K86254L95813k70500j98440l0213q1100J86081J6823
3425.5C58608437L71894L59192k75459k51503L5362j81656K09084P02820j374K13662
$$ plain form
3435.1 359790459 359893608 359908714 360556374 360690460 360409431 360050201 360030556 359831810 360063019 360863609
3444.7 360863609 361446037 362228432 361391869 360958481 361917458 362615700 363403358 363554611 363330231 363236656
3454.4 363236656 363721046 364267006 364288330 364693871 365455437 366069336 365948486 366010742 366082764 366094971
3464 366094971 366570816 367005653 367876396 368242302 368518143 368952141 369019814 369581947 369881401 370161133
3473.7 370161133 370810814 371273689 371774979 372003212 372033615 372686043 373395042 373880196 374255409 374222069
3483.3 374222069 374974518 375721359 376197739 376964836 376714516 376456947 377285614 378226471 378287354 378306541
3493 378306541 379311485 380330086 380542259 380993004 382169189 382606926 382712059 382903824 383629303
3501.6 383629303 384397621 384007454 384569092 385661697 386472893 386782379 387462082 388334084 387687759
$$ packed form
3435.1C59790459J03149J5106O47660J34086k81029l59230j9645j98746K31209Q00590
3444.7C60863609N82428P82395q36563m33388R58977O98242P87658J51253k24380r3575
3454.4C63236656M84390N45960K1324M05541P61566O13899j20850O2256P2022J2207
3464C66094971M75845M34837Q70743L65906K75841M33998O7673N62133K99454K79732
3473.7C70161133O49681M62875N01290K28233L0403O52428P08999M85154L75213l3340
3483.3C74222069P52449P46841M76380P67097k50320k57569Q28667R40857O0883J9187
3493C78306541J004944J018601K12173M50745J176185M37737J05133J91765P25479
3501.6C83629303P68318l90167N61638J092605Q11196L09486O79703Q72002o46325
$$ plain form
3510.3 387687759 387993584 388621101 389088402 389803772 390370407 391318588 392123375 393031197 393619766 393895340
3520 393895340 394500732 396211395 397485466 396502991 396581764 397528343 398474350 399009895 399462051 400006447
3529.6 400006447 400165253 400554810 400833549 401920471 403092613 404809036 405706558 404566994 405520973
3538.3 405520973 407046051 407814522 407924843 408634720 409805794 410841599 412078018 411646843 412382011
3547 412382011 412441216 412974167 414565620 415812492 417936897 417251282 417701340 418853531 419806709
3555.6 419806709 421633644 421381607 422658577 424418335 425155945 425067978 426318436 427984734 427799530
3564.3 427799530 431740112 432938423 431263390 432067032 430544243 432833214 434505501 435709038
3572 435709038 437001266 437962532 439077606 440084648 442067986 442016525 443191986 445017204 445336189
$$ packed form
3510.3C87687759L05825O27517M67301P15370N66635R48181Q04787R07822N88569K75574
3520C93895340O05392J710663J274071r82475P8773R46579R46007N35545M52156N44396
3529.6D00006447J58806L89557K78739J086922J172142J716423Q97522j139564R53979
3538.3D05520973J525078P68471J10321P09877J171074J035805J236419m31175P35168
3547D12382011N9205N32951J591453J246872K124405o85615M50058J152191R53178
3555.6D19806709J826935k52037J276970J759758P37610q7967J250458J666298j85204
3564.3D27799530L940582J198311j675033Q03642j522789K288971J672287J203537
3572D35709038J292228R61266J115074J007042J983338n1461J175461J825218L18985
$$ plain form
3580.7 445336189 446153526 447598152 449366798 449773064 453564034 456449738 454492989 455682983 453835869
3589.4 453835869 455219383 458260612 461426620 462520561 462118187 465736504 464531898 464970741 468112640
3598.1 468112640 468507156 470918121 471823120 471958885 473337440 474205627 475455399 478800278 481896362
3606.8 481896362 479940147 483240738 484114532 481734314 488436928 490783768 486793747 489508934
3614.5 489508934 488799286 491900520 497509689 498741837 500397682 499113655 498886261 502062225 504447250
3623.1 504447250 505847855 507662163 510244484 512503967 518950043 523431969 511144791 512452393
3630.9 512452393 516945381 522369308 524138680 521843758 523713036 526960640 529681320 529984818
3638.6 529984818 530588074 533055725 535971870 537209625 537638817 540165787 543632126 549880219 550469017
$$ packed form
3580.7D45336189Q17337J444626J768646M06266L790970K885704j956749J189994j847114
3589.4D53835869J383514L041229L166008J093941m02374L618317j204606M38843L141899
3598.1D68112640L94516K410965R04999J35765J378555Q68187J249772L344879L096084
3606.8D81896362j956215L300591Q73794k380218O702614K346840l990021K715187
3614.5D89508934p09648L101234N609169J232148J655845j284027k27394L175964K385025
3623.1E04447250J400605J814308K582321K259483O446076M481926j2287178J307602
3630.9E12452393M492988N423927J769372k294922J869278L247604K720680L03498
3638.6E29984818O03256K467651K916145J237755M29192K526970L466339O248093N88798
$$ plain form
3647.3 550469017 546560249 552631111 553496819 549660187 547467308 552191582 556748390 560795898
3655 560795898 567097816 559793472 559335747 564426270 566279526 567873764 568265953 570000687 571076584
3663.6 571076584 572371254 573973045 574149399 578623428 582960052 583140297 582968750 575102806 576727638
3672.3 576727638 585640450 595850906 598573875 579695778 579944458 586776276 590915947 589236069
3680 589236069 589573059 592035408 593392181 595392609 596060104 595153389 598906555 606986923 599834633
3688.7 599834633 593614426 601769218 597198830 595472031 600258141 600825233 602649117 603271484 602985649
3697.4 602985649 604215050 603770561 606097298 610377197 605934944 601746292 605440140 607477112
3705.1 607477112 607880363 608148499 610890846 616695099 610175934 611912918 616613884 601986237
$$ packed form
3647.3E50469017l908768O070862Q65708l836632k192879M724274M556808M047508
3655E60795898O301918p304344m57725N090523J853256J594238L92189J734734J075897
3663.6E71076584J294670J601791J76354M474029M336624J80245j71547p865944J624832
3672.3E76727638Q912812J0210456K722969j8878097K48680O831818M139671j679878
3680E89236069L36990K462349J356773K000428O67495r06715L753166Q080368p152290
3688.7E99834633o220207Q154792m570388j726799M786110N67092J823884O22367k85835
3697.4F02985649J229401m44489K326737M279899m442253m188652L693848K036972
3705.1F07477112M03251K68136K742347N804253o519165J736984M700966j4627647
$$ plain form
3712.8 601986237 604996147 609956818 610552254 610965462 613480415 615686798 611802368 611122932 617482338
3721.5 617482338 615443001 608685112 613672180 616333122 616099434 611789513 610532341 615162430
3729.2 615162430 616197319 621983032 620524025 611079521 620799561 625613480 615789757 613530807
3736.9 613530807 615541306 614898376 615706444 618200226 614507942 617793083 631260605 627056770
3744.7 627056770 604280167 611629181 617749443 625601845 625024376 611062012 621580048 618522377
3752.4 618522377 609439163 613867874 618659897 623265839 616909943 618488312 626130829 618223076
3760.1 618223076 614094505 617640038 618707275 618514633 622968330 621156540 615578918 618921509
3767.8 618921509 624118271 625865211 616355896 615957603 618926735 619228439 620450935 620490112 620925255
$$ packed form
3712.8F01986237L009910M960671N95436M13208K514953K206383l884430o79436O359406
3721.5F17482338k039337o757889M987068K660942k33688m309921j257172M630089
3729.2F15162430J034889N785713j459007r444504R720040M813919r823723k258950
3736.9F13530807K010499o42930Q08068K493782l692284L285141J3467522m203835
3744.7F27056770k2776603P349014O120262P852402n77469j3962364J0518036l057671
3752.4F18522377r083214M428711M792023M605942o355896J578369P642517p907753
3760.1F18223076m128571L545533J067237j92642M453697j811790n577622L342591
3767.8F18921509N196762J746940r509315l98293K969132L01704J222496L9177M35143
$$ plain form
3776.5 620925255 620997162 623725777 624430199 616217346 617704849 620292778 621802292 624514008 621641693
3785.2 621641693 620170441 621452217 621552048 621465111 621010437 621157837 621292305 621483192 620804214 621951485
3794.8 621951485 626529655 623876801 618708305 619789124 623273277 630915642 628225288 614855118
3802.5 614855118 616194916 618696060 624039116 631656952 623092499 615725632 619594421 621942444
3810.2 621942444 622360954 622357101 621703262 622859192 629978485 631998138 614619446 617487106 624214783
3818.9 624214783 629589272 635133667 618131371 615108109 619757156 621489143 623658447 624796181
3826.6 624796181 620863724 619830627 621564980 625615234 628718033 619476471 620586739 628463135
3834.3 628463135 623131485 621898766 631286392 623753853 616602287 624915619 620343437 618592072
$$ packed form
3776.5F20925255P1907K728615P04422q212853J487503K587929J509514K711716k872315
3785.2F21641693j471252J281776R9831q6937m54674J47400J34468J90887o78978J147271
3794.8F21951485M578170k652854n168496J080819L484153P642365k690354j3370170
3802.5F14855118J339798K501144N343056P617836q564453p366867L868789K348023
3810.2F21942444M18510l853o53839J155930P119293K019653j7378692K867660O727677
3818.9F24214783N374489N544395j7002296l023262M649047J731987K169304J137734
3826.6F24796181l932457j033097J734353M050254L102799r241562J110268P876396
3834.3F28463135n331650j232719R387626p532539p151566Q313332m572182j751365
$$ plain form
3842.1 618592072 626183929 624571037 619300117 621244278 622338982 622335472 624675102 624178543 625348473
3850.7 625348473 631382141 627547112 630913811 616981125 613314247 622540131 621396446 618892441
3858.4 618892441 621119308 623852272 627760506 622330399 620306206 628445702 625434494 617731476
3866.2 617731476 619527359 623727493 632171822 627932777 614703255 616976089 623295135 627429771
3873.9 627429771 617469635 617889709 621829910 620722466 622345200 627866478 624761429 616206398
3881.6 616206398 620734749 621378365 622125473 628191528 616658707 616887779 620890541 621155090 625527687
3890.3 625527687 626392403 617473373 617333908 620778999 619016037 619645195 621274414 624469299 627970352
3898.9 627970352 617192726 621128426 624695320 618863411 623718376 619962769 617197456 618747787
$$ packed form
3842.1F18592072P591857j612892n270920J944161J094704l510K339630m96559J169930
3850.7F25348473O033668l835029L366699j3932686l666878R225884j143685k504005
3858.4F18892441K226867K732964L908234n430107k024193Q139496l011208p703018
3866.2F17731476J795883M200134Q444329m239045j3229522K272834O319046M134636
3873.9F27429771r960136M20074L940201j107444J622734N521278l105049q555031
3881.6F16206398M528351O43616P47108O066055j1532821K29072M002762K64549M372597
3890.3F25527687Q64716q919030j39465L445091j762962O29158J629219L194885L501053
3898.9F27970352j0777626L935700L566894n831909M854965l755607k765313J550331
$$ plain form
3906.7 618747787 619193497 620993881 621219406 621111984 619742470 619080544 619961700 620105019 620474091
3915.3 620474091 621988869 619875908 616414948 620254555 620612564 616233826 618182602 620391693
3923.1 620391693 621827469 620513268 617110672 618055534 619905472 621075325 619872208 619247589 621487045
3931.7 621487045 619188576 616887512 618855019 619781837 619730186 619454536 618715286 618696861 618509674
3940.4 618509674 619553375 620916977 618012085 617348747 618273125 619080887 620616798 618030739 618059654
3949.1 618059654 619122810 616827393 618280563 618774910 617259026 616649437 617073517 618509293 618425789
3957.8 618425789 617820702 616684837 617384605 619116859 618141022 617959175 618346634 618403130 618221550
3966.5 618221550 617812271 618176193 617541504 616874733 617603722 617839241 617143822 616640968 616905403 617323952
$$ packed form
3906.7F18747787M45710J800384K25525j07422j369514o61926Q81156J43319L69072
3915.3F20474091J514778k112961l460960L839607L58009m378738J948776K209091
3923.1F20391693J435776j314201l402596R44862J849938J169853j203117o24619K239456
3931.7F21487045k298469k301064J967507R26818n1651k75650p39250j8425j87187
3940.4F18509674J043701J363602k904892o63338R24378Q07762J535911k586059K8915
3949.1F18059654J063156k295417J453170M94347j515884o09589M24080J435776q3504
3957.8F18425789o05087j135865O99768J732254r75837j81847L87459N6496j81580
3966.5F18221550m09279L63922o34689o66771P28989K35519o95419n02854K64435M18549
$$ plain form
3976.1 617323952 617386589 617288551 616944580 617007523 617374420 617375679 617059059 616683311 616499634 616384544
3985.7 616384544 617316284 617757454 617210159 617522659 616952438 616326790 616254158 616286812 617079163 616718407
3995.4 616718407 616018867 616005821 616020432 616492310 616911469
4000.2 616911469
$$ packed form
3976.1F17323952O2637r8038l43971O2943L66897J259l16620l75748j83677j15090
3985.7F16384544R31740M41170n47295L12500n70221o25648p2632L2654P92351l60756
3995.4F16718407o99540j3046J4611M71878M19159
4000.2F16911469
##END=$$ End of the data block
